{"text_format":"1","workbook":"xlsx","n_sheets":11,"sheets":["Info","Trial","Instructions","Setup","Classes","TB","IS","CFS","BS","DB","TBCheck"],"not_rendered":{"charts":11,"images":2,"macros":1,"external_links":0,"defined_names":35,"comments":0,"pivot_tables":0},"unopened":[],"bounds":{"document_bytes":16777216,"sheet_cells":100000,"rows_first":2000,"rows_last":500,"rows_between":2000,"halvings":0,"cell_chars":16384,"cell_head_chars":4096},"cells_cut":0,"cells_raw":0,"read":"whole","date_system":"1900"}

{"sheet":"Info","index":0,"n_rows":0,"n_cols":0,"rows_kept":0,"cut":false,"hidden":false,"merged":[]}

{"sheet":"Trial","index":1,"n_rows":0,"n_cols":0,"rows_kept":0,"cut":false,"hidden":true,"merged":[]}

{"sheet":"Instructions","index":2,"n_rows":212,"n_cols":1,"rows_kept":212,"cut":false,"hidden":true,"merged":[]}
["Excel Skills | Financial Analysis Template"]
["Instructions"]
["www.excel-skills.com"]
[]
["This template enables users to compare financial results for 3 annual periods. The user is required to add the appropriate annual trial balances to the template and to link each account on the trial balance to a pre-defined financial statement reporting class. The template produces automated financial reports consisting of an income statement, cash flow statement and balance sheet based on the linked trial balances and compares all amounts on the financial reports between annual periods in terms of the difference in value and percentage."]
[]
["The template includes the following sheets:"]
["Setup - enter your business name, select the year-end month and enter the reporting year. The business name is used as a heading on all the sheets and the reporting period selections are used to determine the annual periods which need to be included on the financial reports."]
["Classes - this sheet contains all the pre-defined reporting classes which should be used to link the trial balance accounts on the TB sheet to the calculations on the income statement, cash flow statement and balance sheet. The class descriptions included on this sheet are displayed on the financial statements and the sheet also includes error checking in the Status column which highlights errors in the linking of the reporting classes."]
["TB - a complete trial balance for each annual period should be included on this sheet and each account in the trial balance should be linked to a financial statement reporting class by entering or copying the appropriate class code into column B. The amounts included on the financial reports are automatically updated based on the classes specified on this sheet."]
{"$rows_left_out":203}
{"sheet":"Setup","index":3,"n_rows":24,"n_cols":4,"rows_kept":24,"cut":false,"hidden":true,"merged":[[9,1,9,2],[3,1,3,3]]}
[{"$f":"IF(ISBLANK($B$4),\"Example (Pty) Limited\",$B$4)","v":"Example (Pty) Limited"}]
["Setup"]
["© www.excel-skills.com"]
["Business Name","Example (Pty) Limited"]
[]
["Year End Month","2016-02-01"]
[]
["Reporting Year",2023,null,{"$f":"IF(ISBLANK($B$8),YEAR(TODAY()),$B$8)","v":2023}]
[]
["Year End Date",{"$f":"IF(ISBLANK($B$8)=TRUE,IF(ISBLANK($B$6)=TRUE,DATE(YEAR(TODAY()),MONTH(TODAY())+1,0),DATE(YEAR(TODAY()),MONTH($B$6)+1,0)),IF(ISBLANK($B$6)=TRUE,DATE($B$8,MONTH(TODAY())+1,0),DATE($B$8,MONTH($B$6)+1,0)))","v":"2023-02-28"}]
{"$rows_left_out":15}
{"sheet":"Classes","index":4,"n_rows":66,"n_cols":3,"rows_kept":66,"cut":false,"hidden":true,"merged":[]}
[{"$f":"IF(ISBLANK(Setup!$B$4),\"Example (Pty) Limited\",Setup!$B$4)","v":"Example (Pty) Limited"}]
["Default Reporting Classes"]
["© www.excel-skills.com"]
["Class","Description","Status"]
["Income Statement"]
["I-01G","Turnover",{"$f":"IF(ISNA(MATCH($A6,TBClass,0)),\"-\",IF(LEFT($A6,1)=\"I\",IF(ISNA(MATCH($A6,ISCode,0)),\"add!\",\"ok\"),IF(ISNA(MATCH($A6,BSCode,0)),\"add!\",\"ok\")))","v":"ok"}]
["I-02G","Cost of sales","ok"]
["I-03G","Operating expenses","-"]
["I-0301G","Accounting fees","ok"]
["I-0302G","Advertising & marketing","ok"]
{"$rows_left_out":57}
{"sheet":"TB","index":5,"n_rows":92,"n_cols":13,"rows_kept":92,"cut":false,"hidden":true,"merged":[]}
[{"$f":"IF(ISBLANK(Setup!$B$4),\"Example (Pty) Limited\",Setup!$B$4)","v":"Example (Pty) Limited"}]
["Trial Balance"]
["© www.excel-skills.com",null,null,null,{"$f":"IF(TBRowCount=0,0,ROUND(SUBTOTAL(9,OFFSET(E$4,1,0,TBRowCount,1)),2))","v":0},{"$f":"IF(TBRowCount=0,0,ROUND(SUBTOTAL(9,OFFSET(F$4,1,0,TBRowCount,1)),2))","v":0},{"$f":"IF(TBRowCount=0,0,ROUND(SUBTOTAL(9,OFFSET(G$4,1,0,TBRowCount,1)),2))","v":0},{"$f":"IF(TBRowCount=0,0,ROUND(SUBTOTAL(9,OFFSET(H$4,1,0,TBRowCount,1)),2))","v":0},{"$f":"IF(TBRowCount=0,0,ROUND(SUBTOTAL(9,OFFSET(I$4,1,0,TBRowCount,1)),2))","v":0},{"$f":"IF(TBRowCount=0,0,ROUND(SUBTOTAL(9,OFFSET(J$4,1,0,TBRowCount,1)),2))","v":0},{"$f":"IF(TBRowCount=0,0,ROUND(SUBTOTAL(9,OFFSET(K$4,1,0,TBRowCount,1)),2))","v":0},{"$f":"IF(TBRowCount=0,0,ROUND(SUBTOTAL(9,OFFSET(L$4,1,0,TBRowCount,1)),2))","v":0},{"$f":"IF(TBRowCount=0,0,ROUND(SUBTOTAL(9,OFFSET(M$4,1,0,TBRowCount,1)),2))","v":0}]
["Status","Class","Acc No","Account Description",2020,2021,2022,2023,2024,2025,2026,2027,2028]
[{"$f":"IF(ISNA(VLOOKUP($B5,ClassCode,1,0)),\"class!\",IF(LEFT($B5,1)=\"B\",IF(ISNA(VLOOKUP($B5,BSCode,1,0)),\"add!\",\"ok\"),IF(ISNA(VLOOKUP($B5,ISCode,1,0)),\"add!\",\"ok\")))","v":"ok"},"B-00G","BS-0005","Land & Buildings - Cost",2500000,2500000,2500000,2500000,0,0,0,0,0]
["ok","B-00G","BS-0010","Plant & Equipment - Cost",950300,1246045,1316045,1546045,0,0,0,0,0]
["ok","B-00G","BS-0015","Furniture & Fittings - Cost",285600,300000,350000,410000,0,0,0,0,0]
["ok","B-00G","BS-0020","Office Equipment - Cost",182630,225000,240000,240000,0,0,0,0,0]
["ok","B-00G","BS-0025","Computer Equipment - Cost",65880,120750,150500,165500,0,0,0,0,0]
["ok","B-00G","BS-0030","Motor Vehicles - Cost",318000,318000,318000,318000,0,0,0,0,0]
{"$rows_left_out":83}
{"sheet":"IS","index":6,"n_rows":45,"n_cols":10,"rows_kept":45,"cut":false,"hidden":true,"merged":[]}
[null,{"$f":"IF(ISBLANK(Setup!$B$4),\"Example (Pty) Limited\",Setup!$B$4)","v":"Example (Pty) Limited"}]
[null,{"$f":"\"Income statement for the period ended \"&TEXT(Setup!$B$10,\"dd mmmm yyyy\")","v":"Income statement for the period ended 28 February 2023"}]
[null,"© www.excel-skills.com"]
[null,null,{"$f":"IF(ISBLANK(Setup!$B$8),YEAR(TODAY()),Setup!$B$8)","v":2023},{"$f":"C4-1","v":2022},"Diff","Diff%",null,{"$f":"D4-1","v":2021},"Diff","Diff%"]
["I-01G",{"$f":"IF(ISNA(VLOOKUP($A5,ClassAll,COLUMN(Classes!$B$4),0)),\"No class!\",VLOOKUP($A5,ClassAll,COLUMN(Classes!$B$4),0))","v":"Turnover"},{"$f":"-IF(ISNA(MATCH(C$4,TBMonths,0))=TRUE,0,SUMIF(TBAll,$A5&\"*\",OFFSET(TB!$D$4,1,MATCH(C$4,TBMonths,0),TBRowCount,1)))","v":6911623},{"$f":"-IF(ISNA(MATCH(D$4,TBMonths,0))=TRUE,0,SUMIF(TBAll,$A5&\"*\",OFFSET(TB!$D$4,1,MATCH(D$4,TBMonths,0),TBRowCount,1)))","v":6242037},{"$f":"C5-D5","v":669586},{"$f":"IF(D5=0,IF(E5=0,0,-1),E5/ABS(D5))","v":0.10727043111086974},null,{"$f":"-IF(ISNA(MATCH(H$4,TBMonths,0))=TRUE,0,SUMIF(TBAll,$A5&\"*\",OFFSET(TB!$D$4,1,MATCH(H$4,TBMonths,0),TBRowCount,1)))","v":5201696},{"$f":"D5-H5","v":1040341},{"$f":"IF(H5=0,IF(I5=0,0,-1),I5/ABS(H5))","v":0.20000034604098355}]
["I-02G",{"$f":"IF(ISNA(VLOOKUP($A6,ClassAll,COLUMN(Classes!$B$4),0)),\"No class!\",VLOOKUP($A6,ClassAll,COLUMN(Classes!$B$4),0))","v":"Cost of sales"},{"$f":"IF(ISNA(MATCH(C$4,TBMonths,0))=TRUE,0,SUMIF(TBAll,$A6&\"*\",OFFSET(TB!$D$4,1,MATCH(C$4,TBMonths,0),TBRowCount,1)))","v":2881575},{"$f":"IF(ISNA(MATCH(D$4,TBMonths,0))=TRUE,0,SUMIF(TBAll,$A6&\"*\",OFFSET(TB!$D$4,1,MATCH(D$4,TBMonths,0),TBRowCount,1)))","v":2803264},{"$f":"D6-C6","v":-78311},{"$f":"IF(D6=0,IF(E6=0,0,-1),E6/ABS(D6))","v":-2.7935649300244288E-2},null,{"$f":"IF(ISNA(MATCH(H$4,TBMonths,0))=TRUE,0,SUMIF(TBAll,$A6&\"*\",OFFSET(TB!$D$4,1,MATCH(H$4,TBMonths,0),TBRowCount,1)))","v":2595869},{"$f":"H6-D6","v":-207395},{"$f":"IF(H6=0,IF(I6=0,0,-1),I6/ABS(H6))","v":-7.9894247359939968E-2}]
[null,"Gross profit",{"$f":"SUM(C5,-C6)","v":4030048},{"$f":"SUM(D5,-D6)","v":3438773},{"$f":"SUM(E5:E6)","v":591275},0.1719435973238129,null,{"$f":"SUM(H5,-H6)","v":2605827},{"$f":"SUM(I5:I6)","v":832946},0.31964746700375735]
[null,"Gross profit %",{"$f":"IF(C5=0,0,C7/C5)","v":0.5830827289046292},{"$f":"IF(D5=0,0,D7/D5)","v":0.5509055777785361},{"$f":"D8-C8","v":-3.2177151126093095E-2},null,null,{"$f":"IF(H5=0,0,H7/H5)","v":0.50095718780951448},{"$f":"D8-H8","v":4.9948389969021623E-2}]
["I-09G",{"$f":"IF(ISNA(VLOOKUP($A9,ClassAll,COLUMN(Classes!$B$4),0)),\"No class!\",VLOOKUP($A9,ClassAll,COLUMN(Classes!$B$4),0))","v":"Other income"},{"$f":"-IF(ISNA(MATCH(C$4,TBMonths,0))=TRUE,0,SUMIF(TBAll,$A9&\"*\",OFFSET(TB!$D$4,1,MATCH(C$4,TBMonths,0),TBRowCount,1)))","v":67930},{"$f":"-IF(ISNA(MATCH(D$4,TBMonths,0))=TRUE,0,SUMIF(TBAll,$A9&\"*\",OFFSET(TB!$D$4,1,MATCH(D$4,TBMonths,0),TBRowCount,1)))","v":38512},{"$f":"C9-D9","v":29418},{"$f":"IF(D9=0,IF(E9=0,0,-1),E9/ABS(D9))","v":0.76386580805982551},null,{"$f":"-IF(ISNA(MATCH(H$4,TBMonths,0))=TRUE,0,SUMIF(TBAll,$A9&\"*\",OFFSET(TB!$D$4,1,MATCH(H$4,TBMonths,0),TBRowCount,1)))","v":24126},{"$f":"D9-H9","v":14386},{"$f":"IF(H9=0,IF(I9=0,0,-1),I9/ABS(H9))","v":0.59628616430407033}]
[null,"Operating expenses",{"$f":"SUM(OFFSET($B$10,1,COLUMN(C4)-COLUMN($B4),ROW($B$34)-ROW($B$10)-1,1))","v":2427451},{"$f":"SUM(OFFSET($B$10,1,COLUMN(D4)-COLUMN($B4),ROW($B$34)-ROW($B$10)-1,1))","v":1896411},{"$f":"SUM(OFFSET($B$10,1,COLUMN(E4)-COLUMN($B4),ROW($B$34)-ROW($B$10)-1,1))","v":-531040},-0.28002368684847323,null,{"$f":"SUM(OFFSET($B$10,1,COLUMN(H4)-COLUMN($B4),ROW($B$34)-ROW($B$10)-1,1))","v":1603492},{"$f":"SUM(OFFSET($B$10,1,COLUMN(I4)-COLUMN($B4),ROW($B$34)-ROW($B$10)-1,1))","v":-292919},-0.18267568531679609]
{"$rows_left_out":36}
{"sheet":"CFS","index":7,"n_rows":46,"n_cols":10,"rows_kept":46,"cut":false,"hidden":true,"merged":[]}
[null,{"$f":"IF(ISBLANK(Setup!$B$4),\"Example (Pty) Limited\",Setup!$B$4)","v":"Example (Pty) Limited"}]
[null,{"$f":"\"Statement of cash flows for the period ended \"&TEXT(Setup!$B$10,\"dd mmmm yyyy\")","v":"Statement of cash flows for the period ended 28 February 2023"}]
[null,"© www.excel-skills.com"]
[null,null,{"$f":"IF(ISBLANK(Setup!$B$8),YEAR(TODAY()),Setup!$B$8)","v":2023},{"$f":"C4-1","v":2022},"Diff","Diff%",null,{"$f":"D4-1","v":2021},"Diff","Diff%"]
[null,"Cash flows from operating activities"]
[null,"Profit / (Loss) for the period",{"$f":"IS!C38","v":1034069},{"$f":"IS!D38","v":1104667},{"$f":"C6-D6","v":-70598},{"$f":"IF(D6=0,IF(E6=0,0,-1),E6/ABS(D6))","v":-6.3908852169929947E-2},null,{"$f":"IS!H38","v":608918},{"$f":"D6-H6","v":495749},{"$f":"IF(H6=0,IF(I6=0,0,-1),I6/ABS(H6))","v":0.81414738930365005}]
[null,"- Interest paid",{"$f":"IS!C35","v":194222},{"$f":"IS!D35","v":212354},{"$f":"C7-D7","v":-18132},{"$f":"IF(D7=0,IF(E7=0,0,-1),E7/ABS(D7))","v":-8.5385723838496103E-2},null,{"$f":"IS!H35","v":180742},{"$f":"D7-H7","v":31612},{"$f":"IF(H7=0,IF(I7=0,0,-1),I7/ABS(H7))","v":0.17490124044217725}]
[null,"- Income taxes",{"$f":"IS!C37","v":442236},{"$f":"IS!D37","v":263853},178383,0.67606962968016282,null,{"$f":"IS!H37","v":236801},27052,0.11423938243504039]
[null,"Non-cash income and expenses:"]
["B-01G","- Depreciation",{"$f":"IF(ISNA(MATCH(C$4-1,TBMonths,0))=TRUE,0,SUMIF(TBAll,$A10&\"*\",OFFSET(TB!$D$4,1,MATCH(C$4-1,TBMonths,0),TBRowCount,1)))-IF(ISNA(MATCH(C$4,TBMonths,0))=TRUE,0,SUMIF(TBAll,$A10&\"*\",OFFSET(TB!$D$4,1,MATCH(C$4,TBMonths,0),TBRowCount,1)))","v":546530},{"$f":"IF(ISNA(MATCH(D$4-1,TBMonths,0))=TRUE,0,SUMIF(TBAll,$A10&\"*\",OFFSET(TB!$D$4,1,MATCH(D$4-1,TBMonths,0),TBRowCount,1)))-IF(ISNA(MATCH(D$4,TBMonths,0))=TRUE,0,SUMIF(TBAll,$A10&\"*\",OFFSET(TB!$D$4,1,MATCH(D$4,TBMonths,0),TBRowCount,1)))","v":450300},{"$f":"C10-D10","v":96230},{"$f":"IF(D10=0,IF(E10=0,0,-1),E10/ABS(D10))","v":0.21370197646013769},null,{"$f":"IF(ISNA(MATCH(H$4-1,TBMonths,0))=TRUE,0,SUMIF(TBAll,$A10&\"*\",OFFSET(TB!$D$4,1,MATCH(H$4-1,TBMonths,0),TBRowCount,1)))-IF(ISNA(MATCH(H$4,TBMonths,0))=TRUE,0,SUMIF(TBAll,$A10&\"*\",OFFSET(TB!$D$4,1,MATCH(H$4,TBMonths,0),TBRowCount,1)))","v":377626},{"$f":"D10-H10","v":72674},{"$f":"IF(H10=0,IF(I10=0,0,-1),I10/ABS(H10))","v":0.19244967242721633}]
{"$rows_left_out":37}
{"sheet":"BS","index":8,"n_rows":53,"n_cols":10,"rows_kept":53,"cut":false,"hidden":true,"merged":[]}
[null,{"$f":"IF(ISBLANK(Setup!$B$4),\"Example (Pty) Limited\",Setup!$B$4)","v":"Example (Pty) Limited"}]
[null,{"$f":"\"Balance sheet at \"&TEXT(Setup!$B$10,\"dd mmmm yyyy\")","v":"Balance sheet at 28 February 2023"}]
[null,"© www.excel-skills.com"]
[null,null,{"$f":"IF(ISBLANK(Setup!$B$8),YEAR(TODAY()),Setup!$B$8)","v":2023},{"$f":"C4-1","v":2022},"Diff","Diff%",null,{"$f":"D4-1","v":2021},"Diff","Diff%"]
[null,"ASSETS"]
[null,"Non-current assets"]
["B-00G",{"$f":"IF(ISNA(VLOOKUP($A7,ClassAll,COLUMN(Classes!$B$4),0)),\"No class!\",VLOOKUP($A7,ClassAll,COLUMN(Classes!$B$4),0))","v":"Property, plant & equipment - cost"},{"$f":"IF(ISNA(MATCH(C$4,TBMonths,0))=TRUE,0,SUMIF(TBAll,$A7&\"*\",OFFSET(TB!$D$4,1,MATCH(C$4,TBMonths,0),TBRowCount,1)))","v":5179545},{"$f":"IF(ISNA(MATCH(D$4,TBMonths,0))=TRUE,0,SUMIF(TBAll,$A7&\"*\",OFFSET(TB!$D$4,1,MATCH(D$4,TBMonths,0),TBRowCount,1)))","v":4874545},{"$f":"C7-D7","v":305000},{"$f":"IF(D7=0,IF(E7=0,0,-1),E7/ABS(D7))","v":6.2569942425395597E-2},null,{"$f":"IF(ISNA(MATCH(H$4,TBMonths,0))=TRUE,0,SUMIF(TBAll,$A7&\"*\",OFFSET(TB!$D$4,1,MATCH(H$4,TBMonths,0),TBRowCount,1)))","v":4709795},{"$f":"D7-H7","v":164750},{"$f":"IF(H7=0,IF(I7=0,0,-1),I7/ABS(H7))","v":3.4980291074239965E-2}]
["B-01G",{"$f":"IF(ISNA(VLOOKUP($A8,ClassAll,COLUMN(Classes!$B$4),0)),\"No class!\",VLOOKUP($A8,ClassAll,COLUMN(Classes!$B$4),0))","v":"Property, plant & equipment - accum dep"},{"$f":"IF(ISNA(MATCH(C$4,TBMonths,0))=TRUE,0,SUMIF(TBAll,$A8&\"*\",OFFSET(TB!$D$4,1,MATCH(C$4,TBMonths,0),TBRowCount,1)))","v":-1926248},{"$f":"IF(ISNA(MATCH(D$4,TBMonths,0))=TRUE,0,SUMIF(TBAll,$A8&\"*\",OFFSET(TB!$D$4,1,MATCH(D$4,TBMonths,0),TBRowCount,1)))","v":-1379718},{"$f":"C8-D8","v":-546530},{"$f":"IF(D8=0,IF(E8=0,0,-1),E8/ABS(D8))","v":-0.39611717756816972},null,{"$f":"IF(ISNA(MATCH(H$4,TBMonths,0))=TRUE,0,SUMIF(TBAll,$A8&\"*\",OFFSET(TB!$D$4,1,MATCH(H$4,TBMonths,0),TBRowCount,1)))","v":-929418},{"$f":"D8-H8","v":-450300},{"$f":"IF(H8=0,IF(I8=0,0,-1),I8/ABS(H8))","v":-0.48449674957876865}]
["B-02G",{"$f":"IF(ISNA(VLOOKUP($A9,ClassAll,COLUMN(Classes!$B$4),0)),\"No class!\",VLOOKUP($A9,ClassAll,COLUMN(Classes!$B$4),0))","v":"Intangible assets - cost"},{"$f":"IF(ISNA(MATCH(C$4,TBMonths,0))=TRUE,0,SUMIF(TBAll,$A9&\"*\",OFFSET(TB!$D$4,1,MATCH(C$4,TBMonths,0),TBRowCount,1)))","v":1040500},{"$f":"IF(ISNA(MATCH(D$4,TBMonths,0))=TRUE,0,SUMIF(TBAll,$A9&\"*\",OFFSET(TB!$D$4,1,MATCH(D$4,TBMonths,0),TBRowCount,1)))","v":1040500},{"$f":"C9-D9","v":0},{"$f":"IF(D9=0,IF(E9=0,0,-1),E9/ABS(D9))","v":0},null,{"$f":"IF(ISNA(MATCH(H$4,TBMonths,0))=TRUE,0,SUMIF(TBAll,$A9&\"*\",OFFSET(TB!$D$4,1,MATCH(H$4,TBMonths,0),TBRowCount,1)))","v":1040500},{"$f":"D9-H9","v":0},{"$f":"IF(H9=0,IF(I9=0,0,-1),I9/ABS(H9))","v":0}]
["B-03G",{"$f":"IF(ISNA(VLOOKUP($A10,ClassAll,COLUMN(Classes!$B$4),0)),\"No class!\",VLOOKUP($A10,ClassAll,COLUMN(Classes!$B$4),0))","v":"Intangible assets - amortization"},{"$f":"IF(ISNA(MATCH(C$4,TBMonths,0))=TRUE,0,SUMIF(TBAll,$A10&\"*\",OFFSET(TB!$D$4,1,MATCH(C$4,TBMonths,0),TBRowCount,1)))","v":-416200},{"$f":"IF(ISNA(MATCH(D$4,TBMonths,0))=TRUE,0,SUMIF(TBAll,$A10&\"*\",OFFSET(TB!$D$4,1,MATCH(D$4,TBMonths,0),TBRowCount,1)))","v":-312150},{"$f":"C10-D10","v":-104050},{"$f":"IF(D10=0,IF(E10=0,0,-1),E10/ABS(D10))","v":-0.33333333333333331},null,{"$f":"IF(ISNA(MATCH(H$4,TBMonths,0))=TRUE,0,SUMIF(TBAll,$A10&\"*\",OFFSET(TB!$D$4,1,MATCH(H$4,TBMonths,0),TBRowCount,1)))","v":-208100},{"$f":"D10-H10","v":-104050},{"$f":"IF(H10=0,IF(I10=0,0,-1),I10/ABS(H10))","v":-0.5}]
{"$rows_left_out":44}
{"sheet":"DB","index":9,"n_rows":110,"n_cols":11,"rows_kept":110,"cut":false,"hidden":true,"merged":[[30,4,31,5],[33,4,34,5],[38,1,39,3],[38,4,45,5],[50,8,50,10],[50,6,50,7],[50,4,50,5],[49,4,49,5],[46,6,46,7],[47,6,47,7],[48,6,48,7],[49,6,49,7],[46,8,46,10],[47,8,47,10],[48,8,48,10],[46,4,46,5],[47,4,47,5],[48,4,48,5],[38,6,45,6],[38,7,45,10],[49,8,49,10],[1,2,2,5],[1,1,4,1],[3,2,4,5],[1,6,2,10],[5,4,12,5],[5,1,12,3],[30,1,37,3],[30,6,31,10],[13,6,20,6],[13,7,20,10],[21,1,22,4],[21,5,22,10],[23,6,23,8]]}
[]
[null,"FINANCIAL\nDASHBOARD",{"$f":"$A$55","v":"Example (Pty) Limited"},null,null,null,"Income Statement Trends"]
[]
[null,null,{"$f":"$A$56","v":"AS AT 28 FEBRUARY 2023"},null,null,null,null,null,{"$f":"C59","v":2023},null,{"$f":"D59","v":2022}]
[null,null,null,null,null,null,{"$f":"DB!A73","v":"Turnover"},{"$f":"IF(I5>0,$C$58,IF(I5<0,$E$58,$D$58))","v":"\u0097"},{"$f":"IF(D73=0,IF(C73-D73=0,0,-1),(C73-D73)/ABS(D73))","v":0.10727043111086974},{"$f":"IF(K5>0,$C$58,IF(K5<0,$E$58,$D$58))","v":"\u0097"},{"$f":"IF(E73=0,IF(D73-E73=0,0,-1),(D73-E73)/ABS(E73))","v":0.20000034604098355}]
[null,null,null,null,null,null,{"$f":"DB!A74","v":"Gross profit"},"\u0097",{"$f":"IF(D74=0,IF(C74-D74=0,0,-1),(C74-D74)/ABS(D74))","v":0.1719435973238129},"\u0097",{"$f":"IF(E74=0,IF(D74-E74=0,0,-1),(D74-E74)/ABS(E74))","v":0.31964746700375735}]
[null,null,null,null,null,null,{"$f":"DB!A75","v":"Operating expenses"},"\u0097",0.28002368684847323,"\u0097",0.18267568531679609]
[null,null,null,null,null,null,{"$f":"DB!A76","v":"Interest paid"},"\u0098",-8.5385723838496103E-2,"\u0097",0.17490124044217725]
[null,null,null,null,null,null,{"$f":"DB!A77","v":"Taxation paid"},"\u0097",0.67606962968016282,"\u0097",0.11423938243504039]
[null,null,null,null,null,null,{"$f":"DB!A78","v":"Profit / (Loss) for the period"},"\u0098",-6.3908852169929947E-2,"\u0097",0.81414738930365005]
{"$rows_left_out":101}
{"sheet":"TBCheck","index":10,"n_rows":92,"n_cols":5,"rows_kept":92,"cut":false,"hidden":true,"merged":[]}
[{"$f":"IF(ISBLANK(Setup!$B$4),\"Example (Pty) Limited\",Setup!$B$4)","v":"Example (Pty) Limited"}]
["Trial Balance Sequence Check"]
["© www.excel-skills.com",null,{"$f":"SUBTOTAL(109,OFFSET(C4,1,0,CheckRowCount,1))","v":0},{"$f":"IF(ROUND(C3,2)<>0,\"error!\",\"ok\")","v":"ok"},{"$f":"SUBTOTAL(109,OFFSET(E4,1,0,CheckRowCount,1))","v":0}]
["Acc No","Account Description","Amount","Check","Amount"]
["BS-0005","Land & Buildings - Cost",2400000,{"$f":"IF(OFFSET(TB!$C$4,ROW($A5)-ROW($A$4),0,1,1)=$A5,\"ok\",\"error!\")","v":"ok"},{"$f":"ROUND(C5,0)","v":2400000}]
["BS-0010","Plant & Equipment - Cost",1546045,{"$f":"IF(OFFSET(TB!$C$4,ROW($A6)-ROW($A$4),0,1,1)=$A6,\"ok\",\"error!\")","v":"ok"},{"$f":"ROUND(C6,0)","v":1546045}]
["BS-0015","Furniture & Fittings - Cost",410000,{"$f":"IF(OFFSET(TB!$C$4,ROW($A7)-ROW($A$4),0,1,1)=$A7,\"ok\",\"error!\")","v":"ok"},410000]
["BS-0020","Office Equipment - Cost",240000,{"$f":"IF(OFFSET(TB!$C$4,ROW($A8)-ROW($A$4),0,1,1)=$A8,\"ok\",\"error!\")","v":"ok"},240000]
["BS-0025","Computer Equipment - Cost",165500,{"$f":"IF(OFFSET(TB!$C$4,ROW($A9)-ROW($A$4),0,1,1)=$A9,\"ok\",\"error!\")","v":"ok"},165500]
["BS-0030","Motor Vehicles - Cost",452000,{"$f":"IF(OFFSET(TB!$C$4,ROW($A10)-ROW($A$4),0,1,1)=$A10,\"ok\",\"error!\")","v":"ok"},452000]
{"$rows_left_out":82}