{"text_format":"1","workbook":"xlsx","n_sheets":6,"sheets":["Info","Trial","Instructions","Assumptions","CashFlow","Valuation"],"not_rendered":{"charts":1,"images":2,"macros":1,"external_links":0,"defined_names":3,"comments":0,"pivot_tables":0},"unopened":[],"bounds":{"document_bytes":16777216,"sheet_cells":100000,"rows_first":2000,"rows_last":500,"rows_between":2000,"halvings":0,"cell_chars":16384,"cell_head_chars":4096},"cells_cut":0,"cells_raw":0,"read":"whole","date_system":"1900"}

{"sheet":"Info","index":0,"n_rows":0,"n_cols":0,"rows_kept":0,"cut":false,"hidden":false,"merged":[]}

{"sheet":"Trial","index":1,"n_rows":0,"n_cols":0,"rows_kept":0,"cut":false,"hidden":true,"merged":[]}

{"sheet":"Instructions","index":2,"n_rows":170,"n_cols":1,"rows_kept":170,"cut":false,"hidden":true,"merged":[]}
["Excel Skills | Business Valuation Template"]
["Instructions"]
["www.excel-skills.com"]
[]
["This template enables business owners and buyers or sellers of businesses to calculate an estimated valuation of a business or company based on the discounted cash flow (DCF) method by using the weighted average cost of capital (WACC) as a discount rate for future cash flow projections over three and five year periods. The estimated business valuations are calculated by using the net present value (NPV) method with the option of including a terminal value. The flexible design of the template also enables users to perform sensitivities on the projected cash flow and financing of a business in order to evaluate what the business is worth."]
[]
["Note: A formal valuation of a business usually involves a comprehensive analysis of the cash flow generated by the business and the inherent risk factors which may affect a business valuation. We believe that it is impossible to compile a formal, independent business valuation by using any stand alone business valuation tool and the results produced by this template should therefore not be interpreted as a formal business valuation. This template is a unique business valuation solution which adds immeasurable value in determining and analysing the estimated value of a business on a discounted cash flow basis."]
[]
["The following sheets are included in this template:"]
["Assumptions - this sheet contains all the user assumptions which affect the business valuation calculations. Most of the assumptions are used in compiling the 5-year forecast of annual cash flows but some important financing assumptions are also included at the bottom of the sheet."]
["CashFlow - the 5 year annual cash flow forecast on this sheet is automatically compiled from the assumptions entered on the Assumptions sheet. The only user input which is required on this sheet is the addition of expense items if the default expenses are not sufficient."]
["Valuation - the annual cash flow projections and the financing assumptions set at the bottom of the Assumptions sheet are used in the calculation of the estimated business valuations on this sheet. The template uses the discounted cash flow (DCF) business valuation method with the weighted average cost of capital (WACC) as the discount rate to calculate estimated business valuations based on the net present value (NPV) of future cash flows and a terminal value if applicable."]
[]
["Assumptions"]
[]
["Business Name"]
[]
["The business name entered in cell B4 on the Assumptions sheet is used as a heading on all sheets."]
[]
["Turnover"]
[]
["The turnover amounts in the annual cash flow projections are calculated from the year 1 amount entered in cell C9 on the Assumptions sheet and increased for subsequent years by applying the appropriate annual increase percentages specified in row 10 on the Assumptions sheet to the appropriate previous year's turnover amount."]
[]
["Gross Profit %"]
[]
["The estimated gross profit percentages entered in row 12 on the Assumptions sheet are used to calculate the appropriate gross profit amounts in each year on the cash flow projections. The cost of sales amounts are then calculated by deducting the gross profit amounts from the appropriate turnover amounts."]
[]
["Note: Gross profit percentages of 100% can be entered to compile a cash flow forecast for service based businesses. The turnover amounts will then be the same as the gross profit amounts and you can hide the cost of sales and gross profit rows on the CashFlow sheet if you don't want to include these calculations on the annual cash flow projections."]
[]
["Expenses"]
[]
["The template includes 23 default expense items which can be customized based on requirements. The default expense item descriptions can be edited in order to change the appropriate expense items and you can sort the expense item descriptions on the Assumptions sheet in alphabetical order after customizing the default list. The expense item descriptions and amounts on the cash flow forecast are automatically updated."]
[]
["You can also add additional expense items to the default list by simply inserting a row anywhere above the \"Add new expense items above this row\" text in row 37. The expense items which are added above this row are automatically updated on the CashFlow sheet but you also need to insert the appropriate number of additional rows on this sheet in order to include all the expenses listed on the Assumptions sheet on the cash flow forecast."]
[]
["The year 1 expense amounts in column C on the Assumptions sheet are automatically included in the appropriate rows on the CashFlow sheet. The year 2 to year 5 expense amounts are calculated by applying the expense increase percentages which are entered in row 38 to the appropriate expense amounts of the previous year."]
[]
["Individual expense items are not covered in these instructions because the nature of expenses differs based on the nature of the business for which the cash flow forecast is compiled. We would however like to emphasize that users need to ensure that all expenses are included in the cash flow forecast because the omission of material expenses could result in an inaccurate business valuation being arrived at."]
[]
["Some expense items do however require special mention for the purpose of this template. If you are calculating a business valuation for a start-up business, some costs may be incurred in the first year but not in subsequent years. These start-up costs should be included in the list of expense items on the Assumptions sheet but the formulas which are used in order to calculate the expenses for subsequent years on the CashFlow sheet should be deleted and replaced by nil values."]
{"$rows_left_out":131}
{"sheet":"Assumptions","index":3,"n_rows":56,"n_cols":7,"rows_kept":56,"cut":false,"hidden":true,"merged":[]}
[{"$f":"$B$4","v":"Example Company (Pty) Limited"}]
["Valuation Assumptions"]
[]
["Business Name / Sheet Heading","Example Company (Pty) Limited"]
[]
["Financial Assumptions - Cash Flow Calculations"]
[null,"Start-up","Year 1","Year 2","Year 3","Year 4","Year 5"]
["Turnover"]
["Estimated Annual Turnover",null,5000000]
["Annual Increase %",null,null,0.1,0.1,0.05,0.05]
["Gross Profit %"]
["Estimated Gross Profit %",null,0.35,0.35,0.35,0.38,0.38]
["Expenses",{"$f":"ROW($A$37)-ROW($A$13)-1","v":23}]
["Accounting Fees",null,24000]
["Advertising & Marketing",null,60000]
["Bank Charges",null,3000]
["Cleaning Expenses",null,6000]
["Computer Expenses",null,4000]
["Consumables",null,15000]
["Electricity & Water",null,12000]
["Entertainment ",null,8000]
["Equipment Hire",null,6000]
["Insurance",null,10000]
["Legal Fees",null,4500]
["Motor Vehicle Expenses",null,36000]
["Postage",null,2000]
["Printing & Stationery",null,5500]
["Professional Fees",null,17000]
["Rent",null,120000]
["Repairs & Maintenance",null,11000]
["Salaries & Wages",null,600000]
["Security",null,13000]
["Subscriptions",null,5800]
["Telephone & Fax",null,28000]
["Training",null,18000]
["Uniforms",null,5000]
["Add new expense items above this row"]
["Annual Increase %",null,null,0.06,0.06,0.05,0.05]
["Working Capital"]
["Inventory",175000,190000,206000,225000,230000,235000]
{"$rows_left_out":17}
{"sheet":"CashFlow","index":4,"n_rows":51,"n_cols":7,"rows_kept":51,"cut":false,"hidden":true,"merged":[]}
[{"$f":"Assumptions!B4","v":"Example Company (Pty) Limited"}]
["Cash Flow Projection"]
["© www.excel-skills.com"]
[null,"Monthly Average","Year 1","Year 2","Year 3","Year 4","Year 5"]
["Turnover",{"$f":"$C5/12","v":416666.66666666669},{"$f":"Assumptions!$C$9","v":5000000},{"$f":"C5*(1+Assumptions!D$10)","v":5500000},{"$f":"D5*(1+Assumptions!E$10)","v":6050000.0000000009},{"$f":"E5*(1+Assumptions!F$10)","v":6352500.0000000009},{"$f":"F5*(1+Assumptions!G$10)","v":6670125.0000000009}]
[]
["Cost of Sales",{"$f":"$C7/12","v":270833.33333333331},{"$f":"SUM(C5,-C9)","v":3250000},{"$f":"SUM(D5,-D9)","v":3575000},{"$f":"SUM(E5,-E9)","v":3932500.0000000009},{"$f":"SUM(F5,-F9)","v":3938550.0000000005},{"$f":"SUM(G5,-G9)","v":4135477.5000000005}]
[]
["Gross Profit",{"$f":"SUM(B5,-B7)","v":145833.33333333337},{"$f":"C5*C10","v":1750000},{"$f":"D5*D10","v":1924999.9999999998},{"$f":"E5*E10","v":2117500},{"$f":"F5*F10","v":2413950.0000000005},{"$f":"G5*G10","v":2534647.5000000005}]
["Gross Profit %",{"$f":"IF(B5=0,0,B9/B5)","v":0.35000000000000009},{"$f":"Assumptions!C$12","v":0.35},{"$f":"Assumptions!D$12","v":0.35},{"$f":"Assumptions!E$12","v":0.35},{"$f":"Assumptions!F$12","v":0.38},{"$f":"Assumptions!G$12","v":0.38}]
[]
["Expenses"]
[{"$f":"IF(ROW(B13)-ROW($A$12)>ExpCount,\"Delete this row!\",OFFSET(Assumptions!$A$13,ROW(B13)-ROW($A$12),0,1,1))","v":"Accounting Fees"},{"$f":"$C13/12","v":2000},{"$f":"OFFSET(Assumptions!$A$13,ROW(A13)-ROW($A$12),2,1,1)","v":24000},{"$f":"C13*(1+Assumptions!D$38)","v":25440},{"$f":"D13*(1+Assumptions!E$38)","v":26966.400000000001},{"$f":"E13*(1+Assumptions!F$38)","v":28314.720000000001},{"$f":"F13*(1+Assumptions!G$38)","v":29730.456000000002}]
[{"$f":"IF(ROW(B14)-ROW($A$12)>ExpCount,\"Delete this row!\",OFFSET(Assumptions!$A$13,ROW(B14)-ROW($A$12),0,1,1))","v":"Advertising & Marketing"},5000,{"$f":"OFFSET(Assumptions!$A$13,ROW(A14)-ROW($A$12),2,1,1)","v":60000},{"$f":"C14*(1+Assumptions!D$38)","v":63600},{"$f":"D14*(1+Assumptions!E$38)","v":67416},{"$f":"E14*(1+Assumptions!F$38)","v":70786.8},{"$f":"F14*(1+Assumptions!G$38)","v":74326.14}]
[{"$f":"IF(ROW(B15)-ROW($A$12)>ExpCount,\"Delete this row!\",OFFSET(Assumptions!$A$13,ROW(B15)-ROW($A$12),0,1,1))","v":"Bank Charges"},250,{"$f":"OFFSET(Assumptions!$A$13,ROW(A15)-ROW($A$12),2,1,1)","v":3000},{"$f":"C15*(1+Assumptions!D$38)","v":3180},{"$f":"D15*(1+Assumptions!E$38)","v":3370.8},{"$f":"E15*(1+Assumptions!F$38)","v":3539.34},{"$f":"F15*(1+Assumptions!G$38)","v":3716.3070000000002}]
[{"$f":"IF(ROW(B16)-ROW($A$12)>ExpCount,\"Delete this row!\",OFFSET(Assumptions!$A$13,ROW(B16)-ROW($A$12),0,1,1))","v":"Cleaning Expenses"},500,{"$f":"OFFSET(Assumptions!$A$13,ROW(A16)-ROW($A$12),2,1,1)","v":6000},{"$f":"C16*(1+Assumptions!D$38)","v":6360},{"$f":"D16*(1+Assumptions!E$38)","v":6741.6},{"$f":"E16*(1+Assumptions!F$38)","v":7078.68},{"$f":"F16*(1+Assumptions!G$38)","v":7432.6140000000005}]
[{"$f":"IF(ROW(B17)-ROW($A$12)>ExpCount,\"Delete this row!\",OFFSET(Assumptions!$A$13,ROW(B17)-ROW($A$12),0,1,1))","v":"Computer Expenses"},333.33333333333331,{"$f":"OFFSET(Assumptions!$A$13,ROW(A17)-ROW($A$12),2,1,1)","v":4000},{"$f":"C17*(1+Assumptions!D$38)","v":4240},{"$f":"D17*(1+Assumptions!E$38)","v":4494.4000000000005},{"$f":"E17*(1+Assumptions!F$38)","v":4719.1200000000008},{"$f":"F17*(1+Assumptions!G$38)","v":4955.0760000000009}]
[{"$f":"IF(ROW(B18)-ROW($A$12)>ExpCount,\"Delete this row!\",OFFSET(Assumptions!$A$13,ROW(B18)-ROW($A$12),0,1,1))","v":"Consumables"},1250,{"$f":"OFFSET(Assumptions!$A$13,ROW(A18)-ROW($A$12),2,1,1)","v":15000},{"$f":"C18*(1+Assumptions!D$38)","v":15900},{"$f":"D18*(1+Assumptions!E$38)","v":16854},{"$f":"E18*(1+Assumptions!F$38)","v":17696.7},{"$f":"F18*(1+Assumptions!G$38)","v":18581.535}]
[{"$f":"IF(ROW(B19)-ROW($A$12)>ExpCount,\"Delete this row!\",OFFSET(Assumptions!$A$13,ROW(B19)-ROW($A$12),0,1,1))","v":"Electricity & Water"},1000,{"$f":"OFFSET(Assumptions!$A$13,ROW(A19)-ROW($A$12),2,1,1)","v":12000},{"$f":"C19*(1+Assumptions!D$38)","v":12720},{"$f":"D19*(1+Assumptions!E$38)","v":13483.2},{"$f":"E19*(1+Assumptions!F$38)","v":14157.36},{"$f":"F19*(1+Assumptions!G$38)","v":14865.228000000001}]
[{"$f":"IF(ROW(B20)-ROW($A$12)>ExpCount,\"Delete this row!\",OFFSET(Assumptions!$A$13,ROW(B20)-ROW($A$12),0,1,1))","v":"Entertainment "},666.66666666666663,{"$f":"OFFSET(Assumptions!$A$13,ROW(A20)-ROW($A$12),2,1,1)","v":8000},{"$f":"C20*(1+Assumptions!D$38)","v":8480},{"$f":"D20*(1+Assumptions!E$38)","v":8988.8000000000011},{"$f":"E20*(1+Assumptions!F$38)","v":9438.2400000000016},{"$f":"F20*(1+Assumptions!G$38)","v":9910.1520000000019}]
[{"$f":"IF(ROW(B21)-ROW($A$12)>ExpCount,\"Delete this row!\",OFFSET(Assumptions!$A$13,ROW(B21)-ROW($A$12),0,1,1))","v":"Equipment Hire"},500,{"$f":"OFFSET(Assumptions!$A$13,ROW(A21)-ROW($A$12),2,1,1)","v":6000},{"$f":"C21*(1+Assumptions!D$38)","v":6360},{"$f":"D21*(1+Assumptions!E$38)","v":6741.6},{"$f":"E21*(1+Assumptions!F$38)","v":7078.68},{"$f":"F21*(1+Assumptions!G$38)","v":7432.6140000000005}]
[{"$f":"IF(ROW(B22)-ROW($A$12)>ExpCount,\"Delete this row!\",OFFSET(Assumptions!$A$13,ROW(B22)-ROW($A$12),0,1,1))","v":"Insurance"},833.33333333333337,{"$f":"OFFSET(Assumptions!$A$13,ROW(A22)-ROW($A$12),2,1,1)","v":10000},{"$f":"C22*(1+Assumptions!D$38)","v":10600},{"$f":"D22*(1+Assumptions!E$38)","v":11236},{"$f":"E22*(1+Assumptions!F$38)","v":11797.800000000001},{"$f":"F22*(1+Assumptions!G$38)","v":12387.690000000002}]
[{"$f":"IF(ROW(B23)-ROW($A$12)>ExpCount,\"Delete this row!\",OFFSET(Assumptions!$A$13,ROW(B23)-ROW($A$12),0,1,1))","v":"Legal Fees"},375,{"$f":"OFFSET(Assumptions!$A$13,ROW(A23)-ROW($A$12),2,1,1)","v":4500},{"$f":"C23*(1+Assumptions!D$38)","v":4770},{"$f":"D23*(1+Assumptions!E$38)","v":5056.2},{"$f":"E23*(1+Assumptions!F$38)","v":5309.01},{"$f":"F23*(1+Assumptions!G$38)","v":5574.4605000000001}]
[{"$f":"IF(ROW(B24)-ROW($A$12)>ExpCount,\"Delete this row!\",OFFSET(Assumptions!$A$13,ROW(B24)-ROW($A$12),0,1,1))","v":"Motor Vehicle Expenses"},3000,{"$f":"OFFSET(Assumptions!$A$13,ROW(A24)-ROW($A$12),2,1,1)","v":36000},{"$f":"C24*(1+Assumptions!D$38)","v":38160},{"$f":"D24*(1+Assumptions!E$38)","v":40449.599999999999},{"$f":"E24*(1+Assumptions!F$38)","v":42472.08},{"$f":"F24*(1+Assumptions!G$38)","v":44595.684000000001}]
[{"$f":"IF(ROW(B25)-ROW($A$12)>ExpCount,\"Delete this row!\",OFFSET(Assumptions!$A$13,ROW(B25)-ROW($A$12),0,1,1))","v":"Postage"},166.66666666666666,{"$f":"OFFSET(Assumptions!$A$13,ROW(A25)-ROW($A$12),2,1,1)","v":2000},{"$f":"C25*(1+Assumptions!D$38)","v":2120},{"$f":"D25*(1+Assumptions!E$38)","v":2247.2000000000003},{"$f":"E25*(1+Assumptions!F$38)","v":2359.5600000000004},{"$f":"F25*(1+Assumptions!G$38)","v":2477.5380000000005}]
[{"$f":"IF(ROW(B26)-ROW($A$12)>ExpCount,\"Delete this row!\",OFFSET(Assumptions!$A$13,ROW(B26)-ROW($A$12),0,1,1))","v":"Printing & Stationery"},458.33333333333331,{"$f":"OFFSET(Assumptions!$A$13,ROW(A26)-ROW($A$12),2,1,1)","v":5500},{"$f":"C26*(1+Assumptions!D$38)","v":5830},{"$f":"D26*(1+Assumptions!E$38)","v":6179.8},{"$f":"E26*(1+Assumptions!F$38)","v":6488.7900000000009},{"$f":"F26*(1+Assumptions!G$38)","v":6813.2295000000013}]
[{"$f":"IF(ROW(B27)-ROW($A$12)>ExpCount,\"Delete this row!\",OFFSET(Assumptions!$A$13,ROW(B27)-ROW($A$12),0,1,1))","v":"Professional Fees"},1416.6666666666667,{"$f":"OFFSET(Assumptions!$A$13,ROW(A27)-ROW($A$12),2,1,1)","v":17000},{"$f":"C27*(1+Assumptions!D$38)","v":18020},{"$f":"D27*(1+Assumptions!E$38)","v":19101.2},{"$f":"E27*(1+Assumptions!F$38)","v":20056.260000000002},{"$f":"F27*(1+Assumptions!G$38)","v":21059.073000000004}]
[{"$f":"IF(ROW(B28)-ROW($A$12)>ExpCount,\"Delete this row!\",OFFSET(Assumptions!$A$13,ROW(B28)-ROW($A$12),0,1,1))","v":"Rent"},10000,{"$f":"OFFSET(Assumptions!$A$13,ROW(A28)-ROW($A$12),2,1,1)","v":120000},{"$f":"C28*(1+Assumptions!D$38)","v":127200},{"$f":"D28*(1+Assumptions!E$38)","v":134832},{"$f":"E28*(1+Assumptions!F$38)","v":141573.6},{"$f":"F28*(1+Assumptions!G$38)","v":148652.28}]
[{"$f":"IF(ROW(B29)-ROW($A$12)>ExpCount,\"Delete this row!\",OFFSET(Assumptions!$A$13,ROW(B29)-ROW($A$12),0,1,1))","v":"Repairs & Maintenance"},916.66666666666663,{"$f":"OFFSET(Assumptions!$A$13,ROW(A29)-ROW($A$12),2,1,1)","v":11000},{"$f":"C29*(1+Assumptions!D$38)","v":11660},{"$f":"D29*(1+Assumptions!E$38)","v":12359.6},{"$f":"E29*(1+Assumptions!F$38)","v":12977.580000000002},{"$f":"F29*(1+Assumptions!G$38)","v":13626.459000000003}]
[{"$f":"IF(ROW(B30)-ROW($A$12)>ExpCount,\"Delete this row!\",OFFSET(Assumptions!$A$13,ROW(B30)-ROW($A$12),0,1,1))","v":"Salaries & Wages"},50000,{"$f":"OFFSET(Assumptions!$A$13,ROW(A30)-ROW($A$12),2,1,1)","v":600000},{"$f":"C30*(1+Assumptions!D$38)","v":636000},{"$f":"D30*(1+Assumptions!E$38)","v":674160},{"$f":"E30*(1+Assumptions!F$38)","v":707868},{"$f":"F30*(1+Assumptions!G$38)","v":743261.4}]
[{"$f":"IF(ROW(B31)-ROW($A$12)>ExpCount,\"Delete this row!\",OFFSET(Assumptions!$A$13,ROW(B31)-ROW($A$12),0,1,1))","v":"Security"},1083.3333333333333,{"$f":"OFFSET(Assumptions!$A$13,ROW(A31)-ROW($A$12),2,1,1)","v":13000},{"$f":"C31*(1+Assumptions!D$38)","v":13780},{"$f":"D31*(1+Assumptions!E$38)","v":14606.800000000001},{"$f":"E31*(1+Assumptions!F$38)","v":15337.140000000001},{"$f":"F31*(1+Assumptions!G$38)","v":16103.997000000001}]
[{"$f":"IF(ROW(B32)-ROW($A$12)>ExpCount,\"Delete this row!\",OFFSET(Assumptions!$A$13,ROW(B32)-ROW($A$12),0,1,1))","v":"Subscriptions"},483.33333333333331,{"$f":"OFFSET(Assumptions!$A$13,ROW(A32)-ROW($A$12),2,1,1)","v":5800},{"$f":"C32*(1+Assumptions!D$38)","v":6148},{"$f":"D32*(1+Assumptions!E$38)","v":6516.88},{"$f":"E32*(1+Assumptions!F$38)","v":6842.7240000000002},{"$f":"F32*(1+Assumptions!G$38)","v":7184.8602000000001}]
[{"$f":"IF(ROW(B33)-ROW($A$12)>ExpCount,\"Delete this row!\",OFFSET(Assumptions!$A$13,ROW(B33)-ROW($A$12),0,1,1))","v":"Telephone & Fax"},2333.3333333333335,{"$f":"OFFSET(Assumptions!$A$13,ROW(A33)-ROW($A$12),2,1,1)","v":28000},{"$f":"C33*(1+Assumptions!D$38)","v":29680},{"$f":"D33*(1+Assumptions!E$38)","v":31460.800000000003},{"$f":"E33*(1+Assumptions!F$38)","v":33033.840000000004},{"$f":"F33*(1+Assumptions!G$38)","v":34685.532000000007}]
[{"$f":"IF(ROW(B34)-ROW($A$12)>ExpCount,\"Delete this row!\",OFFSET(Assumptions!$A$13,ROW(B34)-ROW($A$12),0,1,1))","v":"Training"},1500,{"$f":"OFFSET(Assumptions!$A$13,ROW(A34)-ROW($A$12),2,1,1)","v":18000},{"$f":"C34*(1+Assumptions!D$38)","v":19080},{"$f":"D34*(1+Assumptions!E$38)","v":20224.8},{"$f":"E34*(1+Assumptions!F$38)","v":21236.04},{"$f":"F34*(1+Assumptions!G$38)","v":22297.842000000001}]
[{"$f":"IF(ROW(B35)-ROW($A$12)>ExpCount,\"Delete this row!\",OFFSET(Assumptions!$A$13,ROW(B35)-ROW($A$12),0,1,1))","v":"Uniforms"},416.66666666666669,{"$f":"OFFSET(Assumptions!$A$13,ROW(A35)-ROW($A$12),2,1,1)","v":5000},{"$f":"C35*(1+Assumptions!D$38)","v":5300},{"$f":"D35*(1+Assumptions!E$38)","v":5618},{"$f":"E35*(1+Assumptions!F$38)","v":5898.9000000000005},{"$f":"F35*(1+Assumptions!G$38)","v":6193.8450000000012}]
["Total Expenses",{"$f":"SUM(OFFSET(B12,0,0,COUNTA($A$12:$A$36)-1,1))","v":84483.333333333328},1013800,1074628,1139105.68,1196060.9639999999,1255864.0122000002]
[]
["Profit before Interest & Tax",{"$f":"SUM(B9,-B36)","v":61350.000000000044},736200,850371.99999999977,978394.32000000007,1217889.0360000005,1278783.4878000002]
[]
["Changes in Working Capital",{"$f":"SUM(B41:B43)","v":-5166.666666666667},-62000,-43000,-48000,-27000,-21000]
{"$rows_left_out":12}
{"sheet":"Valuation","index":5,"n_rows":71,"n_cols":9,"rows_kept":71,"cut":false,"hidden":true,"merged":[[12,1,25,8],[27,1,27,8],[4,5,4,6],[5,5,5,6],[6,5,7,6],[4,7,4,8],[5,7,5,8],[6,7,7,8],[4,1,4,2],[6,1,7,2],[5,1,5,2],[4,3,4,4],[5,3,5,4],[6,3,7,4]]}
[]
[null,{"$f":"Assumptions!$B$4","v":"Example Company (Pty) Limited"}]
[null,"Business Valuation Calculation Dashboard"]
[null,"© www.excel-skills.com"]
[null,"ESTIMATED BUSINESS VALUE",null,"ESTIMATED BUSINESS VALUE",null,"WEIGHTED AVERAGE COST",null,"ESTIMATED BUSINESS VALUE"]
[null,"3 YEARS",null,"5 YEARS",null,"OF CAPITAL",null,"PROFIT MULTIPLE"]
[null,{"$f":"$D$48","v":1674342.9287284072},null,{"$f":"$E$48","v":2810408.3812469207},null,{"$f":"$F$59","v":0.14000000000000001},null,{"$f":"CashFlow!$C$38*Assumptions!$B$52","v":1840500}]
[]
[null,"DEBT FINANCE",{"$f":"$D$50","v":1004605.7572370443},"DEBT FINANCE",{"$f":"$E$50","v":1686245.0287481523},"COST OF DEBT",{"$f":"$E$58","v":0.1},"EBITDA *",{"$f":"CashFlow!$C$38","v":736200}]
[null,{"$f":"IF(Assumptions!$B$48=\"Yes\",\"NPV\",\"EQUITY FINANCE\")","v":"EQUITY FINANCE"},{"$f":"IF(Assumptions!$B$48=\"Yes\",$D$52,$D$49)","v":669737.17149136297},{"$f":"IF(Assumptions!$B$48=\"Yes\",\"NPV\",\"EQUITY FINANCE\")","v":"EQUITY FINANCE"},{"$f":"IF(Assumptions!$B$48=\"Yes\",$E$52,$E$49)","v":1124163.3524987684},"COST OF EQUITY",{"$f":"$E$57","v":0.2},"MULTIPLE",{"$f":"Assumptions!$B$52","v":2.5}]
[null,{"$f":"IF($G$70<>0,\"TERMINAL VALUE\",IF(Assumptions!$B$48=\"Yes\",\"IRR\",\"TOTAL\"))","v":"TOTAL"},{"$f":"IF($G$70<>0,$G$70*-PV($F$59,3,0,1,0),IF(Assumptions!$B$48=\"Yes\",FIXED($D$51*100,1)&\"%\",SUM(C9:C10)))","v":1674342.9287284072},{"$f":"IF($I$65<>0,\"TERMINAL VALUE\",IF(Assumptions!$B$48=\"Yes\",\"IRR\",\"TOTAL\"))","v":"TOTAL"},{"$f":"IF($I$65<>0,$I$65*-PV($F$59,5,0,1,0),IF(Assumptions!$B$48=\"Yes\",FIXED($E$51*100,1)&\"%\",SUM(E9:E10)))","v":2810408.3812469207},"DEBT %",{"$f":"Assumptions!$B$53","v":0.6},"* YEAR 1 PBIT PER FORECAST"]
[]
[]
[]
[]
[]
[]
[]
[]
[]
[]
[]
[]
[]
[]
[]
[]
[null,"Cash Flow Calculation Highlights"]
[null,null,null,null,"Year 1","Year 2","Year 3","Year 4","Year 5"]
[null,"Turnover",null,null,{"$f":"CashFlow!C5","v":5000000},{"$f":"CashFlow!D5","v":5500000},{"$f":"CashFlow!E5","v":6050000.0000000009},{"$f":"CashFlow!F5","v":6352500.0000000009},{"$f":"CashFlow!G5","v":6670125.0000000009}]
[null,"Annual Growth %",null,null,null,{"$f":"IF(E30=0,0,(F30-E30)/E30)","v":0.1},{"$f":"IF(F30=0,0,(G30-F30)/F30)","v":0.10000000000000017},4.9999999999999989E-2,4.9999999999999996E-2]
[null,"Gross Profit",null,null,{"$f":"CashFlow!C9","v":1750000},{"$f":"CashFlow!D9","v":1924999.9999999998},{"$f":"CashFlow!E9","v":2117500},{"$f":"CashFlow!F9","v":2413950.0000000005},{"$f":"CashFlow!G9","v":2534647.5000000005}]
[null,"Gross Profit %",null,null,{"$f":"CashFlow!C10","v":0.35},{"$f":"CashFlow!D10","v":0.35},{"$f":"CashFlow!E10","v":0.35},{"$f":"CashFlow!F10","v":0.38},{"$f":"CashFlow!G10","v":0.38}]
[null,"Total Expenses",null,null,{"$f":"-CashFlow!C36","v":-1013800},{"$f":"-CashFlow!D36","v":-1074628},{"$f":"-CashFlow!E36","v":-1139105.68},{"$f":"-CashFlow!F36","v":-1196060.9639999999},{"$f":"-CashFlow!G36","v":-1255864.0122000002}]
[null,"Annual Expense Inflation %",null,null,null,{"$f":"IF(E34=0,0,(F34-E34)/E34)","v":0.06},{"$f":"IF(F34=0,0,(G34-F34)/F34)","v":5.9999999999999942E-2},4.9999999999999989E-2,5.000000000000026E-2]
[null,"Profit Before Interest & Tax (PBIT)",null,null,{"$f":"CashFlow!C38","v":736200},{"$f":"CashFlow!D38","v":850371.99999999977},{"$f":"CashFlow!E38","v":978394.32000000007},{"$f":"CashFlow!F38","v":1217889.0360000005},{"$f":"CashFlow!G38","v":1278783.4878000002}]
[null,"PBIT %",null,null,{"$f":"IF(E30=0,0,E36/E30)","v":0.14724000000000001},{"$f":"IF(F30=0,0,F36/F30)","v":0.15461309090909087},0.16171806942148759,0.19171806942148767,0.19171806942148761]
[null,"Changes In Working Capital",null,null,{"$f":"CashFlow!C40","v":-62000},{"$f":"CashFlow!D40","v":-43000},{"$f":"CashFlow!E40","v":-48000},{"$f":"CashFlow!F40","v":-27000},{"$f":"CashFlow!G40","v":-21000}]
[null,"Capital Expenditure",null,null,{"$f":"CashFlow!C45","v":-60000},{"$f":"CashFlow!D45","v":-60000},{"$f":"CashFlow!E45","v":-100000},{"$f":"CashFlow!F45","v":-200000},{"$f":"CashFlow!G45","v":-200000}]
[null,"Annual Cash Flow",null,null,{"$f":"CashFlow!C47","v":614200},{"$f":"CashFlow!D47","v":747371.99999999977},{"$f":"CashFlow!E47","v":830394.32000000007},{"$f":"CashFlow!F47","v":990889.03600000055},{"$f":"CashFlow!G47","v":1057783.4878000002}]
{"$rows_left_out":31}