{"text_format":"1","workbook":"xlsx","n_sheets":11,"sheets":["Info","Trial","Instructions","TransCode","Statement","Summary","Review","InitialAmort","ForecastPmt","ForecastAmort","CalcAmort"],"not_rendered":{"charts":0,"images":2,"macros":1,"external_links":0,"defined_names":23,"comments":0,"pivot_tables":0},"unopened":[],"bounds":{"document_bytes":16777216,"sheet_cells":100000,"rows_first":2000,"rows_last":500,"rows_between":2000,"halvings":0,"cell_chars":16384,"cell_head_chars":4096},"cells_cut":0,"cells_raw":0,"read":"whole","date_system":"1900"}

{"sheet":"Info","index":0,"n_rows":0,"n_cols":0,"rows_kept":0,"cut":false,"hidden":false,"merged":[]}

{"sheet":"Trial","index":1,"n_rows":0,"n_cols":0,"rows_kept":0,"cut":false,"hidden":true,"merged":[]}

{"sheet":"Instructions","index":2,"n_rows":194,"n_cols":1,"rows_kept":194,"cut":false,"hidden":true,"merged":[]}
["Excel Skills | Loan Calculation & Analysis Template"]
["Instructions"]
["www.excel-skills.com"]
[]
["This template enables users to calculate, analyze and forecast the monthly loan balances and interest charges relating to any loan that is subject to monthly repayment and daily interest calculations. The template was specifically designed for home loan calculations but can be used for any loan where the principles of monthly repayment and daily interest are applied."]
[]
["The main purpose of this template is to calculate loan balances and interest amounts based on the same calculation methodology that is applied by most financial institutions. This template can therefore be used to recalculate the amounts on the loan account statements that are received from financial institutions. The template accommodates multiple interest rate changes (variable interest rates), increased instalments and ad hoc loan repayments. In addition, the template also includes comprehensive forecast features which provide users with the functionality to analyze any loan over the entire loan period."]
[]
["Note: Refer to our Loan Statement template for a simplified version of this template. The Loan Statement template only includes the statement and summary features of this template and is therefore a lot simpler to understand and use. If you are only interested in loan amortization calculations, we recommend that you download our free Loan Amortization template."]
[]
["Worksheet Summary"]
[]
["The main purpose of each worksheet is as follows:"]
[]
["TransCode - includes the default transaction types that need to be selected when entering loan account transactions. Additional transaction types can also be added to the default list of transactions codes."]
{"$rows_left_out":180}
{"sheet":"TransCode","index":3,"n_rows":10,"n_cols":2,"rows_kept":10,"cut":false,"hidden":true,"merged":[]}
["Transaction Codes"]
[]
["Code","Transaction Type"]
[1,"Loan Advance"]
[2,"Loan Repayment"]
[3,"Ad Hoc Repayment"]
[4,"Interest Capitalized"]
[5,"Interest Rate Change"]
[6,"Admin Fee"]
[7,"Insurance Premium"]

{"sheet":"Statement","index":4,"n_rows":90,"n_cols":12,"rows_kept":90,"cut":false,"hidden":true,"merged":[]}
["Loan Statement"]
["© www.excel-skills.com"]
["Date","Code","Transaction Description","New Interest Rate","Transaction Amount","Calculated Interest","Outstanding Balance","Interest \nRate","Transaction Month","Interest \nDays","Transaction Closing","Accrued Interest"]
[43556,5,{"$f":"IF(ISNA(VLOOKUP($B4,Transactions,2,0))=TRUE,\"Select Valid Code\",VLOOKUP($B4,Transactions,2,0))","v":"Interest Rate Change"},0.1,0,{"$f":"IF(B4<>4,0,SUM(OFFSET($L$3,1,0,ROW(L4)-ROW($L$3),1))-SUM(OFFSET($F$3,1,0,ROW(G4)-ROW($G$3)-1,1)))","v":0},{"$f":"SUM(E4:F4)+SUM(OFFSET(A4,-1,COLUMN($G$3)-1,1,1))","v":0},{"$f":"IF(B4=5,D4,SUM(OFFSET(A4,-1,COLUMN($H$3)-1,1,1)))","v":0.1},{"$f":"YEAR(A4)&\"/\"&MONTH(A4)","v":"2019/4"},{"$f":"IF(I4<>OFFSET(A4,-1,COLUMN($I$3)-1,1,1),IF(B4=4,A4-1-DATE(YEAR(A4),MONTH(A4),0)+1,A4-1-DATE(YEAR(A4),MONTH(A4),0)),IF(B4=4,A4-OFFSET(A4,-1,0,1,1)+1,A4-OFFSET(A4,-1,0,1,1)))","v":0},{"$f":"IF(ISNUMBER(OFFSET(G4,-1,0,1,1))=FALSE,0,OFFSET(G4,-1,0,1,1))","v":0},{"$f":"IF(ISNUMBER(OFFSET(H4,-1,0,1,1))=FALSE,0,K4*J4/365*OFFSET(H4,-1,0,1,1))","v":0}]
[43556,1,"Loan Advance",0,2000000,{"$f":"IF(B5<>4,0,SUM(OFFSET($L$3,1,0,ROW(L5)-ROW($L$3),1))-SUM(OFFSET($F$3,1,0,ROW(G5)-ROW($G$3)-1,1)))","v":0},{"$f":"SUM(E5:F5)+SUM(OFFSET(A5,-1,COLUMN($G$3)-1,1,1))","v":2000000},{"$f":"IF(B5=5,D5,SUM(OFFSET(A5,-1,COLUMN($H$3)-1,1,1)))","v":0.1},{"$f":"YEAR(A5)&\"/\"&MONTH(A5)","v":"2019/4"},0,{"$f":"IF(ISNUMBER(OFFSET(G5,-1,0,1,1))=FALSE,0,OFFSET(G5,-1,0,1,1))","v":0},{"$f":"IF(ISNUMBER(OFFSET(H5,-1,0,1,1))=FALSE,0,K5*J5/365*OFFSET(H5,-1,0,1,1))","v":0}]
[43557,6,"Admin Fee",0,80,0,2000080,0.1,"2019/4",1,2000000,547.94520547945206]
[43558,7,"Insurance Premium",0,370,0,2000450,0.1,"2019/4",1,2000080,547.96712328767126]
[43562,2,"Loan Repayment",0,-19750.43,0,1980699.57,0.1,"2019/4",4,2000450,2192.2739726027398]
[43585,4,"Interest Capitalized",0,0,16311.964295890411,1997011.5342958905,0.1,"2019/4",24,1980699.57,13023.777994520548]
[43587,6,"Admin Fee",0,80,0,1997091.5342958905,0.1,"2019/5",1,1997011.5342958905,547.12644775229876]
[43588,7,"Insurance Premium",0,370,0,1997461.5342958905,0.1,"2019/5",1,1997091.5342958905,547.14836556051796]
[43592,2,"Loan Repayment",0,-19750.43,0,1977711.1042958905,0.1,"2019/5",4,1997461.5342958905,2188.9989416941266]
[43616,4,"Interest Capitalized",0,0,16829.240222787023,1994540.3445186776,0.1,"2019/5",25,1977711.1042958905,13545.966467780074]
[43618,6,"Admin Fee",0,80,0,1994620.3445186776,0.1,"2019/6",1,1994540.3445186776,546.4494094571719]
[43619,7,"Insurance Premium",0,370,0,1994990.3445186776,0.1,"2019/6",1,1994620.3445186776,546.4713272653911]
{"$rows_left_out":76}
{"sheet":"Summary","index":5,"n_rows":24,"n_cols":11,"rows_kept":24,"cut":false,"hidden":true,"merged":[]}
["Loan Summary"]
["© www.excel-skills.com"]
["Month","Opening Balance"," Loan Advance "," Loan Repayment "," Ad Hoc Repayment "," Interest Capitalized "," Admin \nFees"," Insurance Premium ","Other \nCosts","Closing Balance","Number of Repayments"]
[{"$f":"IF(ISNUMBER(A3)=FALSE,DATE(YEAR(OFFSET(Statement!$A$3,1,0,1,1)),MONTH(OFFSET(Statement!$A$3,1,0,1,1))+1,0),DATE(YEAR(A3),MONTH(A3)+2,0))","v":"2019-04-30"},{"$f":"IF(ISNUMBER(B3)=FALSE,0,J3)","v":0},{"$f":"SUMPRODUCT((TransDate>=DATE(YEAR($A4),MONTH($A4),1))*(TransDate<=$A4)*(TransCode=1)*(TransAmount))","v":2000000},{"$f":"SUMPRODUCT((TransDate>=DATE(YEAR($A4),MONTH($A4),1))*(TransDate<=$A4)*(TransCode=2)*(TransAmount))","v":-19750.43},{"$f":"SUMPRODUCT((TransDate>=DATE(YEAR($A4),MONTH($A4),1))*(TransDate<=$A4)*(TransCode=3)*(TransAmount))","v":0},{"$f":"SUMPRODUCT((TransDate>=DATE(YEAR($A4),MONTH($A4),1))*(TransDate<=$A4)*(TransCode=4)*(TransInt))","v":16311.964295890411},{"$f":"SUMPRODUCT((TransDate>=DATE(YEAR($A4),MONTH($A4),1))*(TransDate<=$A4)*(TransCode=6)*(TransAmount))","v":80},{"$f":"SUMPRODUCT((TransDate>=DATE(YEAR($A4),MONTH($A4),1))*(TransDate<=$A4)*(TransCode=7)*(TransAmount))","v":370},{"$f":"IF(SUMPRODUCT((TransDate>=DATE(YEAR($A4),MONTH($A4),1))*(TransDate<=$A4)*(TransAmount))+SUMPRODUCT((TransDate>=DATE(YEAR($A4),MONTH($A4),1))*(TransDate<=$A4)*(TransInt))-SUM(C4:H4)<0.009,0,SUMPRODUCT((TransDate>=DATE(YEAR($A4),MONTH($A4),1))*(TransDate<=$A4)*(TransAmount))+SUMPRODUCT((TransDate>=DATE(YEAR($A4),MONTH($A4),1))*(TransDate<=$A4)*(TransInt))-SUM(C4:H4))","v":0},{"$f":"SUM(B4:I4)","v":1997011.5342958905},{"$f":"IF(ISNA(MATCH($A4,StateMonth,0))=TRUE,\"month end?\",COUNTIF(OFFSET(Statement!$A$3,0,0,MATCH($A4,StateMonth,0),2),\"2\"))","v":1}]
[{"$f":"IF(ISNUMBER(A4)=FALSE,DATE(YEAR(OFFSET(Statement!$A$3,1,0,1,1)),MONTH(OFFSET(Statement!$A$3,1,0,1,1))+1,0),DATE(YEAR(A4),MONTH(A4)+2,0))","v":"2019-05-31"},{"$f":"IF(ISNUMBER(B4)=FALSE,0,J4)","v":1997011.5342958905},0,-19750.43,0,16829.240222787023,80,370,0,{"$f":"SUM(B5:I5)","v":1994540.3445186776},{"$f":"IF(ISNA(MATCH($A5,StateMonth,0))=TRUE,\"month end?\",COUNTIF(OFFSET(Statement!$A$3,0,0,MATCH($A5,StateMonth,0),2),\"2\"))","v":2}]
[{"$f":"IF(ISNUMBER(A5)=FALSE,DATE(YEAR(OFFSET(Statement!$A$3,1,0,1,1)),MONTH(OFFSET(Statement!$A$3,1,0,1,1))+1,0),DATE(YEAR(A5),MONTH(A5)+2,0))","v":"2019-06-30"},1994540.3445186776,0,-19750.43,0,16267.09041522201,80,370,0,1991507.0049338997,{"$f":"IF(ISNA(MATCH($A6,StateMonth,0))=TRUE,\"month end?\",COUNTIF(OFFSET(Statement!$A$3,0,0,MATCH($A6,StateMonth,0),2),\"2\"))","v":3}]
[{"$f":"IF(ISNUMBER(A6)=FALSE,DATE(YEAR(OFFSET(Statement!$A$3,1,0,1,1)),MONTH(OFFSET(Statement!$A$3,1,0,1,1))+1,0),DATE(YEAR(A6),MONTH(A6)+2,0))","v":"2019-07-31"},1991507.0049338997,0,-19750.43,0,16782.489425465996,80,370,0,1988989.0643593657,{"$f":"IF(ISNA(MATCH($A7,StateMonth,0))=TRUE,\"month end?\",COUNTIF(OFFSET(Statement!$A$3,0,0,MATCH($A7,StateMonth,0),2),\"2\"))","v":4}]
[{"$f":"IF(ISNUMBER(A7)=FALSE,DATE(YEAR(OFFSET(Statement!$A$3,1,0,1,1)),MONTH(OFFSET(Statement!$A$3,1,0,1,1))+1,0),DATE(YEAR(A7),MONTH(A7)+2,0))","v":"2019-08-31"},1988989.0643593657,0,-19750.43,0,16761.10417675077,80,370,0,1986449.7385361167,{"$f":"IF(ISNA(MATCH($A8,StateMonth,0))=TRUE,\"month end?\",COUNTIF(OFFSET(Statement!$A$3,0,0,MATCH($A8,StateMonth,0),2),\"2\"))","v":5}]
[{"$f":"IF(ISNUMBER(A8)=FALSE,DATE(YEAR(OFFSET(Statement!$A$3,1,0,1,1)),MONTH(OFFSET(Statement!$A$3,1,0,1,1))+1,0),DATE(YEAR(A8),MONTH(A8)+2,0))","v":"2019-09-30"},1986449.7385361167,0,-19750.43,0,16200.592283858496,80,370,0,1983349.9008199752,{"$f":"IF(ISNA(MATCH($A9,StateMonth,0))=TRUE,\"month end?\",COUNTIF(OFFSET(Statement!$A$3,0,0,MATCH($A9,StateMonth,0),2),\"2\"))","v":6}]
[{"$f":"IF(ISNUMBER(A9)=FALSE,DATE(YEAR(OFFSET(Statement!$A$3,1,0,1,1)),MONTH(OFFSET(Statement!$A$3,1,0,1,1))+1,0),DATE(YEAR(A9),MONTH(A9)+2,0))","v":"2019-10-31"},1983349.9008199752,0,-19750.43,0,16713.209911073762,80,370,0,1980762.680731049,{"$f":"IF(ISNA(MATCH($A10,StateMonth,0))=TRUE,\"month end?\",COUNTIF(OFFSET(Statement!$A$3,0,0,MATCH($A10,StateMonth,0),2),\"2\"))","v":7}]
[{"$f":"IF(ISNUMBER(A10)=FALSE,DATE(YEAR(OFFSET(Statement!$A$3,1,0,1,1)),MONTH(OFFSET(Statement!$A$3,1,0,1,1))+1,0),DATE(YEAR(A10),MONTH(A10)+2,0))","v":"2019-11-30"},1980762.680731049,0,-19750.43,0,16261.326726596628,80,370,0,1977723.5774576457,{"$f":"IF(ISNA(MATCH($A11,StateMonth,0))=TRUE,\"month end?\",COUNTIF(OFFSET(Statement!$A$3,0,0,MATCH($A11,StateMonth,0),2),\"2\"))","v":8}]
[{"$f":"IF(ISNUMBER(A11)=FALSE,DATE(YEAR(OFFSET(Statement!$A$3,1,0,1,1)),MONTH(OFFSET(Statement!$A$3,1,0,1,1))+1,0),DATE(YEAR(A11),MONTH(A11)+2,0))","v":"2019-12-31"},1977723.5774576457,0,-19909.05,0,17080.946717114159,80,370,0,1975345.4741747598,{"$f":"IF(ISNA(MATCH($A12,StateMonth,0))=TRUE,\"month end?\",COUNTIF(OFFSET(Statement!$A$3,0,0,MATCH($A12,StateMonth,0),2),\"2\"))","v":9}]
[{"$f":"IF(ISNUMBER(A12)=FALSE,DATE(YEAR(OFFSET(Statement!$A$3,1,0,1,1)),MONTH(OFFSET(Statement!$A$3,1,0,1,1))+1,0),DATE(YEAR(A12),MONTH(A12)+2,0))","v":"2020-01-31"},1975345.4741747598,0,-19909.05,0,17060.244187850156,80,370,0,1972946.66836261,{"$f":"IF(ISNA(MATCH($A13,StateMonth,0))=TRUE,\"month end?\",COUNTIF(OFFSET(Statement!$A$3,0,0,MATCH($A13,StateMonth,0),2),\"2\"))","v":10}]
[{"$f":"IF(ISNUMBER(A13)=FALSE,DATE(YEAR(OFFSET(Statement!$A$3,1,0,1,1)),MONTH(OFFSET(Statement!$A$3,1,0,1,1))+1,0),DATE(YEAR(A13),MONTH(A13)+2,0))","v":"2020-02-29"},1972946.66836261,0,-19909.05,0,15942.19715433658,80,370,0,1969429.8155169466,{"$f":"IF(ISNA(MATCH($A14,StateMonth,0))=TRUE,\"month end?\",COUNTIF(OFFSET(Statement!$A$3,0,0,MATCH($A14,StateMonth,0),2),\"2\"))","v":11}]
[{"$f":"IF(ISNUMBER(A14)=FALSE,DATE(YEAR(OFFSET(Statement!$A$3,1,0,1,1)),MONTH(OFFSET(Statement!$A$3,1,0,1,1))+1,0),DATE(YEAR(A14),MONTH(A14)+2,0))","v":"2020-03-31"},1969429.8155169466,0,-19909.05,0,17008.745542959135,80,370,0,1966979.5110599056,{"$f":"IF(ISNA(MATCH($A15,StateMonth,0))=TRUE,\"month end?\",COUNTIF(OFFSET(Statement!$A$3,0,0,MATCH($A15,StateMonth,0),2),\"2\"))","v":12}]
{"$rows_left_out":10}
{"sheet":"Review","index":6,"n_rows":25,"n_cols":9,"rows_kept":25,"cut":false,"hidden":true,"merged":[]}
["Loan Review"]
[]
["Review Date",44196,{"$f":"IF(B6=\"Error\",\"No transactions recorded for this period. Select a new period!\",\"\")","v":""}]
[]
["Loan Period",{"$f":"InitialAmort!$D$5","v":240}]
["Number of Actual Repayments",{"$f":"IF(ISNUMBER(VLOOKUP($B$3,Summary!$A$4:K260,COLUMN(Summary!$K$3),0))=FALSE,\"Error\",VLOOKUP($B$3,Summary!$A$4:K260,COLUMN(Summary!$K$3),0))","v":21}]
["Remaining Loan Repayments",{"$f":"InitialAmort!$D$5-B6","v":219}]
["© www.excel-skills.com"]
["Loan History (as at review date)","Initial Amortization","Actual \nLoan","Difference",null,"Loan Period Summary","Initial Amortization","Actual Loan: Standard","Actual Loan: Forecast"]
["Loan Advances",{"$f":"InitialAmort!$D$3","v":2000000},{"$f":"SUM(OFFSET(Summary!$A$3,1,2,MATCH(Review!$B$3,ReviewDates,0),1))","v":2000000},{"$f":"B10-C10","v":0},null,"Total Interest Charges",{"$f":"B17+B24","v":2632103.8963552429},{"$f":"C24+C17","v":2707082.2701772121},{"$f":"D24+C17","v":2707082.2701772121}]
[null,null,null,null,null,"Total Capital Repayments",{"$f":"B23+B16","v":1999999.9999999951},{"$f":"C23+C16","v":1999999.9999999993},{"$f":"D23+C16","v":1999999.9999999993}]
["Scheduled Loan Repayments",{"$f":"IF(ISNA(MATCH(Review!$B$3,InitialAmort!$A$9:$A$368,0))=TRUE,0,SUM(OFFSET(InitialAmort!$A$8,1,3,MATCH(Review!$B$3,InitialAmort!$A$9:$A$368,0),1)))","v":405309.09093108342},{"$f":"-SUM(OFFSET(Summary!$A$3,1,3,MATCH(Review!$B$3,ReviewDates,0),1))","v":417136.08999999985},{"$f":"B12-C12","v":-11826.999068916426},null,"Total Loan Repayments",{"$f":"SUM(G10:G11)","v":4632103.8963552378},{"$f":"SUM(H10:H11)","v":4707082.2701772116},{"$f":"SUM(I10:I11)","v":4707082.2701772116}]
["Ad Hoc Loan Repayments",0,{"$f":"-SUM(OFFSET(Summary!$A$3,1,4,MATCH(Review!$B$3,ReviewDates,0),1))","v":0},0,null,"Interest: Actual vs Initial Amortization",null,{"$f":"G10-H10","v":-74978.373821969144}]
[null,{"$f":"SUM(B12:B13)","v":405309.09093108342},{"$f":"SUM(C12:C13)","v":417136.08999999985},{"$f":"SUM(D12:D13)","v":-11826.999068916426},null,"Actual Interest: Amortization vs Forecast",null,null,{"$f":"H10-I10","v":0}]
["Loan Repayment Breakdown",null,null,null,null,"Effective Annual Interest Rate",{"$f":"RATE(InitialAmort!$D$5,-SUM($G$10:$G$11)/InitialAmort!$D$5,$G$11,0,0)*12","v":9.9999999999999728E-2},{"$f":"IF(H11<0.009,0,RATE(InitialAmort!$D$5,-SUM($H$10:$H$11)/InitialAmort!$D$5,$H$11,0,0)*12)","v":0.10234989731028286},{"$f":"IF(I$11<0.009,0,RATE(InitialAmort!$D$5,-SUM($I$10:$I$11)/InitialAmort!$D$5,$I$11,0,0)*12)","v":0.10234989731028286}]
{"$rows_left_out":11}
{"sheet":"InitialAmort","index":7,"n_rows":369,"n_cols":8,"rows_kept":369,"cut":false,"hidden":true,"merged":[[5,0,5,1],[2,0,2,1],[3,0,3,1],[4,0,4,1]]}
["Initial Loan Amortization Table"]
[]
["Principle Loan Amount",null,null,2000000,null,null,null,{"$f":"Review!C10","v":2000000}]
["Annual Interest Rate",null,null,0.1]
["Loan Period (in Months)",null,null,240]
["Repayment Commencement Date",null,null,43556]
["© www.excel-skills.com"]
["Month","Repayment Number","Opening Balance","Loan Repayment","Interest Charged","Capital \nRepaid","Closing Balance","% \nOutstanding"]
[{"$f":"DATE(YEAR($D$6),MONTH($D$6)+1,1-1)","v":"2019-04-30"},1,{"$f":"$D$3","v":2000000},{"$f":"-PMT($D$4/12,$D$5,$D$3,0,0)","v":19300.432901480159},{"$f":"C9*$D$4/12","v":16666.666666666668},{"$f":"D9-E9","v":2633.7662348134909},{"$f":"C9-F9","v":1997366.2337651865},{"$f":"G9/$D$3","v":0.99868311688259326}]
[{"$f":"DATE(YEAR(A9),MONTH(A9)+2,1-1)","v":"2019-05-31"},2,{"$f":"IF(ROUND(G9,0)>0,G9,0)","v":1997366.2337651865},{"$f":"IF($D$5+1-B10=0,0,D9)","v":19300.432901480159},16644.718614709887,2655.7142867702714,1994710.5194784163,0.99735525973920813]
["2019-06-30",3,1994710.5194784163,19300.432901480159,16622.587662320137,2677.8452391600222,1992032.6742392562,0.99601633711962811]
["2019-07-31",4,1992032.6742392562,19300.432901480159,16600.272285327137,2700.1606161530217,1989332.5136231033,0.99466625681155163]
["2019-08-31",5,1989332.5136231033,19300.432901480159,16577.770946859197,2722.6619546209622,1986609.8516684824,0.99330492583424124]
["2019-09-30",6,1986609.8516684824,19300.432901480159,16555.082097237355,2745.3508042428039,1983864.5008642396,0.99193225043211986]
["2019-10-31",7,1983864.5008642396,19300.432901480159,16532.204173868664,2768.2287276114948,1981096.2721366282,0.99054813606831404]
{"$rows_left_out":355}
{"sheet":"ForecastPmt","index":8,"n_rows":366,"n_cols":3,"rows_kept":366,"cut":false,"hidden":true,"merged":[[2,0,2,1]]}
["Loan Repayment Forecast | Ad Hoc Loan Repayments"]
[]
["Review Date",null,{"$f":"Review!$B$3","v":"2020-12-31"}]
["© www.excel-skills.com"]
["Month","Repayment Number","Ad Hoc Repayment"]
[{"$f":"Summary!$A$4","v":"2019-04-30"},1,0]
[{"$f":"DATE(YEAR(A6),MONTH(A6)+2,1-1)","v":"2019-05-31"},2,0]
["2019-06-30",3,0]
["2019-07-31",4,0]
["2019-08-31",5,0]
["2019-09-30",6,0]
["2019-10-31",7,0]
["2019-11-30",8,0]
["2019-12-31",9,0]
["2020-01-31",10,0]
{"$rows_left_out":352}
{"sheet":"ForecastAmort","index":9,"n_rows":369,"n_cols":16,"rows_kept":369,"cut":false,"hidden":true,"merged":[[6,10,6,15],[5,0,5,1],[2,0,2,1],[3,0,3,1],[4,0,4,1]]}
["Loan Repayment Forecast | Amortization Table"]
[]
["Outstanding Loan Balance",null,{"$f":"Review!C20","v":1941680.4538003374}]
["Statement Interest Rate",null,{"$f":"VLOOKUP($C$6,StatementRange,8,1)","v":0.10249999999999999}]
["Remaining Loan Repayments",null,{"$f":"Review!B7","v":219}]
["Review Date",null,{"$f":"Review!B3","v":44196}]
["© www.excel-skills.com",null,null,null,null,null,null,null,null,null,"Standard Amortization"]
["Month","Repayment Number","Opening Balance","Ad Hoc Repayment","Loan Repayment","Interest","Capital","Closing Balance","% \nOutstanding",null,"Opening Balance","Loan Repayment","Interest","Capital","Closing Balance","% \nOutstanding"]
[{"$f":"DATE(YEAR(C6),MONTH(C6)+2,1-1)","v":"2021-01-31"},1,{"$f":"$C$3","v":1941680.4538003374},{"$f":"IF(ISNA(VLOOKUP($A9,ForecastPmt!$A$6:$C$365,3,0))=TRUE,0,VLOOKUP($A9,ForecastPmt!$A$6:$C$365,3,0))","v":0},{"$f":"-PMT($C$4/12,$C$5,$C$3,0,0)","v":19633.384384370827},{"$f":"C9*$C$4/12","v":16585.187209544547},{"$f":"D9+E9-F9","v":3048.1971748262804},{"$f":"IF(C9-G9<0.009,0,C9-G9)","v":1938632.2566255112},{"$f":"H9/$C$3","v":0.99843012419017763},null,{"$f":"$C$3","v":1941680.4538003374},{"$f":"-PMT($C$4/12,$C$5,$C$3,0,0)","v":19633.384384370827},{"$f":"K9*$C$4/12","v":16585.187209544547},{"$f":"L9-M9","v":3048.1971748262804},{"$f":"IF(K9-N9<0.009,0,K9-N9)","v":1938632.2566255112},{"$f":"O9/$C$3","v":0.99843012419017763}]
[{"$f":"DATE(YEAR(A9),MONTH(A9)+2,1-1)","v":"2021-02-28"},2,{"$f":"IF(H9>0,H9,0)","v":1938632.2566255112},{"$f":"IF(ISNA(VLOOKUP($A10,ForecastPmt!$A$6:$C$365,3,0))=TRUE,0,VLOOKUP($A10,ForecastPmt!$A$6:$C$365,3,0))","v":0},{"$f":"IF(H9>$E$9,$E$9,IF(H9+F10>$E$9,$E$9,H9+F10))","v":19633.384384370827},16559.15052534291,{"$f":"D10+E10-F10","v":3074.2338590279178},{"$f":"IF(C10-G10<0.009,0,C10-G10)","v":1935558.0227664832},0.99684683902447946,null,{"$f":"IF(O9>0,O9,0)","v":1938632.2566255112},{"$f":"IF($C$5+1-B10=0,0,L9)","v":19633.384384370827},16559.15052534291,3074.2338590279178,{"$f":"IF(K10-N10<0.009,0,K10-N10)","v":1935558.0227664832},0.99684683902447946]
["2021-03-31",3,{"$f":"IF(H10>0,H10,0)","v":1935558.0227664832},{"$f":"IF(ISNA(VLOOKUP($A11,ForecastPmt!$A$6:$C$365,3,0))=TRUE,0,VLOOKUP($A11,ForecastPmt!$A$6:$C$365,3,0))","v":0},{"$f":"IF(H10>$E$9,$E$9,IF(H10+F11>$E$9,$E$9,H10+F11))","v":19633.384384370827},16532.891444463708,3100.4929399071189,1932457.5298265761,0.99525002996465783,null,{"$f":"IF(O10>0,O10,0)","v":1935558.0227664832},{"$f":"IF($C$5+1-B11=0,0,L10)","v":19633.384384370827},16532.891444463708,3100.4929399071189,1932457.5298265761,0.99525002996465783]
["2021-04-30",4,1932457.5298265761,{"$f":"IF(ISNA(VLOOKUP($A12,ForecastPmt!$A$6:$C$365,3,0))=TRUE,0,VLOOKUP($A12,ForecastPmt!$A$6:$C$365,3,0))","v":0},19633.384384370827,16506.408067268672,3126.976317102155,1929330.553509474,0.9936395814941168,null,1932457.5298265761,19633.384384370827,16506.408067268672,3126.976317102155,1929330.553509474,0.9936395814941168]
["2021-05-31",5,1929330.553509474,{"$f":"IF(ISNA(VLOOKUP($A13,ForecastPmt!$A$6:$C$365,3,0))=TRUE,0,VLOOKUP($A13,ForecastPmt!$A$6:$C$365,3,0))","v":0},19633.384384370827,16479.698477893424,3153.6859064774035,1926176.8676029965,0.99201537710955656,null,1929330.553509474,19633.384384370827,16479.698477893424,3153.6859064774035,1926176.8676029965,0.99201537710955656]
["2021-06-30",6,1926176.8676029965,{"$f":"IF(ISNA(VLOOKUP($A14,ForecastPmt!$A$6:$C$365,3,0))=TRUE,0,VLOOKUP($A14,ForecastPmt!$A$6:$C$365,3,0))","v":0},19633.384384370827,16452.760744108928,3180.6236402618997,1922996.2439627347,0.99037729931254492,null,1926176.8676029965,19633.384384370827,16452.760744108928,3180.6236402618997,1922996.2439627347,0.99037729931254492]
["2021-07-31",7,1922996.2439627347,{"$f":"IF(ISNA(VLOOKUP($A15,ForecastPmt!$A$6:$C$365,3,0))=TRUE,0,VLOOKUP($A15,ForecastPmt!$A$6:$C$365,3,0))","v":0},19633.384384370827,16425.592917181693,3207.791467189134,1919788.4524955456,0.98872522960101705,null,1922996.2439627347,19633.384384370827,16425.592917181693,3207.791467189134,1919788.4524955456,0.98872522960101705]
{"$rows_left_out":355}
{"sheet":"CalcAmort","index":10,"n_rows":369,"n_cols":8,"rows_kept":369,"cut":false,"hidden":true,"merged":[[5,0,5,1],[2,0,2,1],[3,0,3,1],[4,0,4,1]]}
["Loan Amortization Calculator"]
[]
["Outstanding Loan Balance",null,2000000]
["Annual Interest Rate",null,0.1]
["Loan Period (Months)",null,240]
["Calculation Date",null,43922]
["© www.excel-skills.com"]
["Month","Repayment Number","Opening Balance","Loan Repayment","Interest Charged","Capital \nRepaid","Closing Balance","% \nOutstanding"]
[{"$f":"DATE(YEAR(C6),MONTH(C6)+1,1-1)","v":"2020-04-30"},1,{"$f":"$C$3","v":2000000},{"$f":"-PMT(C4/12,C5,C3,0,0)","v":19300.432901480159},{"$f":"C9*$C$4/12","v":16666.666666666668},{"$f":"D9-E9","v":2633.7662348134909},{"$f":"C9-F9","v":1997366.2337651865},{"$f":"G9/$C$3","v":0.99868311688259326}]
[{"$f":"DATE(YEAR(A9),MONTH(A9)+2,1-1)","v":"2020-05-31"},2,{"$f":"IF(ROUND(G9,0)>0,G9,0)","v":1997366.2337651865},{"$f":"IF($C$5+1-B10=0,0,D9)","v":19300.432901480159},16644.718614709887,2655.7142867702714,1994710.5194784163,0.99735525973920813]
["2020-06-30",3,1994710.5194784163,19300.432901480159,16622.587662320137,2677.8452391600222,1992032.6742392562,0.99601633711962811]
["2020-07-31",4,1992032.6742392562,19300.432901480159,16600.272285327137,2700.1606161530217,1989332.5136231033,0.99466625681155163]
["2020-08-31",5,1989332.5136231033,19300.432901480159,16577.770946859197,2722.6619546209622,1986609.8516684824,0.99330492583424124]
["2020-09-30",6,1986609.8516684824,19300.432901480159,16555.082097237355,2745.3508042428039,1983864.5008642396,0.99193225043211986]
["2020-10-31",7,1983864.5008642396,19300.432901480159,16532.204173868664,2768.2287276114948,1981096.2721366282,0.99054813606831404]
{"$rows_left_out":354}