{"text_format":"1","workbook":"xlsx","n_sheets":8,"sheets":["Info","Trial","Instructions","Setup","Data","Cashbook","Recon","Dashboard"],"not_rendered":{"charts":7,"images":2,"macros":1,"external_links":0,"defined_names":26,"comments":0,"pivot_tables":0},"unopened":[],"bounds":{"document_bytes":16777216,"sheet_cells":100000,"rows_first":2000,"rows_last":500,"rows_between":2000,"halvings":0,"cell_chars":16384,"cell_head_chars":4096},"cells_cut":0,"cells_raw":0,"read":"whole","date_system":"1900"}

{"sheet":"Info","index":0,"n_rows":0,"n_cols":0,"rows_kept":0,"cut":false,"hidden":false,"merged":[]}

{"sheet":"Trial","index":1,"n_rows":0,"n_cols":0,"rows_kept":0,"cut":false,"hidden":true,"merged":[]}

{"sheet":"Instructions","index":2,"n_rows":188,"n_cols":1,"rows_kept":188,"cut":false,"hidden":true,"merged":[]}
["Excel Skills | Cashbook & Bank Reconciliation Template"]
["Instructions"]
["www.excel-skills.com"]
[]
["This template enables users to record deposit and withdrawal transactions for multiple bank accounts and automatically produces a monthly cashbook report, bank reconciliation and a unique dashboard. The cashbook report can be compiled for any 12 month reporting period by simply entering the appropriate start date in a single input cell and the report can be viewed on an individual account or consolidated basis. The template also accommodates petty cash transactions and sales tax calculations."]
[]
{"$rows_left_out":183}
{"sheet":"Setup","index":3,"n_rows":27,"n_cols":4,"rows_kept":27,"cut":false,"hidden":true,"merged":[[3,2,3,4]]}
["Cashbook Template"]
["Set-up"]
[]
["Business Name",null,"Example Company (Pty) Ltd"]
[]
["Sales Tax"]
{"$rows_left_out":22}
{"sheet":"Data","index":4,"n_rows":210,"n_cols":17,"rows_kept":210,"cut":false,"hidden":true,"merged":[]}
[{"$f":"Setup!$C$4","v":"Example Company (Pty) Ltd"}]
["Cashbook Transactions"]
["© www.excel-skills.com"]
["Transaction Date","Customer / Supplier","Reference","Description","Inclusive Amount","Tax 1 Code","Tax 2 Code","Bank Code","Account Number","Statement Date","Trn Type","Cashbook Balance","Sales Tax 1 Amount","Sales Tax 2 Amount","Exclusive Amount","Cashbook Balance Date","Error Code"]
["2020-02-28","Opening","O/B","Opening Bank Statement Balance",3400,"E","E","B1","BS-TRF","2020-02-28",{"$f":"IF(E5>=0,\"D\",\"W\")","v":"D"},{"$f":"SUMIFS(CBIncl,CBBalDate,\"<=\"&($A5+(ROW($A5)/86400)),CBBank,$H5)","v":3400},{"$f":"$E5/(1+IF(ISERROR($F5),0,IF(ISNA(MATCH($F5,TaxCode,0)),0,OFFSET(Setup!$D$7,MATCH($F5,TaxCode,0),0,1,1)))+IF(ISERROR($G5),0,IF(ISNA(MATCH($G5,TaxCode,0)),0,OFFSET(Setup!$D$7,MATCH($G5,TaxCode,0),0,1,1))))*IF(ISERROR($F5),0,IF(ISNA(MATCH($F5,TaxCode,0)),0,OFFSET(Setup!$D$7,MATCH($F5,TaxCode,0),0,1,1)))","v":0},{"$f":"$E5/(1+IF(ISERROR($F5),0,IF(ISNA(MATCH($F5,TaxCode,0)),0,OFFSET(Setup!$D$7,MATCH($F5,TaxCode,0),0,1,1)))+IF(ISERROR($G5),0,IF(ISNA(MATCH($G5,TaxCode,0)),0,OFFSET(Setup!$D$7,MATCH($G5,TaxCode,0),0,1,1))))*IF(ISERROR($G5),0,IF(ISNA(MATCH($G5,TaxCode,0)),0,OFFSET(Setup!$D$7,MATCH($G5,TaxCode,0),0,1,1)))","v":0},{"$f":"IF(TaxCount=2,E5-SUM(M5:N5),E5-SUM(M5:M5))","v":3400},{"$f":"IF(ISBLANK($A5)=TRUE,TODAY()+(ROW($A5)/86400),$A5+(ROW($A5)/86400))","v":"2020-02-28T00:00:05"},{"$f":"IF(AND(ISBLANK(J5)=FALSE,J5<A5),\"E1\",IF(AND(ISBLANK(I5)=FALSE,ISNA(VLOOKUP(I5,AccountAll,1,0))),\"E2\",IF(AND(ISBLANK(H5)=FALSE,ISNA(VLOOKUP(H5,BankCode,1,0))),\"E3\",\"-\")))","v":"-"}]
["2020-02-28","Opening","O/B","Opening Bank Statement Balance",1600,"E","E","B2","BS-TRF","2020-02-28","D",{"$f":"SUMIFS(CBIncl,CBBalDate,\"<=\"&($A6+(ROW($A6)/86400)),CBBank,$H6)","v":1600},{"$f":"$E6/(1+IF(ISERROR($F6),0,IF(ISNA(MATCH($F6,TaxCode,0)),0,OFFSET(Setup!$D$7,MATCH($F6,TaxCode,0),0,1,1)))+IF(ISERROR($G6),0,IF(ISNA(MATCH($G6,TaxCode,0)),0,OFFSET(Setup!$D$7,MATCH($G6,TaxCode,0),0,1,1))))*IF(ISERROR($F6),0,IF(ISNA(MATCH($F6,TaxCode,0)),0,OFFSET(Setup!$D$7,MATCH($F6,TaxCode,0),0,1,1)))","v":0},{"$f":"$E6/(1+IF(ISERROR($F6),0,IF(ISNA(MATCH($F6,TaxCode,0)),0,OFFSET(Setup!$D$7,MATCH($F6,TaxCode,0),0,1,1)))+IF(ISERROR($G6),0,IF(ISNA(MATCH($G6,TaxCode,0)),0,OFFSET(Setup!$D$7,MATCH($G6,TaxCode,0),0,1,1))))*IF(ISERROR($G6),0,IF(ISNA(MATCH($G6,TaxCode,0)),0,OFFSET(Setup!$D$7,MATCH($G6,TaxCode,0),0,1,1)))","v":0},{"$f":"IF(TaxCount=2,E6-SUM(M6:N6),E6-SUM(M6:M6))","v":1600},"2020-02-28T00:00:06","-"]
{"$rows_left_out":205}
{"sheet":"Cashbook","index":5,"n_rows":46,"n_cols":15,"rows_kept":46,"cut":false,"hidden":true,"merged":[]}
[{"$f":"Setup!$C$4","v":"Example Company (Pty) Ltd"},null,"Start Date","2020-03-01"]
["Monthly Cashbook Report",null,"Bank Account",null,{"$f":"IF(ISBLANK($D$2),\"*\",$D$2)","v":"*"}]
[{"$f":"IF(ISBLANK($D$2),\"All bank accounts\",VLOOKUP($D$2,BanksAll,2,0))","v":"All bank accounts"},null,"Report Type","All",{"$f":"IF($D$3=\"Deposits\",\"D\",IF($D$3=\"Withdrawals\",\"W\",\"*\"))","v":"*"}]
["© www.excel-skills.com"]
["Acc No","Account Description",{"$f":"IF(ISBLANK($D$1)=TRUE,DATE(YEAR(TODAY()),MONTH(TODAY())+1,0),DATE(YEAR($D$1),MONTH($D$1)+1,0))","v":"2020-03-31"},{"$f":"DATE(YEAR(C5),MONTH(C5)+2,0)","v":"2020-04-30"},{"$f":"DATE(YEAR(D5),MONTH(D5)+2,0)","v":"2020-05-31"},"2020-06-30","2020-07-31","2020-08-31","2020-09-30","2020-10-31","2020-11-30","2020-12-31","2021-01-31","2021-02-28","Total"]
["IS-100","Income from Services",{"$f":"SUMIFS(CBExcl,CBPayDate,\">=\"&DATE(YEAR(C$5),MONTH(C$5),1),CBPayDate,\"<=\"&C$5,CBType,$E$3,CBAccount,$A6,CBBank,$E$2)+IF($A6=\"BS-TAX1\",SUMIFS(CBTax1,CBPayDate,\">=\"&DATE(YEAR(C$5),MONTH(C$5),1),CBPayDate,\"<=\"&C$5,CBType,$E$3,CBBank,$E$2),0)+IF($A6=\"BS-TAX2\",IF(TaxCount=2,SUMIFS(CBTax2,CBPayDate,\">=\"&DATE(YEAR(C$5),MONTH(C$5),1),CBPayDate,\"<=\"&C$5,CBType,$E$3,CBBank,$E$2),0),0)","v":14869.565217391304},{"$f":"SUMIFS(CBExcl,CBPayDate,\">=\"&DATE(YEAR(D$5),MONTH(D$5),1),CBPayDate,\"<=\"&D$5,CBType,$E$3,CBAccount,$A6,CBBank,$E$2)+IF($A6=\"BS-TAX1\",SUMIFS(CBTax1,CBPayDate,\">=\"&DATE(YEAR(D$5),MONTH(D$5),1),CBPayDate,\"<=\"&D$5,CBType,$E$3,CBBank,$E$2),0)+IF($A6=\"BS-TAX2\",IF(TaxCount=2,SUMIFS(CBTax2,CBPayDate,\">=\"&DATE(YEAR(D$5),MONTH(D$5),1),CBPayDate,\"<=\"&D$5,CBType,$E$3,CBBank,$E$2),0),0)","v":62242.01739130434},{"$f":"SUMIFS(CBExcl,CBPayDate,\">=\"&DATE(YEAR(E$5),MONTH(E$5),1),CBPayDate,\"<=\"&E$5,CBType,$E$3,CBAccount,$A6,CBBank,$E$2)+IF($A6=\"BS-TAX1\",SUMIFS(CBTax1,CBPayDate,\">=\"&DATE(YEAR(E$5),MONTH(E$5),1),CBPayDate,\"<=\"&E$5,CBType,$E$3,CBBank,$E$2),0)+IF($A6=\"BS-TAX2\",IF(TaxCount=2,SUMIFS(CBTax2,CBPayDate,\">=\"&DATE(YEAR(E$5),MONTH(E$5),1),CBPayDate,\"<=\"&E$5,CBType,$E$3,CBBank,$E$2),0),0)","v":14869.565217391304},{"$f":"SUMIFS(CBExcl,CBPayDate,\">=\"&DATE(YEAR(F$5),MONTH(F$5),1),CBPayDate,\"<=\"&F$5,CBType,$E$3,CBAccount,$A6,CBBank,$E$2)+IF($A6=\"BS-TAX1\",SUMIFS(CBTax1,CBPayDate,\">=\"&DATE(YEAR(F$5),MONTH(F$5),1),CBPayDate,\"<=\"&F$5,CBType,$E$3,CBBank,$E$2),0)+IF($A6=\"BS-TAX2\",IF(TaxCount=2,SUMIFS(CBTax2,CBPayDate,\">=\"&DATE(YEAR(F$5),MONTH(F$5),1),CBPayDate,\"<=\"&F$5,CBType,$E$3,CBBank,$E$2),0),0)","v":17248.695652173912},{"$f":"SUMIFS(CBExcl,CBPayDate,\">=\"&DATE(YEAR(G$5),MONTH(G$5),1),CBPayDate,\"<=\"&G$5,CBType,$E$3,CBAccount,$A6,CBBank,$E$2)+IF($A6=\"BS-TAX1\",SUMIFS(CBTax1,CBPayDate,\">=\"&DATE(YEAR(G$5),MONTH(G$5),1),CBPayDate,\"<=\"&G$5,CBType,$E$3,CBBank,$E$2),0)+IF($A6=\"BS-TAX2\",IF(TaxCount=2,SUMIFS(CBTax2,CBPayDate,\">=\"&DATE(YEAR(G$5),MONTH(G$5),1),CBPayDate,\"<=\"&G$5,CBType,$E$3,CBBank,$E$2),0),0)","v":29045.217391304344},{"$f":"SUMIFS(CBExcl,CBPayDate,\">=\"&DATE(YEAR(H$5),MONTH(H$5),1),CBPayDate,\"<=\"&H$5,CBType,$E$3,CBAccount,$A6,CBBank,$E$2)+IF($A6=\"BS-TAX1\",SUMIFS(CBTax1,CBPayDate,\">=\"&DATE(YEAR(H$5),MONTH(H$5),1),CBPayDate,\"<=\"&H$5,CBType,$E$3,CBBank,$E$2),0)+IF($A6=\"BS-TAX2\",IF(TaxCount=2,SUMIFS(CBTax2,CBPayDate,\">=\"&DATE(YEAR(H$5),MONTH(H$5),1),CBPayDate,\"<=\"&H$5,CBType,$E$3,CBBank,$E$2),0),0)","v":31721.739130434784},{"$f":"SUMIFS(CBExcl,CBPayDate,\">=\"&DATE(YEAR(I$5),MONTH(I$5),1),CBPayDate,\"<=\"&I$5,CBType,$E$3,CBAccount,$A6,CBBank,$E$2)+IF($A6=\"BS-TAX1\",SUMIFS(CBTax1,CBPayDate,\">=\"&DATE(YEAR(I$5),MONTH(I$5),1),CBPayDate,\"<=\"&I$5,CBType,$E$3,CBBank,$E$2),0)+IF($A6=\"BS-TAX2\",IF(TaxCount=2,SUMIFS(CBTax2,CBPayDate,\">=\"&DATE(YEAR(I$5),MONTH(I$5),1),CBPayDate,\"<=\"&I$5,CBType,$E$3,CBBank,$E$2),0),0)","v":34695.65217391304},{"$f":"SUMIFS(CBExcl,CBPayDate,\">=\"&DATE(YEAR(J$5),MONTH(J$5),1),CBPayDate,\"<=\"&J$5,CBType,$E$3,CBAccount,$A6,CBBank,$E$2)+IF($A6=\"BS-TAX1\",SUMIFS(CBTax1,CBPayDate,\">=\"&DATE(YEAR(J$5),MONTH(J$5),1),CBPayDate,\"<=\"&J$5,CBType,$E$3,CBBank,$E$2),0)+IF($A6=\"BS-TAX2\",IF(TaxCount=2,SUMIFS(CBTax2,CBPayDate,\">=\"&DATE(YEAR(J$5),MONTH(J$5),1),CBPayDate,\"<=\"&J$5,CBType,$E$3,CBBank,$E$2),0),0)","v":31226.086956521736},{"$f":"SUMIFS(CBExcl,CBPayDate,\">=\"&DATE(YEAR(K$5),MONTH(K$5),1),CBPayDate,\"<=\"&K$5,CBType,$E$3,CBAccount,$A6,CBBank,$E$2)+IF($A6=\"BS-TAX1\",SUMIFS(CBTax1,CBPayDate,\">=\"&DATE(YEAR(K$5),MONTH(K$5),1),CBPayDate,\"<=\"&K$5,CBType,$E$3,CBBank,$E$2),0)+IF($A6=\"BS-TAX2\",IF(TaxCount=2,SUMIFS(CBTax2,CBPayDate,\">=\"&DATE(YEAR(K$5),MONTH(K$5),1),CBPayDate,\"<=\"&K$5,CBType,$E$3,CBBank,$E$2),0),0)","v":9566.0869565217381},{"$f":"SUMIFS(CBExcl,CBPayDate,\">=\"&DATE(YEAR(L$5),MONTH(L$5),1),CBPayDate,\"<=\"&L$5,CBType,$E$3,CBAccount,$A6,CBBank,$E$2)+IF($A6=\"BS-TAX1\",SUMIFS(CBTax1,CBPayDate,\">=\"&DATE(YEAR(L$5),MONTH(L$5),1),CBPayDate,\"<=\"&L$5,CBType,$E$3,CBBank,$E$2),0)+IF($A6=\"BS-TAX2\",IF(TaxCount=2,SUMIFS(CBTax2,CBPayDate,\">=\"&DATE(YEAR(L$5),MONTH(L$5),1),CBPayDate,\"<=\"&L$5,CBType,$E$3,CBBank,$E$2),0),0)","v":29640},{"$f":"SUMIFS(CBExcl,CBPayDate,\">=\"&DATE(YEAR(M$5),MONTH(M$5),1),CBPayDate,\"<=\"&M$5,CBType,$E$3,CBAccount,$A6,CBBank,$E$2)+IF($A6=\"BS-TAX1\",SUMIFS(CBTax1,CBPayDate,\">=\"&DATE(YEAR(M$5),MONTH(M$5),1),CBPayDate,\"<=\"&M$5,CBType,$E$3,CBBank,$E$2),0)+IF($A6=\"BS-TAX2\",IF(TaxCount=2,SUMIFS(CBTax2,CBPayDate,\">=\"&DATE(YEAR(M$5),MONTH(M$5),1),CBPayDate,\"<=\"&M$5,CBType,$E$3,CBBank,$E$2),0),0)","v":55332.626086956516},{"$f":"SUMIFS(CBExcl,CBPayDate,\">=\"&DATE(YEAR(N$5),MONTH(N$5),1),CBPayDate,\"<=\"&N$5,CBType,$E$3,CBAccount,$A6,CBBank,$E$2)+IF($A6=\"BS-TAX1\",SUMIFS(CBTax1,CBPayDate,\">=\"&DATE(YEAR(N$5),MONTH(N$5),1),CBPayDate,\"<=\"&N$5,CBType,$E$3,CBBank,$E$2),0)+IF($A6=\"BS-TAX2\",IF(TaxCount=2,SUMIFS(CBTax2,CBPayDate,\">=\"&DATE(YEAR(N$5),MONTH(N$5),1),CBPayDate,\"<=\"&N$5,CBType,$E$3,CBBank,$E$2),0),0)","v":16839.286956521737},{"$f":"SUM(C6:N6)","v":347296.53913043474}]
{"$rows_left_out":41}
{"sheet":"Recon","index":6,"n_rows":36,"n_cols":12,"rows_kept":36,"cut":false,"hidden":true,"merged":[[3,3,3,7],[3,9,3,10]]}
[{"$f":"Setup!$C$4","v":"Example Company (Pty) Ltd"}]
["Bank Reconciliation"]
["© www.excel-skills.com"]
["Bank Account","B1",{"$f":"IF(ISBLANK($B$4),\"*\",$B$4)","v":"B1"},"Daily Cashbook Balance For Selected Month",null,null,null,null,null,"Outstanding Items On Recon",null,"Statement"]
["Reconciliation Date","2021-02-28",{"$f":"IF(ISBLANK($B$5),DATE(YEAR(TODAY()),MONTH(TODAY())+1,0),$B$5)","v":"2021-02-28"},"Day","Opening","Deposits","Withdrawals","Closing",null,"Deposits","Withdrawals","Balance"]
[null,null,null,{"$f":"DATE(YEAR(LastDay),MONTH(LastDay),1)","v":"2021-02-01"},{"$f":"IF($D6=\"\",\"\",SUMIFS(CBIncl,CBPayDate,\"<\"&$D6,CBBank,$C$4))","v":135376.09499999997},{"$f":"IF($D6=\"\",\"\",SUMIFS(CBIncl,CBPayDate,$D6,CBBank,$C$4,CBType,\"D\"))","v":0},{"$f":"IF($D6=\"\",\"\",SUMIFS(CBIncl,CBPayDate,$D6,CBBank,$C$4,CBType,\"W\"))","v":0},{"$f":"IF(D6=\"\",\"\",SUM(E6:G6))","v":135376.09499999997},null,{"$f":"IF($D6=\"\",\"\",SUMIFS(CBIncl,CBPayDate,\"<=\"&$D6,CBType,\"D\",CBStateDate,\">\"&LastDay,CBBank,$C$4)+SUMIFS(CBIncl,CBPayDate,\"<=\"&$D6,CBType,\"D\",CBStateDate,\"\",CBBank,$C$4))","v":0},{"$f":"IF($D6=\"\",\"\",SUMIFS(CBIncl,CBPayDate,\"<=\"&$D6,CBType,\"W\",CBStateDate,\">\"&LastDay,CBBank,$C$4)+SUMIFS(CBIncl,CBPayDate,\"<=\"&$D6,CBType,\"W\",CBStateDate,\"\",CBBank,$C$4))","v":0},{"$f":"IF($D6=\"\",\"\",H6-J6-K6)","v":135376.09499999997}]
{"$rows_left_out":31}
{"sheet":"Dashboard","index":7,"n_rows":206,"n_cols":10,"rows_kept":206,"cut":false,"hidden":true,"merged":[[34,1,34,9],[25,1,33,4],[25,5,33,9],[12,6,12,7],[13,1,13,5],[14,1,14,5],[15,1,24,9],[5,1,12,1],[5,2,12,3],[5,4,12,5],[5,6,5,9],[6,6,6,7],[7,6,7,7],[8,6,8,7],[9,6,9,7],[10,6,10,7],[1,1,4,1],[1,2,2,5],[1,6,1,9],[2,6,2,9],[3,2,3,3],[3,6,3,9],[4,2,4,3],[4,6,4,9]]}
[]
[null,"CASHBOOK\nDASHBOARD","Dashboard Filters",null,null,null,"SELECTED BANK ACCOUNT:"]
[null,null,null,null,null,null,{"$f":"IF(ISBLANK($C$5),\"ALL\",C57)","v":"ALL"}]
[null,null,"BANK CODE",null,"FROM DATE","TO DATE","TOTAL CASH BALANCE (ALL ACCOUNTS)"]
[null,null,null,null,"2021-02-01","2021-02-28",{"$f":"C58","v":133987.38199999993}]
[null,null,null,null,null,null,"Cashbook Balance"]
{"$rows_left_out":200}