{"text_format":"1","workbook":"xlsx","n_sheets":11,"sheets":["Info","Trial","Instructions","Assumptions","IncState","CashFlow","BalanceSheet","Loans1","Loans2","Loans3","Leases"],"not_rendered":{"charts":0,"images":2,"macros":1,"external_links":0,"defined_names":14,"comments":0,"pivot_tables":0},"unopened":[],"bounds":{"document_bytes":16777216,"sheet_cells":100000,"rows_first":2000,"rows_last":500,"rows_between":2000,"halvings":0,"cell_chars":16384,"cell_head_chars":4096},"cells_cut":0,"cells_raw":0,"read":"whole","date_system":"1900"}

{"sheet":"Info","index":0,"n_rows":0,"n_cols":0,"rows_kept":0,"cut":false,"hidden":false,"merged":[]}

{"sheet":"Trial","index":1,"n_rows":0,"n_cols":0,"rows_kept":0,"cut":false,"hidden":true,"merged":[]}

{"sheet":"Instructions","index":2,"n_rows":382,"n_cols":1,"rows_kept":382,"cut":false,"hidden":true,"merged":[]}
["Excel Skills | Business Plan Cash Flow Forecast Template"]
["Instructions"]
["www.excel-skills.com"]
[]
["This template enables users to create cash flow projections for a business plan which includes 12 monthly periods and five annual periods. The template includes a monthly income statement, cash flow statement and balance sheet. The cash flow projections are based on turnover, gross profit and expense values entered by the user as well as a number of assumptions used to create an automated balance sheet. Assumptions include opening balance sheet balances, working capital ratios, payroll accruals, sales tax, income tax, dividends and loans. The monthly reporting periods are based on any user defined start date."]
[]
["Note: We have included 12 monthly and 5 annual reporting periods in this template because this format is frequently required by financial institutions when submitting financial projections for business plans. If you only require annual cash flow projections, refer to our Annual Cash Flow Projections template and if you only require monthly cash flow projections, refer to our Monthly Cash Flow Projections template."]
[]
["The following sheets are included in the template:"]
["Assumptions - this sheet includes the default assumptions on which the monthly & annual cash flow projections are based."]
{"$rows_left_out":373}
{"sheet":"Assumptions","index":3,"n_rows":104,"n_cols":8,"rows_kept":104,"cut":false,"hidden":true,"merged":[[3,2,3,4]]}
[null,{"$f":"IF(ISBLANK($C$4),\"Example Limited\",$C$4)","v":"Example (Pty) Limited"}]
[null,"Cash Flow Projections - Assumptions"]
[]
[null,"Business Name","Example (Pty) Limited"]
[null,"Start Date","2021-03-01"]
[]
[null,"Financial Assumptions - Income Statement"]
[null,"Turnover",null,"Year 2","Year 3","Year 4","Year 5"]
[null,"Monthly turnover projections for the first year need to be entered on the IncState worksheet."]
[null,"Annual Turnover Growth %",null,0.08,0.08,0.1,0.1]
{"$rows_left_out":95}
{"sheet":"IncState","index":4,"n_rows":67,"n_cols":19,"rows_kept":67,"cut":false,"hidden":true,"merged":[]}
[null,{"$f":"IF(ISBLANK(Assumptions!$C$4),\"Example Limited\",Assumptions!$C$4)","v":"Example (Pty) Limited"}]
[null,"Cash Flow Projections - Income Statement"]
[null,"© www.excel-skills.com"]
[null,null,{"$f":"IF(ISBLANK(Assumptions!$C$5)=TRUE,DATE(YEAR(TODAY()),MONTH(TODAY())+1,0),DATE(YEAR(Assumptions!$C$5),MONTH(Assumptions!$C$5)+1,0))","v":"2021-03-31"},{"$f":"DATE(YEAR(C4),MONTH(C4)+2,0)","v":"2021-04-30"},"2021-05-31","2021-06-30","2021-07-31","2021-08-31","2021-09-30","2021-10-31","2021-11-30","2021-12-31","2022-01-31","2022-02-28",{"$f":"\"Year-\"&YEAR(N4)","v":"Year-2022"},{"$f":"\"Year-\"&YEAR($N4)+1","v":"Year-2023"},{"$f":"\"Year-\"&YEAR($N4)+2","v":"Year-2024"},{"$f":"\"Year-\"&YEAR($N4)+3","v":"Year-2025"},{"$f":"\"Year-\"&YEAR($N4)+4","v":"Year-2026"}]
["V1C1","Product Sales",285600,305200,308000,311200,315800,310000,302000,314000,318200,256500,330600,305200,{"$f":"SUM(C5:N5)","v":3662300},{"$f":"O5*(1+Assumptions!D$10)","v":3955284.0000000005},{"$f":"P5*(1+Assumptions!E$10)","v":4271706.7200000007},{"$f":"Q5*(1+Assumptions!F$10)","v":4698877.3920000009},{"$f":"R5*(1+Assumptions!G$10)","v":5168765.1312000016}]
["V1C1","Income From Services",125000,115000,128000,132000,127000,133000,130000,128900,132000,118000,135000,131200,1535100,{"$f":"O6*(1+Assumptions!D$10)","v":1657908},{"$f":"P6*(1+Assumptions!E$10)","v":1790540.6400000001},{"$f":"Q6*(1+Assumptions!F$10)","v":1969594.7040000004},{"$f":"R6*(1+Assumptions!G$10)","v":2166554.1744000004}]
[null,"Total Turnover",{"$f":"SUM(OFFSET(C4,1,0,ROW($B7)-ROW($B4)-1,1))","v":410600},420200,436000,443200,442800,443000,432000,442900,450200,374500,465600,436400,5197400,5613192,6062247.3600000013,6668472.0960000008,7335319.3056000024]
["V1C1","Products",{"$f":"C5-C11","v":185640},198380,200200,202280,205270,201500,193280,200960,203648,164160,211584,195328,{"$f":"SUM(C8:N8)","v":2362230},{"$f":"P5-P11","v":2452276.08},2563024.0320000006,2819326.4352000002,3101259.0787200006]
["V1C0","Services",0,0,0,0,0,0,0,0,0,0,0,0,0,0,0,0,0]
[null,"Total Cost of Sales",{"$f":"SUM(OFFSET(C7,1,0,ROW($B10)-ROW($B7)-1,1))","v":185640},198380,200200,202280,205270,201500,193280,200960,203648,164160,211584,195328,2362230,2452276.08,2563024.0320000006,2819326.4352000002,3101259.0787200006]
{"$rows_left_out":58}
{"sheet":"CashFlow","index":5,"n_rows":46,"n_cols":19,"rows_kept":46,"cut":false,"hidden":true,"merged":[]}
[null,{"$f":"IF(ISBLANK(Assumptions!$C$4),\"Example Limited\",Assumptions!$C$4)","v":"Example (Pty) Limited"}]
[null,"Cash Flow Projections - Cash Flow Statement"]
[null,"© www.excel-skills.com"]
[null,null,{"$f":"IF(ISBLANK(Assumptions!$C$5)=TRUE,DATE(YEAR(TODAY()),MONTH(TODAY())+1,0),DATE(YEAR(Assumptions!$C$5),MONTH(Assumptions!$C$5)+1,0))","v":"2021-03-31"},{"$f":"DATE(YEAR(C4),MONTH(C4)+2,0)","v":"2021-04-30"},{"$f":"DATE(YEAR(D4),MONTH(D4)+2,0)","v":"2021-05-31"},"2021-06-30","2021-07-31","2021-08-31","2021-09-30","2021-10-31","2021-11-30","2021-12-31","2022-01-31",{"$f":"DATE(YEAR(M4),MONTH(M4)+2,0)","v":"2022-02-28"},{"$f":"\"Year-\"&YEAR(N4)","v":"Year-2022"},{"$f":"\"Year-\"&YEAR($N4)+1","v":"Year-2023"},{"$f":"\"Year-\"&YEAR($N4)+2","v":"Year-2024"},{"$f":"\"Year-\"&YEAR($N4)+3","v":"Year-2025"},{"$f":"\"Year-\"&YEAR($N4)+4","v":"Year-2026"}]
[null,"Cash flows from operating activities"]
[null,"Profit / (Loss) for the year",{"$f":"IncState!C59","v":40354.5},{"$f":"IncState!D59","v":39097.241662946675},{"$f":"IncState!E59","v":44875.301810206904},{"$f":"IncState!F59","v":-3172.9113557039018},{"$f":"IncState!G59","v":35892.61044145163},{"$f":"IncState!H59","v":34904.875552299462},{"$f":"IncState!I59","v":47365.017299715881},{"$f":"IncState!J59","v":12738.149542354895},{"$f":"IncState!K59","v":26036.921091279859},{"$f":"IncState!L59","v":24228.940836467911},{"$f":"IncState!M59","v":55978.297747521283},{"$f":"IncState!N59","v":43773.547163190931},{"$f":"SUM(C6:N6)","v":402072.49179173145},{"$f":"IncState!P59","v":485481.93476897839},{"$f":"IncState!Q59","v":613517.00404088059},{"$f":"IncState!R59","v":837483.73146671464},{"$f":"IncState!S59","v":1012095.1221546808}]
["INT","Interest",{"$f":"IncState!C56","v":18177.083333333332},{"$f":"IncState!D56","v":18033.275468129621},{"$f":"IncState!E56","v":17888.191930268178},{"$f":"IncState!F56","v":17741.821327366524},{"$f":"IncState!G56","v":17594.152164650517},{"$f":"IncState!H56","v":18216.006177361851},{"$f":"IncState!I56","v":18060.253750394611},{"$f":"IncState!J56","v":17903.125635618195},{"$f":"IncState!K56","v":17744.609595444635},{"$f":"IncState!L56","v":17584.693282683467},{"$f":"IncState!M56","v":19923.364239553764},{"$f":"IncState!N56","v":19730.406717790378},{"$f":"SUM(C7:N7)","v":218596.98362259509},{"$f":"IncState!P56","v":242128.11504308568},{"$f":"IncState!Q56","v":240568.19754322225},{"$f":"IncState!R56","v":211452.67631667465},{"$f":"IncState!S56","v":196408.08348328195}]
["TAX","Taxation",{"$f":"IncState!C58","v":15693.41666666667},{"$f":"IncState!D58","v":15204.482868923706},{"$f":"IncState!E58","v":17451.506259524918},{"$f":"IncState!F58","v":-1233.9099716626224},{"$f":"IncState!G58","v":13958.237393897856},{"$f":"IncState!H58","v":13574.118270338688},{"$f":"IncState!I58","v":18419.728949889512},{"$f":"IncState!J58","v":4953.7248220269103},{"$f":"IncState!K58","v":10125.469313275506},{"$f":"IncState!L58","v":9422.3658808486216},{"$f":"IncState!M58","v":21769.338012924956},{"$f":"IncState!N58","v":17023.046119018691},156361.52458567341,{"$f":"IncState!P58","v":188798.53018793603},{"$f":"IncState!Q58","v":238589.94601589796},{"$f":"IncState!R58","v":325688.11779261136},{"$f":"IncState!S58","v":393592.54750459827}]
[null,"Adjustment for non-cash expenses:"]
["DEP","Depreciation",{"$f":"SUMIF(IncState!$A$4:$AO$63,$A10,IncState!C$4:C$63)","v":15000},{"$f":"SUMIF(IncState!$A$4:$AO$63,$A10,IncState!D$4:D$63)","v":15000},{"$f":"SUMIF(IncState!$A$4:$AO$63,$A10,IncState!E$4:E$63)","v":15000},{"$f":"SUMIF(IncState!$A$4:$AO$63,$A10,IncState!F$4:F$63)","v":15000},{"$f":"SUMIF(IncState!$A$4:$AO$63,$A10,IncState!G$4:G$63)","v":15000},{"$f":"SUMIF(IncState!$A$4:$AO$63,$A10,IncState!H$4:H$63)","v":15000},{"$f":"SUMIF(IncState!$A$4:$AO$63,$A10,IncState!I$4:I$63)","v":15000},{"$f":"SUMIF(IncState!$A$4:$AO$63,$A10,IncState!J$4:J$63)","v":15000},{"$f":"SUMIF(IncState!$A$4:$AO$63,$A10,IncState!K$4:K$63)","v":15000},{"$f":"SUMIF(IncState!$A$4:$AO$63,$A10,IncState!L$4:L$63)","v":15000},{"$f":"SUMIF(IncState!$A$4:$AO$63,$A10,IncState!M$4:M$63)","v":19000},{"$f":"SUMIF(IncState!$A$4:$AO$63,$A10,IncState!N$4:N$63)","v":19000},{"$f":"SUM(C10:N10)","v":188000},{"$f":"SUMIF(IncState!$A$4:$AO$63,$A10,IncState!P$4:P$63)","v":263000},{"$f":"SUMIF(IncState!$A$4:$AO$63,$A10,IncState!Q$4:Q$63)","v":307000},{"$f":"SUMIF(IncState!$A$4:$AO$63,$A10,IncState!R$4:R$63)","v":250000},{"$f":"SUMIF(IncState!$A$4:$AO$63,$A10,IncState!S$4:S$63)","v":275000}]
{"$rows_left_out":37}
{"sheet":"BalanceSheet","index":6,"n_rows":81,"n_cols":20,"rows_kept":81,"cut":false,"hidden":true,"merged":[]}
[null,{"$f":"IF(ISBLANK(Assumptions!$C$4),\"Example Limited\",Assumptions!$C$4)","v":"Example (Pty) Limited"}]
[null,"Cash Flow Projections - Balance Sheet"]
[null,"© www.excel-skills.com"]
[null,null,{"$f":"IF(ISBLANK(Assumptions!$C$5)=TRUE,DATE(YEAR(TODAY()),MONTH(TODAY()),0),DATE(YEAR(Assumptions!$C$5),MONTH(Assumptions!$C$5),0))","v":"2021-02-28"},{"$f":"IF(ISBLANK(Assumptions!$C$5)=TRUE,DATE(YEAR(TODAY()),MONTH(TODAY())+1,0),DATE(YEAR(Assumptions!$C$5),MONTH(Assumptions!$C$5)+1,0))","v":"2021-03-31"},{"$f":"DATE(YEAR(D4),MONTH(D4)+2,0)","v":"2021-04-30"},{"$f":"DATE(YEAR(E4),MONTH(E4)+2,0)","v":"2021-05-31"},"2021-06-30","2021-07-31","2021-08-31","2021-09-30","2021-10-31","2021-11-30","2021-12-31","2022-01-31",{"$f":"DATE(YEAR(N4),MONTH(N4)+2,0)","v":"2022-02-28"},{"$f":"\"Year-\"&YEAR(O4)","v":"Year-2022"},{"$f":"\"Year-\"&YEAR($O4)+1","v":"Year-2023"},{"$f":"\"Year-\"&YEAR($O4)+2","v":"Year-2024"},{"$f":"\"Year-\"&YEAR($O4)+3","v":"Year-2025"},{"$f":"\"Year-\"&YEAR($O4)+4","v":"Year-2026"}]
[null,"ASSETS"]
[null,"Non-Current Assets"]
["PPE","Property, Plant & Equipment",{"$f":"SUMIF(Assumptions!$A$76:$C$100,$A7,Assumptions!$C$76:$C$100)","v":1050000},{"$f":"C7-CashFlow!C28-CashFlow!C10","v":1035000},{"$f":"D7-CashFlow!D28-CashFlow!D10","v":1020000},{"$f":"E7-CashFlow!E28-CashFlow!E10","v":1005000},{"$f":"F7-CashFlow!F28-CashFlow!F10","v":990000},{"$f":"G7-CashFlow!G28-CashFlow!G10","v":975000},{"$f":"H7-CashFlow!H28-CashFlow!H10","v":960000},{"$f":"I7-CashFlow!I28-CashFlow!I10","v":945000},{"$f":"J7-CashFlow!J28-CashFlow!J10","v":930000},{"$f":"K7-CashFlow!K28-CashFlow!K10","v":915000},{"$f":"L7-CashFlow!L28-CashFlow!L10","v":900000},{"$f":"M7-CashFlow!M28-CashFlow!M10","v":1121000},{"$f":"N7-CashFlow!N28-CashFlow!N10","v":1102000},{"$f":"O7","v":1102000},{"$f":"P7-CashFlow!P28-CashFlow!P10","v":1139000},{"$f":"Q7-CashFlow!Q28-CashFlow!Q10","v":1012000},{"$f":"R7-CashFlow!R28-CashFlow!R10","v":962000},{"$f":"S7-CashFlow!S28-CashFlow!S10","v":1037000}]
["INA","Intangible Assets",{"$f":"SUMIF(Assumptions!$A$76:$C$100,$A8,Assumptions!$C$76:$C$100)","v":120000},{"$f":"C8-CashFlow!C29-CashFlow!C11","v":119000},{"$f":"D8-CashFlow!D29-CashFlow!D11","v":118000},{"$f":"E8-CashFlow!E29-CashFlow!E11","v":117000},{"$f":"F8-CashFlow!F29-CashFlow!F11","v":116000},{"$f":"G8-CashFlow!G29-CashFlow!G11","v":115000},{"$f":"H8-CashFlow!H29-CashFlow!H11","v":114000},{"$f":"I8-CashFlow!I29-CashFlow!I11","v":113000},{"$f":"J8-CashFlow!J29-CashFlow!J11","v":112000},{"$f":"K8-CashFlow!K29-CashFlow!K11","v":111000},{"$f":"L8-CashFlow!L29-CashFlow!L11","v":110000},{"$f":"M8-CashFlow!M29-CashFlow!M11","v":109000},{"$f":"N8-CashFlow!N29-CashFlow!N11","v":108000},{"$f":"O8","v":108000},{"$f":"P8-CashFlow!P29-CashFlow!P11","v":96000},{"$f":"Q8-CashFlow!Q29-CashFlow!Q11","v":84000},{"$f":"R8-CashFlow!R29-CashFlow!R11","v":72000},{"$f":"S8-CashFlow!S29-CashFlow!S11","v":60000}]
["INV","Investments",{"$f":"SUMIF(Assumptions!$A$76:$C$100,$A9,Assumptions!$C$76:$C$100)","v":800000},{"$f":"C9-CashFlow!C30","v":800000},{"$f":"D9-CashFlow!D30","v":800000},{"$f":"E9-CashFlow!E30","v":800000},{"$f":"F9-CashFlow!F30","v":800000},{"$f":"G9-CashFlow!G30","v":800000},{"$f":"H9-CashFlow!H30","v":800000},{"$f":"I9-CashFlow!I30","v":800000},{"$f":"J9-CashFlow!J30","v":800000},{"$f":"K9-CashFlow!K30","v":800000},{"$f":"L9-CashFlow!L30","v":800000},{"$f":"M9-CashFlow!M30","v":800000},{"$f":"N9-CashFlow!N30","v":800000},800000,{"$f":"P9-CashFlow!P30","v":1200000},{"$f":"Q9-CashFlow!Q30","v":1800000},{"$f":"R9-CashFlow!R30","v":2300000},{"$f":"S9-CashFlow!S30","v":2700000}]
[null,null,{"$f":"SUM(C7:C9)","v":1970000},{"$f":"SUM(D7:D9)","v":1954000},1938000,1922000,1906000,1890000,1874000,1858000,1842000,1826000,1810000,2030000,2010000,2010000,2435000,2896000,3334000,3797000]
{"$rows_left_out":72}
{"sheet":"Loans1","index":7,"n_rows":165,"n_cols":7,"rows_kept":165,"cut":false,"hidden":true,"merged":[]}
[{"$f":"IF(ISBLANK(Assumptions!$C$4),\"Example Limited\",Assumptions!$C$4)","v":"Example (Pty) Limited"}]
["Cash Flow Projections - Repayment Schedule - Loans 1"]
[]
["Interest Rate",{"$f":"Assumptions!$C$72","v":0.10249999999999999}]
["Repayment Term",{"$f":"Assumptions!$C$73","v":10}]
["Interest Only",{"$f":"Assumptions!$C$74","v":"No"}]
["© www.excel-skills.com"]
["Month","Opening Balance","Additional Loans","Loan Repayment","Interest Charges","Capital Repayment","Closing Balance"]
[{"$f":"IF(ISBLANK(Assumptions!$C$5)=TRUE,DATE(YEAR(TODAY()),MONTH(TODAY()),0),DATE(YEAR(Assumptions!$C$5),MONTH(Assumptions!$C$5),0))","v":"2021-02-28"},0,{"$f":"-SUMIF(Assumptions!$A$76:$C$100,\"LT1\",Assumptions!$C$76:$C$100)","v":1200000},0,0,{"$f":"IF($B$6=\"Yes\",0,D9-E9)","v":0},{"$f":"IF(ROUND(SUM(B9:C9,-F9),0)=0,0,IF($B$6=\"Yes\",SUM($C$9:C9),SUM(B9:C9,-F9)))","v":1200000}]
[{"$f":"DATE(YEAR(A9),MONTH(A9)+2,0)","v":"2021-03-31"},{"$f":"G9","v":1200000},0,{"$f":"IF($B$6=\"Yes\",0,IF(ROW(C10)-ROW($C$9)>$B$5*12,-PMT($B$4/12,$B$5*12,SUM(OFFSET(C10,0,0,-$B$5*12,1)),0,0),-PMT($B$4/12,$B$5*12,SUM(OFFSET(C10,0,0,ROW($C$8)-ROW(C10),1)),0,0)))","v":16024.680225213191},{"$f":"(G9+C10)*$B$4/12","v":10249.999999999998},{"$f":"IF($B$6=\"Yes\",0,D10-E10)","v":5774.6802252131929},{"$f":"IF(ROUND(SUM(B10:C10,-F10),0)=0,0,IF($B$6=\"Yes\",SUM($C$9:C10),SUM(B10:C10,-F10)))","v":1194225.3197747867}]
{"$rows_left_out":156}
{"sheet":"Loans2","index":8,"n_rows":165,"n_cols":7,"rows_kept":165,"cut":false,"hidden":true,"merged":[]}
[{"$f":"IF(ISBLANK(Assumptions!$C$4),\"Example Limited\",Assumptions!$C$4)","v":"Example (Pty) Limited"}]
["Cash Flow Projections - Repayment Schedule - Loans 2"]
[]
["Interest Rate",{"$f":"Assumptions!$D$72","v":9.2499999999999999E-2}]
["Repayment Term",{"$f":"Assumptions!$D$73","v":8}]
["Interest Only",{"$f":"Assumptions!$D$74","v":"No"}]
["© www.excel-skills.com"]
["Month","Opening Balance","Additional Loans","Loan Repayment","Interest Charges","Capital Repayment","Closing Balance"]
[{"$f":"IF(ISBLANK(Assumptions!$C$5)=TRUE,DATE(YEAR(TODAY()),MONTH(TODAY()),0),DATE(YEAR(Assumptions!$C$5),MONTH(Assumptions!$C$5),0))","v":"2021-02-28"},0,{"$f":"-SUMIF(Assumptions!$A$76:$C$100,\"LT2\",Assumptions!$C$76:$C$100)","v":500000},0,0,{"$f":"IF($B$6=\"Yes\",0,D9-E9)","v":0},{"$f":"IF(ROUND(SUM(B9:C9,-F9),0)=0,0,IF($B$6=\"Yes\",SUM($C$9:C9),SUM(B9:C9,-F9)))","v":500000}]
[{"$f":"DATE(YEAR(A9),MONTH(A9)+2,0)","v":"2021-03-31"},{"$f":"G9","v":500000},0,{"$f":"IF($B$6=\"Yes\",0,IF(ROW(C10)-ROW($C$9)>$B$5*12,-PMT($B$4/12,$B$5*12,SUM(OFFSET(C10,0,0,-$B$5*12,1)),0,0),-PMT($B$4/12,$B$5*12,SUM(OFFSET(C10,0,0,ROW($C$8)-ROW(C10),1)),0,0)))","v":7390.1100802133533},{"$f":"(G9+C10)*$B$4/12","v":3854.1666666666665},{"$f":"IF($B$6=\"Yes\",0,D10-E10)","v":3535.9434135466868},{"$f":"IF(ROUND(SUM(B10:C10,-F10),0)=0,0,IF($B$6=\"Yes\",SUM($C$9:C10),SUM(B10:C10,-F10)))","v":496464.05658645334}]
{"$rows_left_out":156}
{"sheet":"Loans3","index":9,"n_rows":165,"n_cols":7,"rows_kept":165,"cut":false,"hidden":true,"merged":[]}
[{"$f":"IF(ISBLANK(Assumptions!$C$4),\"Example Limited\",Assumptions!$C$4)","v":"Example (Pty) Limited"}]
["Cash Flow Projections - Repayment Schedule - Loans 3"]
[]
["Interest Rate",{"$f":"Assumptions!$E$72","v":0.125}]
["Repayment Term",{"$f":"Assumptions!$E$73","v":5}]
["Interest Only",{"$f":"Assumptions!$E$74","v":"No"}]
["© www.excel-skills.com"]
["Month","Opening Balance","Additional Loans","Loan Repayment","Interest Charges","Capital Repayment","Closing Balance"]
[{"$f":"IF(ISBLANK(Assumptions!$C$5)=TRUE,DATE(YEAR(TODAY()),MONTH(TODAY()),0),DATE(YEAR(Assumptions!$C$5),MONTH(Assumptions!$C$5),0))","v":"2021-02-28"},0,{"$f":"-SUMIF(Assumptions!$A$76:$C$100,\"LT3\",Assumptions!$C$76:$C$100)","v":0},0,0,{"$f":"IF($B$6=\"Yes\",0,D9-E9)","v":0},{"$f":"IF(ROUND(SUM(B9:C9,-F9),0)=0,0,IF($B$6=\"Yes\",SUM($C$9:C9),SUM(B9:C9,-F9)))","v":0}]
[{"$f":"DATE(YEAR(A9),MONTH(A9)+2,0)","v":"2021-03-31"},{"$f":"G9","v":0},0,{"$f":"IF($B$6=\"Yes\",0,IF(ROW(C10)-ROW($C$9)>$B$5*12,-PMT($B$4/12,$B$5*12,SUM(OFFSET(C10,0,0,-$B$5*12,1)),0,0),-PMT($B$4/12,$B$5*12,SUM(OFFSET(C10,0,0,ROW($C$8)-ROW(C10),1)),0,0)))","v":0},{"$f":"(G9+C10)*$B$4/12","v":0},{"$f":"IF($B$6=\"Yes\",0,D10-E10)","v":0},{"$f":"IF(ROUND(SUM(B10:C10,-F10),0)=0,0,IF($B$6=\"Yes\",SUM($C$9:C10),SUM(B10:C10,-F10)))","v":0}]
{"$rows_left_out":156}
{"sheet":"Leases","index":10,"n_rows":165,"n_cols":7,"rows_kept":165,"cut":false,"hidden":true,"merged":[]}
[{"$f":"IF(ISBLANK(Assumptions!$C$4),\"Example Limited\",Assumptions!$C$4)","v":"Example (Pty) Limited"}]
["Cash Flow Projections - Repayment Schedule - Finance Leases"]
[]
["Interest Rate",{"$f":"Assumptions!$F$72","v":0.115}]
["Repayment Term",{"$f":"Assumptions!$F$73","v":4}]
["Interest Only",{"$f":"Assumptions!$F$74","v":"No"}]
["© www.excel-skills.com"]
["Month","Opening Balance","Additional Loans","Loan Repayment","Interest Charges","Capital Repayment","Closing Balance"]
[{"$f":"IF(ISBLANK(Assumptions!$C$5)=TRUE,DATE(YEAR(TODAY()),MONTH(TODAY()),0),DATE(YEAR(Assumptions!$C$5),MONTH(Assumptions!$C$5),0))","v":"2021-02-28"},0,{"$f":"-SUMIF(Assumptions!$A$76:$C$100,\"FIN\",Assumptions!$C$76:$C$100)","v":425000},0,0,{"$f":"IF($B$6=\"Yes\",0,D9-E9)","v":0},{"$f":"IF(ROUND(SUM(B9:C9,-F9),0)=0,0,IF($B$6=\"Yes\",SUM($C$9:C9),SUM(B9:C9,-F9)))","v":425000}]
[{"$f":"DATE(YEAR(A9),MONTH(A9)+2,0)","v":"2021-03-31"},{"$f":"G9","v":425000},0,{"$f":"IF($B$6=\"Yes\",0,IF(ROW(C10)-ROW($C$9)>$B$5*12,-PMT($B$4/12,$B$5*12,SUM(OFFSET(C10,0,0,-$B$5*12,1)),0,0),-PMT($B$4/12,$B$5*12,SUM(OFFSET(C10,0,0,ROW($C$8)-ROW(C10),1)),0,0)))","v":11087.82878498939},{"$f":"(G9+C10)*$B$4/12","v":4072.9166666666665},{"$f":"IF($B$6=\"Yes\",0,D10-E10)","v":7014.9121183227235},{"$f":"IF(ROUND(SUM(B10:C10,-F10),0)=0,0,IF($B$6=\"Yes\",SUM($C$9:C10),SUM(B10:C10,-F10)))","v":417985.08788167726}]
{"$rows_left_out":155}