{"text_format":"1","workbook":"xlsx","n_sheets":7,"sheets":["Info","Trial","Instructions","StockCodes","Movements","StockCount","Dashboard"],"not_rendered":{"charts":6,"images":2,"macros":1,"external_links":0,"defined_names":27,"comments":0,"pivot_tables":0},"unopened":[],"bounds":{"document_bytes":16777216,"sheet_cells":100000,"rows_first":2000,"rows_last":500,"rows_between":2000,"halvings":0,"cell_chars":16384,"cell_head_chars":4096},"cells_cut":0,"cells_raw":0,"read":"whole","date_system":"1900"}

{"sheet":"Info","index":0,"n_rows":0,"n_cols":0,"rows_kept":0,"cut":false,"hidden":false,"merged":[]}

{"sheet":"Trial","index":1,"n_rows":0,"n_cols":0,"rows_kept":0,"cut":false,"hidden":true,"merged":[]}

{"sheet":"Instructions","index":2,"n_rows":206,"n_cols":1,"rows_kept":206,"cut":false,"hidden":true,"merged":[]}
["Excel Skills | Inventory Quantity Control Template"]
["Instructions"]
["www.excel-skills.com"]
[]
["This unique template enables users to control inventory by recording opening stock quantities, capturing all inventory movement transactions, performing stock takes and calculating stock quantities on hand for any user defined date range. The template makes provision for stock purchase, sale, receipt, issue and adjustment transaction types and can be used by any business and for any type of inventory."]
[]
["Note: This template does not include inventory cost & valuation calculations. If you require a template which includes cost and valuation type calculations, refer to our Trade Based and Usage Based inventory control templates."]
[]
["The following sheets are included in this template:"]
["StockCodes - this sheet can be used to create unique stock codes for all inventory items and also includes an inventory movement report for the stock codes created."]
["Movements - all inventory movement transactions should be recorded on this sheet."]
["StockCount - this sheet can be used to perform a physical stock count and to analyse stock take variances. Physical stock count quantities are measured against theoretical stock balances and once the accuracy of the stock take variances has been established, the calculated stock variances can be recorded as stock adjustments on the Movements sheet in order to adjust the theoretical stock quantities to the physical stock count quantities."]
["Dashboard - the inventory dashboard is automatically updated based on the stock code and dates selected in the filter section of the dashboard. You can select an individual stock code or clear the contents of the list box to view calculations for all stock items. The dashboard also includes a unique interactive report where you can select the basis of balances or movements and view all transaction types or any of purchases, receipts, sales, issues or adjustments individually. The dashboard also contains stats of the top products by transaction type. Aside from the filter and report selections, no user input is required on this sheet and all workings are included below the dashboard."]
[]
["Stock Codes"]
{"$rows_left_out":192}
{"sheet":"StockCodes","index":3,"n_rows":18,"n_cols":17,"rows_kept":18,"cut":false,"hidden":true,"merged":[]}
["Stock Codes"]
["Set-up and Reporting",null,null,null,null,null,null,null,null,null,"From Date",null,{"$f":"IF(ISBLANK(L2)=TRUE,IF(MIN(MoveDate)=0,DATE(YEAR($M$3),MONTH($M$3),1),DATE(YEAR(MIN(MoveDate)),MONTH(MIN(MoveDate)),1)),L2)","v":"2021-07-01"},{"$f":"Dashboard!$C$55","v":"2021-07-01"}]
["© www.excel-skills.com",null,null,null,null,null,null,null,null,null,"To Date","2021-09-30",{"$f":"IF(ISBLANK(L3)=TRUE,DATE(YEAR(TODAY()),MONTH(TODAY())+1,0),L3)","v":"2021-09-30"},{"$f":"Dashboard!$D$55","v":"2021-09-30"}]
[]
["Stock Code","Stock Description","UOM","Opening Quantity","Error Code","Opening Quantity2","Purchases Quantity","Receipts Quantity","Sales \nQuantity","Issues \nQuantity","Adjustments Quantity","Closing Quantity","Dash Purch Qty","Dash Receipt Qty","Dash Sales \nQty","Dash Issues Qty","Dash Adjust Qty"]
["1212GHG","Garden Shed","Units",1020,{"$f":"IF(AND(ISBLANK(A6)=FALSE,COUNTIF(StockCodeOnly,A6)>1)=TRUE,\"E1\",\"-\")","v":"-"},{"$f":"D6+SUMIFS(MoveQty,MoveCode,$A6,MoveDate,\"<\"&$M$2)","v":1020},{"$f":"SUMIFS(MoveQty,MoveCode,$A6,MoveDate,\">=\"&$M$2,MoveDate,\"<\"&$M$3+1,MoveType,\"Purchase\")","v":0},{"$f":"SUMIFS(MoveQty,MoveCode,$A6,MoveDate,\">=\"&$M$2,MoveDate,\"<\"&$M$3+1,MoveType,\"Receipt\")","v":1010},{"$f":"SUMIFS(MoveQty,MoveCode,$A6,MoveDate,\">=\"&$M$2,MoveDate,\"<\"&$M$3+1,MoveType,\"Sale\")","v":-1350},{"$f":"SUMIFS(MoveQty,MoveCode,$A6,MoveDate,\">=\"&$M$2,MoveDate,\"<\"&$M$3+1,MoveType,\"Issue\")","v":0},{"$f":"SUMIFS(MoveQty,MoveCode,$A6,MoveDate,\">=\"&$M$2,MoveDate,\"<\"&$M$3+1,MoveType,\"Adjustment\")","v":0},{"$f":"SUMIFS(MoveQty,MoveCode,$A6,MoveDate,\"<\"&$M$3+1)+D6","v":680},{"$f":"SUMIFS(MoveQty,MoveCode,$A6,MoveDate,\">=\"&$N$2,MoveDate,\"<\"&$N$3+1,MoveType,\"Purchase\")","v":0},{"$f":"SUMIFS(MoveQty,MoveCode,$A6,MoveDate,\">=\"&$N$2,MoveDate,\"<\"&$N$3+1,MoveType,\"Receipt\")","v":1010},{"$f":"-SUMIFS(MoveQty,MoveCode,$A6,MoveDate,\">=\"&$N$2,MoveDate,\"<\"&$N$3+1,MoveType,\"Sale\")","v":1350},{"$f":"-SUMIFS(MoveQty,MoveCode,$A6,MoveDate,\">=\"&$N$2,MoveDate,\"<\"&$N$3+1,MoveType,\"Issue\")","v":0},{"$f":"SUMIFS(MoveQty,MoveCode,$A6,MoveDate,\">=\"&$N$2,MoveDate,\"<\"&$N$3+1,MoveType,\"Adjustment\")","v":0}]
["1212PHP","Painted Garden Shed","Units",930,"-",930,0,52,-610,0,-2,370,{"$f":"SUMIFS(MoveQty,MoveCode,$A7,MoveDate,\">=\"&$N$2,MoveDate,\"<\"&$N$3+1,MoveType,\"Purchase\")","v":0},{"$f":"SUMIFS(MoveQty,MoveCode,$A7,MoveDate,\">=\"&$N$2,MoveDate,\"<\"&$N$3+1,MoveType,\"Receipt\")","v":52},{"$f":"-SUMIFS(MoveQty,MoveCode,$A7,MoveDate,\">=\"&$N$2,MoveDate,\"<\"&$N$3+1,MoveType,\"Sale\")","v":610},{"$f":"-SUMIFS(MoveQty,MoveCode,$A7,MoveDate,\">=\"&$N$2,MoveDate,\"<\"&$N$3+1,MoveType,\"Issue\")","v":0},{"$f":"SUMIFS(MoveQty,MoveCode,$A7,MoveDate,\">=\"&$N$2,MoveDate,\"<\"&$N$3+1,MoveType,\"Adjustment\")","v":-2}]
["1212THT","Tools Shed","Units",240,"-",240,0,125,-240,0,0,125,{"$f":"SUMIFS(MoveQty,MoveCode,$A8,MoveDate,\">=\"&$N$2,MoveDate,\"<\"&$N$3+1,MoveType,\"Purchase\")","v":0},{"$f":"SUMIFS(MoveQty,MoveCode,$A8,MoveDate,\">=\"&$N$2,MoveDate,\"<\"&$N$3+1,MoveType,\"Receipt\")","v":125},{"$f":"-SUMIFS(MoveQty,MoveCode,$A8,MoveDate,\">=\"&$N$2,MoveDate,\"<\"&$N$3+1,MoveType,\"Sale\")","v":240},{"$f":"-SUMIFS(MoveQty,MoveCode,$A8,MoveDate,\">=\"&$N$2,MoveDate,\"<\"&$N$3+1,MoveType,\"Issue\")","v":0},{"$f":"SUMIFS(MoveQty,MoveCode,$A8,MoveDate,\">=\"&$N$2,MoveDate,\"<\"&$N$3+1,MoveType,\"Adjustment\")","v":0}]
["RM10","Steel Plates","M2",2000,"-",2000,17000,0,0,-13061.111111111109,0,5938.8888888888896,{"$f":"SUMIFS(MoveQty,MoveCode,$A9,MoveDate,\">=\"&$N$2,MoveDate,\"<\"&$N$3+1,MoveType,\"Purchase\")","v":17000},{"$f":"SUMIFS(MoveQty,MoveCode,$A9,MoveDate,\">=\"&$N$2,MoveDate,\"<\"&$N$3+1,MoveType,\"Receipt\")","v":0},{"$f":"-SUMIFS(MoveQty,MoveCode,$A9,MoveDate,\">=\"&$N$2,MoveDate,\"<\"&$N$3+1,MoveType,\"Sale\")","v":0},{"$f":"-SUMIFS(MoveQty,MoveCode,$A9,MoveDate,\">=\"&$N$2,MoveDate,\"<\"&$N$3+1,MoveType,\"Issue\")","v":13061.111111111109},{"$f":"SUMIFS(MoveQty,MoveCode,$A9,MoveDate,\">=\"&$N$2,MoveDate,\"<\"&$N$3+1,MoveType,\"Adjustment\")","v":0}]
["RM25","Door Handle","Units",724,"-",724,740,0,0,-1162,-7,295,{"$f":"SUMIFS(MoveQty,MoveCode,$A10,MoveDate,\">=\"&$N$2,MoveDate,\"<\"&$N$3+1,MoveType,\"Purchase\")","v":740},{"$f":"SUMIFS(MoveQty,MoveCode,$A10,MoveDate,\">=\"&$N$2,MoveDate,\"<\"&$N$3+1,MoveType,\"Receipt\")","v":0},{"$f":"-SUMIFS(MoveQty,MoveCode,$A10,MoveDate,\">=\"&$N$2,MoveDate,\"<\"&$N$3+1,MoveType,\"Sale\")","v":0},{"$f":"-SUMIFS(MoveQty,MoveCode,$A10,MoveDate,\">=\"&$N$2,MoveDate,\"<\"&$N$3+1,MoveType,\"Issue\")","v":1162},{"$f":"SUMIFS(MoveQty,MoveCode,$A10,MoveDate,\">=\"&$N$2,MoveDate,\"<\"&$N$3+1,MoveType,\"Adjustment\")","v":-7}]
["RM30","Wood","M2",2000,"-",2000,22000,0,0,-17151.169590643269,-100,6748.8304093567303,{"$f":"SUMIFS(MoveQty,MoveCode,$A11,MoveDate,\">=\"&$N$2,MoveDate,\"<\"&$N$3+1,MoveType,\"Purchase\")","v":22000},{"$f":"SUMIFS(MoveQty,MoveCode,$A11,MoveDate,\">=\"&$N$2,MoveDate,\"<\"&$N$3+1,MoveType,\"Receipt\")","v":0},{"$f":"-SUMIFS(MoveQty,MoveCode,$A11,MoveDate,\">=\"&$N$2,MoveDate,\"<\"&$N$3+1,MoveType,\"Sale\")","v":0},{"$f":"-SUMIFS(MoveQty,MoveCode,$A11,MoveDate,\">=\"&$N$2,MoveDate,\"<\"&$N$3+1,MoveType,\"Issue\")","v":17151.169590643269},{"$f":"SUMIFS(MoveQty,MoveCode,$A11,MoveDate,\">=\"&$N$2,MoveDate,\"<\"&$N$3+1,MoveType,\"Adjustment\")","v":-100}]
["RM50","1 Inch Screws","Bag",50,"-",50,300,0,0,-138.11111111111109,-18,193.88888888888891,{"$f":"SUMIFS(MoveQty,MoveCode,$A12,MoveDate,\">=\"&$N$2,MoveDate,\"<\"&$N$3+1,MoveType,\"Purchase\")","v":300},{"$f":"SUMIFS(MoveQty,MoveCode,$A12,MoveDate,\">=\"&$N$2,MoveDate,\"<\"&$N$3+1,MoveType,\"Receipt\")","v":0},{"$f":"-SUMIFS(MoveQty,MoveCode,$A12,MoveDate,\">=\"&$N$2,MoveDate,\"<\"&$N$3+1,MoveType,\"Sale\")","v":0},{"$f":"-SUMIFS(MoveQty,MoveCode,$A12,MoveDate,\">=\"&$N$2,MoveDate,\"<\"&$N$3+1,MoveType,\"Issue\")","v":138.11111111111109},{"$f":"SUMIFS(MoveQty,MoveCode,$A12,MoveDate,\">=\"&$N$2,MoveDate,\"<\"&$N$3+1,MoveType,\"Adjustment\")","v":-18}]
["RM55","2 Inch Screws","Bag",1000,"-",1000,3000,0,0,-3979.34640522876,5,25.653594771240023,{"$f":"SUMIFS(MoveQty,MoveCode,$A13,MoveDate,\">=\"&$N$2,MoveDate,\"<\"&$N$3+1,MoveType,\"Purchase\")","v":3000},{"$f":"SUMIFS(MoveQty,MoveCode,$A13,MoveDate,\">=\"&$N$2,MoveDate,\"<\"&$N$3+1,MoveType,\"Receipt\")","v":0},{"$f":"-SUMIFS(MoveQty,MoveCode,$A13,MoveDate,\">=\"&$N$2,MoveDate,\"<\"&$N$3+1,MoveType,\"Sale\")","v":0},{"$f":"-SUMIFS(MoveQty,MoveCode,$A13,MoveDate,\">=\"&$N$2,MoveDate,\"<\"&$N$3+1,MoveType,\"Issue\")","v":3979.34640522876},{"$f":"SUMIFS(MoveQty,MoveCode,$A13,MoveDate,\">=\"&$N$2,MoveDate,\"<\"&$N$3+1,MoveType,\"Adjustment\")","v":5}]
["RM60","Glass","M2",1200,"-",1200,2000,0,0,-2670.7739938080499,20,549.22600619195009,{"$f":"SUMIFS(MoveQty,MoveCode,$A14,MoveDate,\">=\"&$N$2,MoveDate,\"<\"&$N$3+1,MoveType,\"Purchase\")","v":2000},{"$f":"SUMIFS(MoveQty,MoveCode,$A14,MoveDate,\">=\"&$N$2,MoveDate,\"<\"&$N$3+1,MoveType,\"Receipt\")","v":0},{"$f":"-SUMIFS(MoveQty,MoveCode,$A14,MoveDate,\">=\"&$N$2,MoveDate,\"<\"&$N$3+1,MoveType,\"Sale\")","v":0},{"$f":"-SUMIFS(MoveQty,MoveCode,$A14,MoveDate,\">=\"&$N$2,MoveDate,\"<\"&$N$3+1,MoveType,\"Issue\")","v":2670.7739938080499},{"$f":"SUMIFS(MoveQty,MoveCode,$A14,MoveDate,\">=\"&$N$2,MoveDate,\"<\"&$N$3+1,MoveType,\"Adjustment\")","v":20}]
["RM70","Filler","Bag",810,"-",810,1000,0,0,-1210.6432748538009,10,609.35672514619898,{"$f":"SUMIFS(MoveQty,MoveCode,$A15,MoveDate,\">=\"&$N$2,MoveDate,\"<\"&$N$3+1,MoveType,\"Purchase\")","v":1000},{"$f":"SUMIFS(MoveQty,MoveCode,$A15,MoveDate,\">=\"&$N$2,MoveDate,\"<\"&$N$3+1,MoveType,\"Receipt\")","v":0},{"$f":"-SUMIFS(MoveQty,MoveCode,$A15,MoveDate,\">=\"&$N$2,MoveDate,\"<\"&$N$3+1,MoveType,\"Sale\")","v":0},{"$f":"-SUMIFS(MoveQty,MoveCode,$A15,MoveDate,\">=\"&$N$2,MoveDate,\"<\"&$N$3+1,MoveType,\"Issue\")","v":1210.6432748538009},{"$f":"SUMIFS(MoveQty,MoveCode,$A15,MoveDate,\">=\"&$N$2,MoveDate,\"<\"&$N$3+1,MoveType,\"Adjustment\")","v":10}]
{"$rows_left_out":4}
{"sheet":"Movements","index":4,"n_rows":91,"n_cols":12,"rows_kept":91,"cut":false,"hidden":true,"merged":[]}
["Stock Movements"]
["Record Inventory Movement Transactions"]
["© www.excel-skills.com"]
["Transaction Date","Transaction Type","Customer / Supplier Name","Document Number","Stock Code","Transaction Quantity","Error Code","Stock Description","UOM","Quantity on Hand: Prev","Quantity on Hand: New","Movement Date"]
["2021-07-03","Receipt","Manufactured","None","1212GHG",105,{"$f":"IF(AND(ISBLANK(E5)=FALSE,ISNA(VLOOKUP(E5,StockCodeOnly,1,0))=TRUE),\"E2\",IF(AND(ISBLANK(B5)=FALSE,B5<>\"Purchase\",B5<>\"Issue\",B5<>\"Adjustment\",B5<>\"Receipt\",B5<>\"Sale\"),\"E3\",IF(OR(J5<0,K5<0),\"E5\",\"-\")))","v":"-"},{"$f":"IF(ISNA(VLOOKUP($E5,StockCode[],COLUMN(StockCodes!$B$3),0))=TRUE,\"Invalid Stock Code\",VLOOKUP($E5,StockCode[],COLUMN(StockCodes!$B$3),0))","v":"Garden Shed"},{"$f":"IF(ISNA(VLOOKUP($E5,StockCode[],COLUMN(StockCodes!$C$3),0))=TRUE,\"-\",VLOOKUP($E5,StockCode[],COLUMN(StockCodes!$C$3),0))","v":"Units"},{"$f":"SUMIFS(StockOpenQty,StockCodeOnly,$E5)+SUMIFS(MoveQty,MoveDate,\"<\"&$L5,MoveCode,$E5)","v":1020},{"$f":"J5+F5","v":1125},{"$f":"IF(ISBLANK($A5)=TRUE,TODAY()+((ROW($A5)-(86400*ROUNDDOWN(ROW($A5)/86400,0)))/86400),$A5+((ROW($A5)-(86400*ROUNDDOWN(ROW($A5)/86400,0)))/86400))","v":"2021-07-03T00:00:05"}]
["2021-07-03","Issue","Component Usage","None","RM30",-1500,"-",{"$f":"IF(ISNA(VLOOKUP($E6,StockCode[],COLUMN(StockCodes!$B$3),0))=TRUE,\"Invalid Stock Code\",VLOOKUP($E6,StockCode[],COLUMN(StockCodes!$B$3),0))","v":"Wood"},{"$f":"IF(ISNA(VLOOKUP($E6,StockCode[],COLUMN(StockCodes!$C$3),0))=TRUE,\"-\",VLOOKUP($E6,StockCode[],COLUMN(StockCodes!$C$3),0))","v":"M2"},2000,500,"2021-07-03T00:00:06"]
["2021-07-03","Issue","Component Usage","None","RM55",-350,"-",{"$f":"IF(ISNA(VLOOKUP($E7,StockCode[],COLUMN(StockCodes!$B$3),0))=TRUE,\"Invalid Stock Code\",VLOOKUP($E7,StockCode[],COLUMN(StockCodes!$B$3),0))","v":"2 Inch Screws"},{"$f":"IF(ISNA(VLOOKUP($E7,StockCode[],COLUMN(StockCodes!$C$3),0))=TRUE,\"-\",VLOOKUP($E7,StockCode[],COLUMN(StockCodes!$C$3),0))","v":"Bag"},1000,650,"2021-07-03T00:00:07"]
["2021-07-03","Issue","Component Usage","None","RM10",-1200,"-",{"$f":"IF(ISNA(VLOOKUP($E8,StockCode[],COLUMN(StockCodes!$B$3),0))=TRUE,\"Invalid Stock Code\",VLOOKUP($E8,StockCode[],COLUMN(StockCodes!$B$3),0))","v":"Steel Plates"},{"$f":"IF(ISNA(VLOOKUP($E8,StockCode[],COLUMN(StockCodes!$C$3),0))=TRUE,\"-\",VLOOKUP($E8,StockCode[],COLUMN(StockCodes!$C$3),0))","v":"M2"},2000,800,"2021-07-03T00:00:08"]
["2021-07-03","Issue","Component Usage","None","RM25",-107,"-",{"$f":"IF(ISNA(VLOOKUP($E9,StockCode[],COLUMN(StockCodes!$B$3),0))=TRUE,\"Invalid Stock Code\",VLOOKUP($E9,StockCode[],COLUMN(StockCodes!$B$3),0))","v":"Door Handle"},{"$f":"IF(ISNA(VLOOKUP($E9,StockCode[],COLUMN(StockCodes!$C$3),0))=TRUE,\"-\",VLOOKUP($E9,StockCode[],COLUMN(StockCodes!$C$3),0))","v":"Units"},724,617,"2021-07-03T00:00:09"]
["2021-07-03","Issue","Component Usage","None","RM50",-12,"-",{"$f":"IF(ISNA(VLOOKUP($E10,StockCode[],COLUMN(StockCodes!$B$3),0))=TRUE,\"Invalid Stock Code\",VLOOKUP($E10,StockCode[],COLUMN(StockCodes!$B$3),0))","v":"1 Inch Screws"},{"$f":"IF(ISNA(VLOOKUP($E10,StockCode[],COLUMN(StockCodes!$C$3),0))=TRUE,\"-\",VLOOKUP($E10,StockCode[],COLUMN(StockCodes!$C$3),0))","v":"Bag"},50,38,"2021-07-03T00:00:10"]
["2021-07-03","Issue","Component Usage","None","RM60",-250,"-",{"$f":"IF(ISNA(VLOOKUP($E11,StockCode[],COLUMN(StockCodes!$B$3),0))=TRUE,\"Invalid Stock Code\",VLOOKUP($E11,StockCode[],COLUMN(StockCodes!$B$3),0))","v":"Glass"},{"$f":"IF(ISNA(VLOOKUP($E11,StockCode[],COLUMN(StockCodes!$C$3),0))=TRUE,\"-\",VLOOKUP($E11,StockCode[],COLUMN(StockCodes!$C$3),0))","v":"M2"},1200,950,"2021-07-03T00:00:11"]
["2021-07-03","Issue","Component Usage","None","RM70",-120,"-",{"$f":"IF(ISNA(VLOOKUP($E12,StockCode[],COLUMN(StockCodes!$B$3),0))=TRUE,\"Invalid Stock Code\",VLOOKUP($E12,StockCode[],COLUMN(StockCodes!$B$3),0))","v":"Filler"},{"$f":"IF(ISNA(VLOOKUP($E12,StockCode[],COLUMN(StockCodes!$C$3),0))=TRUE,\"-\",VLOOKUP($E12,StockCode[],COLUMN(StockCodes!$C$3),0))","v":"Bag"},810,690,"2021-07-03T00:00:12"]
["2021-07-03","Issue","Component Usage","None","RM75",-200,"-",{"$f":"IF(ISNA(VLOOKUP($E13,StockCode[],COLUMN(StockCodes!$B$3),0))=TRUE,\"Invalid Stock Code\",VLOOKUP($E13,StockCode[],COLUMN(StockCodes!$B$3),0))","v":"Swivel"},{"$f":"IF(ISNA(VLOOKUP($E13,StockCode[],COLUMN(StockCodes!$C$3),0))=TRUE,\"-\",VLOOKUP($E13,StockCode[],COLUMN(StockCodes!$C$3),0))","v":"Units"},963,763,"2021-07-03T00:00:13"]
["2021-07-03","Sale","J Stewart","IN0009","1212GHG",-750,"-",{"$f":"IF(ISNA(VLOOKUP($E14,StockCode[],COLUMN(StockCodes!$B$3),0))=TRUE,\"Invalid Stock Code\",VLOOKUP($E14,StockCode[],COLUMN(StockCodes!$B$3),0))","v":"Garden Shed"},{"$f":"IF(ISNA(VLOOKUP($E14,StockCode[],COLUMN(StockCodes!$C$3),0))=TRUE,\"-\",VLOOKUP($E14,StockCode[],COLUMN(StockCodes!$C$3),0))","v":"Units"},1125,375,"2021-07-03T00:00:14"]
["2021-07-25","Sale","G Smith","IN0010","1212PHP",-100,"-",{"$f":"IF(ISNA(VLOOKUP($E15,StockCode[],COLUMN(StockCodes!$B$3),0))=TRUE,\"Invalid Stock Code\",VLOOKUP($E15,StockCode[],COLUMN(StockCodes!$B$3),0))","v":"Painted Garden Shed"},{"$f":"IF(ISNA(VLOOKUP($E15,StockCode[],COLUMN(StockCodes!$C$3),0))=TRUE,\"-\",VLOOKUP($E15,StockCode[],COLUMN(StockCodes!$C$3),0))","v":"Units"},930,830,"2021-07-25T00:00:15"]
{"$rows_left_out":77}
{"sheet":"StockCount","index":5,"n_rows":17,"n_cols":7,"rows_kept":17,"cut":false,"hidden":true,"merged":[]}
["Stock Count Variance Report",null,null,null,null,"Count Date","2021-07-12"]
["Calculate Stock Count Variances"]
["© www.excel-skills.com"]
["Stock Code","Description","UOM","Error Code","Quantity Counted","Theoretical Stock Qty","Quantity Variance"]
["1212GHG",{"$f":"IF(ISNA(VLOOKUP($A5,StockMaster,COLUMN(StockCodes!$B$5),0))=TRUE,\"Invalid Stock Code\",VLOOKUP($A5,StockMaster,COLUMN(StockCodes!$B$5),0))","v":"Garden Shed"},{"$f":"IF(ISNA(VLOOKUP($A5,StockMaster,COLUMN(StockCodes!$C$5),0))=TRUE,\"error\",VLOOKUP($A5,StockMaster,COLUMN(StockCodes!$C$5),0))","v":"Units"},{"$f":"IF(AND(ISBLANK(A5)=FALSE,COUNTIF(CountCode,A5)>1)=TRUE,\"E1\",IF(AND(ISBLANK(A5)=FALSE,ISNA(VLOOKUP(A5,StockCodeOnly,1,0))=TRUE),\"E2\",\"-\"))","v":"-"},175,{"$f":"SUMIFS(StockOpenQty,StockCodeOnly,$A5)+SUMIFS(MoveQty,MoveDate,\"<\"&$G$1+1,MoveCode,$A5)","v":375},{"$f":"E5-F5","v":-200}]
["1212PHP",{"$f":"IF(ISNA(VLOOKUP($A6,StockMaster,COLUMN(StockCodes!$B$5),0))=TRUE,\"Invalid Stock Code\",VLOOKUP($A6,StockMaster,COLUMN(StockCodes!$B$5),0))","v":"Painted Garden Shed"},{"$f":"IF(ISNA(VLOOKUP($A6,StockMaster,COLUMN(StockCodes!$C$5),0))=TRUE,\"error\",VLOOKUP($A6,StockMaster,COLUMN(StockCodes!$C$5),0))","v":"Units"},"-",370,930,-560]
["1212THT",{"$f":"IF(ISNA(VLOOKUP($A7,StockMaster,COLUMN(StockCodes!$B$5),0))=TRUE,\"Invalid Stock Code\",VLOOKUP($A7,StockMaster,COLUMN(StockCodes!$B$5),0))","v":"Tools Shed"},{"$f":"IF(ISNA(VLOOKUP($A7,StockMaster,COLUMN(StockCodes!$C$5),0))=TRUE,\"error\",VLOOKUP($A7,StockMaster,COLUMN(StockCodes!$C$5),0))","v":"Units"},"-",125,240,-115]
["RM10",{"$f":"IF(ISNA(VLOOKUP($A8,StockMaster,COLUMN(StockCodes!$B$5),0))=TRUE,\"Invalid Stock Code\",VLOOKUP($A8,StockMaster,COLUMN(StockCodes!$B$5),0))","v":"Steel Plates"},{"$f":"IF(ISNA(VLOOKUP($A8,StockMaster,COLUMN(StockCodes!$C$5),0))=TRUE,\"error\",VLOOKUP($A8,StockMaster,COLUMN(StockCodes!$C$5),0))","v":"M2"},"-",11550,800,10750]
["RM25",{"$f":"IF(ISNA(VLOOKUP($A9,StockMaster,COLUMN(StockCodes!$B$5),0))=TRUE,\"Invalid Stock Code\",VLOOKUP($A9,StockMaster,COLUMN(StockCodes!$B$5),0))","v":"Door Handle"},{"$f":"IF(ISNA(VLOOKUP($A9,StockMaster,COLUMN(StockCodes!$C$5),0))=TRUE,\"error\",VLOOKUP($A9,StockMaster,COLUMN(StockCodes!$C$5),0))","v":"Units"},"-",800,617,183]
["RM30",{"$f":"IF(ISNA(VLOOKUP($A10,StockMaster,COLUMN(StockCodes!$B$5),0))=TRUE,\"Invalid Stock Code\",VLOOKUP($A10,StockMaster,COLUMN(StockCodes!$B$5),0))","v":"Wood"},{"$f":"IF(ISNA(VLOOKUP($A10,StockMaster,COLUMN(StockCodes!$C$5),0))=TRUE,\"error\",VLOOKUP($A10,StockMaster,COLUMN(StockCodes!$C$5),0))","v":"M2"},"-",14250,500,13750]
["RM50",{"$f":"IF(ISNA(VLOOKUP($A11,StockMaster,COLUMN(StockCodes!$B$5),0))=TRUE,\"Invalid Stock Code\",VLOOKUP($A11,StockMaster,COLUMN(StockCodes!$B$5),0))","v":"1 Inch Screws"},{"$f":"IF(ISNA(VLOOKUP($A11,StockMaster,COLUMN(StockCodes!$C$5),0))=TRUE,\"error\",VLOOKUP($A11,StockMaster,COLUMN(StockCodes!$C$5),0))","v":"Bag"},"-",250,38,212]
["RM55",{"$f":"IF(ISNA(VLOOKUP($A12,StockMaster,COLUMN(StockCodes!$B$5),0))=TRUE,\"Invalid Stock Code\",VLOOKUP($A12,StockMaster,COLUMN(StockCodes!$B$5),0))","v":"2 Inch Screws"},{"$f":"IF(ISNA(VLOOKUP($A12,StockMaster,COLUMN(StockCodes!$C$5),0))=TRUE,\"error\",VLOOKUP($A12,StockMaster,COLUMN(StockCodes!$C$5),0))","v":"Bag"},"-",1775,650,1125]
["RM60",{"$f":"IF(ISNA(VLOOKUP($A13,StockMaster,COLUMN(StockCodes!$B$5),0))=TRUE,\"Invalid Stock Code\",VLOOKUP($A13,StockMaster,COLUMN(StockCodes!$B$5),0))","v":"Glass"},{"$f":"IF(ISNA(VLOOKUP($A13,StockMaster,COLUMN(StockCodes!$C$5),0))=TRUE,\"error\",VLOOKUP($A13,StockMaster,COLUMN(StockCodes!$C$5),0))","v":"M2"},{"$f":"IF(AND(ISBLANK(A13)=FALSE,COUNTIF(CountCode,A13)>1)=TRUE,\"E1\",IF(AND(ISBLANK(A13)=FALSE,ISNA(VLOOKUP(A13,StockCodeOnly,1,0))=TRUE),\"E2\",\"-\"))","v":"-"},1800,950,{"$f":"E13-F13","v":850}]
["RM70",{"$f":"IF(ISNA(VLOOKUP($A14,StockMaster,COLUMN(StockCodes!$B$5),0))=TRUE,\"Invalid Stock Code\",VLOOKUP($A14,StockMaster,COLUMN(StockCodes!$B$5),0))","v":"Filler"},{"$f":"IF(ISNA(VLOOKUP($A14,StockMaster,COLUMN(StockCodes!$C$5),0))=TRUE,\"error\",VLOOKUP($A14,StockMaster,COLUMN(StockCodes!$C$5),0))","v":"Bag"},{"$f":"IF(AND(ISBLANK(A14)=FALSE,COUNTIF(CountCode,A14)>1)=TRUE,\"E1\",IF(AND(ISBLANK(A14)=FALSE,ISNA(VLOOKUP(A14,StockCodeOnly,1,0))=TRUE),\"E2\",\"-\"))","v":"-"},1200,690,510]
["RM75",{"$f":"IF(ISNA(VLOOKUP($A15,StockMaster,COLUMN(StockCodes!$B$5),0))=TRUE,\"Invalid Stock Code\",VLOOKUP($A15,StockMaster,COLUMN(StockCodes!$B$5),0))","v":"Swivel"},{"$f":"IF(ISNA(VLOOKUP($A15,StockMaster,COLUMN(StockCodes!$C$5),0))=TRUE,\"error\",VLOOKUP($A15,StockMaster,COLUMN(StockCodes!$C$5),0))","v":"Units"},{"$f":"IF(AND(ISBLANK(A15)=FALSE,COUNTIF(CountCode,A15)>1)=TRUE,\"E1\",IF(AND(ISBLANK(A15)=FALSE,ISNA(VLOOKUP(A15,StockCodeOnly,1,0))=TRUE),\"E2\",\"-\"))","v":"-"},1100,763,337]
{"$rows_left_out":3}
{"sheet":"Dashboard","index":6,"n_rows":216,"n_cols":10,"rows_kept":216,"cut":false,"hidden":true,"merged":[[25,1,33,4],[25,5,33,9],[34,1,35,2],[34,5,35,7],[42,1,43,2],[42,5,43,7],[15,1,24,9],[5,1,12,1],[5,2,12,3],[5,4,12,5],[5,6,5,9],[6,6,6,7],[7,6,7,7],[8,6,8,7],[9,6,9,7],[10,6,10,7],[11,6,11,7],[12,6,12,7],[13,1,13,5],[14,1,14,5],[1,1,4,1],[1,2,2,5],[1,6,1,9],[2,6,2,9],[3,2,3,3],[3,6,3,9],[4,2,4,3],[4,6,4,9]]}
[]
[null,"INVENTORY\nDASHBOARD","Dashboard Filters",null,null,null,"SELECTED STOCK CODE:"]
[null,null,null,null,null,null,{"$f":"IF(ISBLANK($C$5),\"ALL\",C56&\" \"&C57)","v":"ALL"}]
[null,null,"STOCK CODE",null,"FROM DATE","TO DATE","UNIT OF MEASURE:"]
[null,null,null,null,null,"2021-09-30",{"$f":"C58","v":""}]
[null,null,null,null,null,null,"Stock Movement"]
[null,null,null,null,null,null,null,null,null,"Qty"]
[null,null,null,null,null,null,"Opening Balance",null,null,{"$f":"C66","v":11257}]
[null,null,null,null,null,null,"Purchases / Receipts",null,null,{"$f":"C67","v":48747}]
[null,null,null,null,null,null,"Sales / Issues",null,null,{"$f":"C68","v":-44123.155486756099}]
[null,null,null,null,null,null,"Adjustments",null,null,{"$f":"C69","v":-110}]
[null,null,null,null,null,null,"Closing Balance",null,null,{"$f":"C70","v":15770.844513243899}]
[]
[null,"Interactive Inventory Reports",null,null,null,null,null,null,"BASIS","TYPE"]
[null,{"$f":"$F$71","v":"All Transactions By Quantity"},null,null,null,null,null,null,"Movement","All"]
{"$rows_left_out":201}