{"text_format":"1","workbook":"xlsx","n_sheets":8,"sheets":["Info","Trial","Instructions","StockCodes","Movements","StockCount","Dashboard","Profitability"],"not_rendered":{"charts":8,"images":2,"macros":1,"external_links":0,"defined_names":39,"comments":0,"pivot_tables":0},"unopened":[],"bounds":{"document_bytes":16777216,"sheet_cells":100000,"rows_first":2000,"rows_last":500,"rows_between":2000,"halvings":0,"cell_chars":16384,"cell_head_chars":4096},"cells_cut":0,"cells_raw":0,"read":"whole","date_system":"1900"}

{"sheet":"Info","index":0,"n_rows":0,"n_cols":0,"rows_kept":0,"cut":false,"hidden":false,"merged":[]}

{"sheet":"Trial","index":1,"n_rows":0,"n_cols":0,"rows_kept":0,"cut":false,"hidden":true,"merged":[]}

{"sheet":"Instructions","index":2,"n_rows":234,"n_cols":1,"rows_kept":234,"cut":false,"hidden":true,"merged":[]}
["Excel Skills | Inventory Control Template | Trade Based"]
["Instructions"]
["www.excel-skills.com"]
[]
["This unique template enables users to analyse the profitability of any trade based business by calculating the gross profit margins of all inventory items. The functionality included in this template enables users to control inventory by creating stock codes for all individual inventory items; recording inventory purchases, sales and adjustments; performing physical stock counts and analysing stock take variances; calculating stock valuations and measuring sales, cost of sales & gross profits based on any user defined date range. All inventory valuations are performed on an average cost basis."]
[]
["The following sheets are included in this template:"]
["StockCodes - this sheet can be used to create unique stock codes for all inventory items and also includes an inventory valuation, inventory movement and gross profit margin report for the stock codes created."]
["Movements - all inventory movement transactions should be recorded on this sheet."]
["StockCount - this sheet can be used to perform a physical stock count and to analyse stock take variances. Physical stock count quantities are measured against theoretical stock balances and once the accuracy of the stock take variances has been established, the calculated stock variances can be recorded as stock adjustments on the Movements sheet in order to adjust the theoretical stock quantities to the physical stock count quantities."]
{"$rows_left_out":225}
{"sheet":"StockCodes","index":3,"n_rows":17,"n_cols":31,"rows_kept":17,"cut":false,"hidden":true,"merged":[]}
["Stock Codes",null,null,{"$f":"IF(AND(ISBLANK(D3)=FALSE,D3<D2),\"Error! The From date cannot be after the To date!\",\"\")","v":""}]
["Set-up and Reporting",null,"From Date  ",null,{"$f":"IF(ISBLANK(D2)=TRUE,IF(MIN(MoveDate)=0,DATE(YEAR($D$3),MONTH($D$3),1),DATE(YEAR(MIN(MoveDate)),MONTH(MIN(MoveDate)),1)),D2)","v":"2021-01-01"},null,null,null,null,null,null,null,null,null,null,null,null,null,null,null,null,{"$f":"Dashboard!C55","v":"2021-01-01"}]
["© www.excel-skills.com",null,"To Date  ","2021-08-31",{"$f":"IF(ISBLANK(D3)=TRUE,DATE(YEAR(TODAY()),MONTH(TODAY())+1,0),D3)","v":"2021-08-31"},null,null,null,null,null,null,null,null,null,null,null,null,null,null,null,null,{"$f":"Dashboard!D55","v":"2021-08-31"}]
[null,null,null,null,null,null,{"$f":"SUBTOTAL(109,StockCode[[#Data],[Opening Value]])","v":146475},null,null,{"$f":"SUBTOTAL(109,StockCode[[#Data],[Inventory Valuation]])","v":152855.03799088908},null,null,null,null,{"$f":"SUBTOTAL(109,StockCode[[#Data],[Opening Value2]])","v":146475},{"$f":"SUBTOTAL(109,StockCode[[#Data],[Purchases Value]])","v":416154.85},{"$f":"SUBTOTAL(109,StockCode[[#Data],[Cost of Sales Value]])","v":-418642.94145842484},{"$f":"SUBTOTAL(109,StockCode[[#Data],[Adjustments Value]])","v":8868.1294493139139},{"$f":"SUBTOTAL(109,StockCode[[#Data],[Total Sales Value]])","v":551140},{"$f":"SUBTOTAL(109,StockCode[[#Data],[Gross Profit Value]])","v":132497.05854157516},{"$f":"IF(S4=0,0,T4/S4)","v":0.24040544787454213}]
["Stock Code","Description","UOM","Opening Quantity","Opening Cost","Error Code","Opening Value","Quantity on Hand","Average Cost","Inventory Valuation","Opening Quantity2","Purchases Quantity","Sales Quantity","Adjustments Quantity","Opening Value2","Purchases Value","Cost of Sales Value","Adjustments Value","Total Sales Value","Gross Profit Value","Gross\n Profit  %","Dash Purch Qty","Dash Sale Qty","Dash Adjust Qty","Dash Purch Value","Dash COS Value","Dash Adjust Value","Dash Adjust AB Value","Dash Sales Value","Dash Price Value","Dash ABS Price"]
["AA00020","Cleansing Lotion","units",30,85,{"$f":"IF(AND(ISBLANK(A6)=FALSE,COUNTIF(StockCodeOnly,A6)>1)=TRUE,\"E1\",\"-\")","v":"-"},{"$f":"D6*E6","v":2550},{"$f":"SUMIFS(MoveQty,MoveCode,$A6,MoveDate,\"<\"&$E$3+1)+D6","v":250},{"$f":"IF(H6=0,0,J6/H6)","v":99.485881410256397},{"$f":"SUMIFS(MoveAmount,MoveCode,$A6,MoveDate,\"<\"&$E$3+1)+(D6*E6)","v":24871.470352564098},{"$f":"D6+SUMIFS(MoveQty,MoveCode,$A6,MoveDate,\"<\"&$E$2)","v":30},{"$f":"SUMIFS(MoveQty,MoveCode,$A6,MoveDate,\">=\"&$E$2,MoveDate,\"<\"&$E$3+1,MoveType,\"Purchase\")","v":440},{"$f":"SUMIFS(MoveQty,MoveCode,$A6,MoveDate,\">=\"&$E$2,MoveDate,\"<\"&$E$3+1,MoveType,\"Sale\")","v":-210},{"$f":"SUMIFS(MoveQty,MoveCode,$A6,MoveDate,\">=\"&$E$2,MoveDate,\"<\"&$E$3+1,MoveType,\"Adjustment\")","v":-10},{"$f":"(D6*E6)+SUMIFS(MoveAmount,MoveCode,$A6,MoveDate,\"<\"&$E$2)","v":2550},{"$f":"SUMIFS(MoveAmount,MoveCode,$A6,MoveDate,\">=\"&$E$2,MoveDate,\"<\"&$E$3+1,MoveType,\"Purchase\")","v":43560.4},{"$f":"SUMIFS(MoveAmount,MoveCode,$A6,MoveDate,\">=\"&$E$2,MoveDate,\"<\"&$E$3+1,MoveType,\"Sale\")","v":-20244.070833333339},{"$f":"SUMIFS(MoveAmount,MoveCode,$A6,MoveDate,\">=\"&$E$2,MoveDate,\"<\"&$E$3+1,MoveType,\"Adjustment\")","v":-994.858814102564},{"$f":"SUMIFS(MoveSale,MoveCode,$A6,MoveDate,\">=\"&$E$2,MoveDate,\"<\"&$E$3+1,MoveType,\"Sale\")","v":27220},{"$f":"S6+Q6","v":6975.9291666666613},{"$f":"IF(S6=0,0,T6/S6)","v":0.25627954322801844},{"$f":"SUMIFS(MoveQty,MoveCode,$A6,MoveDate,\">=\"&$V$2,MoveDate,\"<\"&$V$3+1,MoveType,\"Purchase\")","v":440},{"$f":"-SUMIFS(MoveQty,MoveCode,$A6,MoveDate,\">=\"&$V$2,MoveDate,\"<\"&$V$3+1,MoveType,\"Sale\")","v":210},{"$f":"SUMIFS(MoveQty,MoveCode,$A6,MoveDate,\">=\"&$V$2,MoveDate,\"<\"&$V$3+1,MoveType,\"Adjustment\")","v":-10},{"$f":"SUMIFS(MoveAmount,MoveCode,$A6,MoveDate,\">=\"&$V$2,MoveDate,\"<\"&$V$3+1,MoveType,\"Purchase\")","v":43560.4},{"$f":"SUMIFS(MoveAmount,MoveCode,$A6,MoveDate,\">=\"&$V$2,MoveDate,\"<\"&$V$3+1,MoveType,\"Sale\")","v":-20244.070833333339},{"$f":"SUMIFS(MoveAmount,MoveCode,$A6,MoveDate,\">=\"&$V$2,MoveDate,\"<\"&$V$3+1,MoveType,\"Adjustment\")","v":-994.858814102564},{"$f":"ABS(AA6)","v":994.858814102564},{"$f":"SUMIFS(MoveSale,MoveCode,$A6,MoveDate,\">=\"&$V$2,MoveDate,\"<\"&$V$3+1,MoveType,\"Sale\")","v":27220},{"$f":"SUMIFS(MovePrice,MoveCode,$A6,MoveDate,\">=\"&$V$2,MoveDate,\"<\"&$V$3+1,MoveType,\"Purchase\")","v":-1319.4738648018656},{"$f":"ABS(AD6)","v":1319.4738648018656}]
["AA00060","Refining Scrub Cream","units",10,100,"-",1000,0,0,0,10,60,-70,0,1000,5361.7,-6361.7000000000007,0,8650,{"$f":"S7+Q7","v":2288.2999999999993},{"$f":"IF(S7=0,0,T7/S7)","v":0.26454335260115597},{"$f":"SUMIFS(MoveQty,MoveCode,$A7,MoveDate,\">=\"&$V$2,MoveDate,\"<\"&$V$3+1,MoveType,\"Purchase\")","v":60},{"$f":"-SUMIFS(MoveQty,MoveCode,$A7,MoveDate,\">=\"&$V$2,MoveDate,\"<\"&$V$3+1,MoveType,\"Sale\")","v":70},{"$f":"SUMIFS(MoveQty,MoveCode,$A7,MoveDate,\">=\"&$V$2,MoveDate,\"<\"&$V$3+1,MoveType,\"Adjustment\")","v":0},{"$f":"SUMIFS(MoveAmount,MoveCode,$A7,MoveDate,\">=\"&$V$2,MoveDate,\"<\"&$V$3+1,MoveType,\"Purchase\")","v":5361.7},{"$f":"SUMIFS(MoveAmount,MoveCode,$A7,MoveDate,\">=\"&$V$2,MoveDate,\"<\"&$V$3+1,MoveType,\"Sale\")","v":-6361.7000000000007},{"$f":"SUMIFS(MoveAmount,MoveCode,$A7,MoveDate,\">=\"&$V$2,MoveDate,\"<\"&$V$3+1,MoveType,\"Adjustment\")","v":0},0,{"$f":"SUMIFS(MoveSale,MoveCode,$A7,MoveDate,\">=\"&$V$2,MoveDate,\"<\"&$V$3+1,MoveType,\"Sale\")","v":8650},{"$f":"SUMIFS(MovePrice,MoveCode,$A7,MoveDate,\">=\"&$V$2,MoveDate,\"<\"&$V$3+1,MoveType,\"Purchase\")","v":571.23333333333426},571.23333333333426]
["AA00080","Revitalising Cream","units",470,200,"-",94000,210,230.13772233201578,48328.921689723313,470,450,-760,50,94000,101403.25,-157257.1050959909,10182.776785714286,225840,68582.894904009096,0.30367913081831871,{"$f":"SUMIFS(MoveQty,MoveCode,$A8,MoveDate,\">=\"&$V$2,MoveDate,\"<\"&$V$3+1,MoveType,\"Purchase\")","v":450},{"$f":"-SUMIFS(MoveQty,MoveCode,$A8,MoveDate,\">=\"&$V$2,MoveDate,\"<\"&$V$3+1,MoveType,\"Sale\")","v":760},{"$f":"SUMIFS(MoveQty,MoveCode,$A8,MoveDate,\">=\"&$V$2,MoveDate,\"<\"&$V$3+1,MoveType,\"Adjustment\")","v":50},{"$f":"SUMIFS(MoveAmount,MoveCode,$A8,MoveDate,\">=\"&$V$2,MoveDate,\"<\"&$V$3+1,MoveType,\"Purchase\")","v":101403.25},{"$f":"SUMIFS(MoveAmount,MoveCode,$A8,MoveDate,\">=\"&$V$2,MoveDate,\"<\"&$V$3+1,MoveType,\"Sale\")","v":-157257.1050959909},{"$f":"SUMIFS(MoveAmount,MoveCode,$A8,MoveDate,\">=\"&$V$2,MoveDate,\"<\"&$V$3+1,MoveType,\"Adjustment\")","v":10182.776785714286},10182.776785714286,{"$f":"SUMIFS(MoveSale,MoveCode,$A8,MoveDate,\">=\"&$V$2,MoveDate,\"<\"&$V$3+1,MoveType,\"Sale\")","v":225840},{"$f":"SUMIFS(MovePrice,MoveCode,$A8,MoveDate,\">=\"&$V$2,MoveDate,\"<\"&$V$3+1,MoveType,\"Purchase\")","v":-8846.15746753247},8846.15746753247]
["AA00140","Moisturiser for Dry Skin","units",50,160,"-",8000,80,144.43758333333332,11555.006666666666,50,120,-100,10,8000,18211.400000000001,-16256.393333333335,1600,19580,3323.6066666666648,0.16974497786857329,{"$f":"SUMIFS(MoveQty,MoveCode,$A9,MoveDate,\">=\"&$V$2,MoveDate,\"<\"&$V$3+1,MoveType,\"Purchase\")","v":120},{"$f":"-SUMIFS(MoveQty,MoveCode,$A9,MoveDate,\">=\"&$V$2,MoveDate,\"<\"&$V$3+1,MoveType,\"Sale\")","v":100},{"$f":"SUMIFS(MoveQty,MoveCode,$A9,MoveDate,\">=\"&$V$2,MoveDate,\"<\"&$V$3+1,MoveType,\"Adjustment\")","v":10},{"$f":"SUMIFS(MoveAmount,MoveCode,$A9,MoveDate,\">=\"&$V$2,MoveDate,\"<\"&$V$3+1,MoveType,\"Purchase\")","v":18211.400000000001},{"$f":"SUMIFS(MoveAmount,MoveCode,$A9,MoveDate,\">=\"&$V$2,MoveDate,\"<\"&$V$3+1,MoveType,\"Sale\")","v":-16256.393333333335},{"$f":"SUMIFS(MoveAmount,MoveCode,$A9,MoveDate,\">=\"&$V$2,MoveDate,\"<\"&$V$3+1,MoveType,\"Adjustment\")","v":1600},1600,{"$f":"SUMIFS(MoveSale,MoveCode,$A9,MoveDate,\">=\"&$V$2,MoveDate,\"<\"&$V$3+1,MoveType,\"Sale\")","v":19580},{"$f":"SUMIFS(MovePrice,MoveCode,$A9,MoveDate,\">=\"&$V$2,MoveDate,\"<\"&$V$3+1,MoveType,\"Purchase\")","v":1159.3366666666675},1159.3366666666675]
["AA00150","Moisture Cover SPF 15","units",50,52.5,"-",2625,30,54,1620,50,10,-30,0,2625,600,-1605,0,1950,345,0.17692307692307693,{"$f":"SUMIFS(MoveQty,MoveCode,$A10,MoveDate,\">=\"&$V$2,MoveDate,\"<\"&$V$3+1,MoveType,\"Purchase\")","v":10},{"$f":"-SUMIFS(MoveQty,MoveCode,$A10,MoveDate,\">=\"&$V$2,MoveDate,\"<\"&$V$3+1,MoveType,\"Sale\")","v":30},{"$f":"SUMIFS(MoveQty,MoveCode,$A10,MoveDate,\">=\"&$V$2,MoveDate,\"<\"&$V$3+1,MoveType,\"Adjustment\")","v":0},{"$f":"SUMIFS(MoveAmount,MoveCode,$A10,MoveDate,\">=\"&$V$2,MoveDate,\"<\"&$V$3+1,MoveType,\"Purchase\")","v":600},{"$f":"SUMIFS(MoveAmount,MoveCode,$A10,MoveDate,\">=\"&$V$2,MoveDate,\"<\"&$V$3+1,MoveType,\"Sale\")","v":-1605},{"$f":"SUMIFS(MoveAmount,MoveCode,$A10,MoveDate,\">=\"&$V$2,MoveDate,\"<\"&$V$3+1,MoveType,\"Adjustment\")","v":0},0,{"$f":"SUMIFS(MoveSale,MoveCode,$A10,MoveDate,\">=\"&$V$2,MoveDate,\"<\"&$V$3+1,MoveType,\"Sale\")","v":1950},{"$f":"SUMIFS(MovePrice,MoveCode,$A10,MoveDate,\">=\"&$V$2,MoveDate,\"<\"&$V$3+1,MoveType,\"Purchase\")","v":-75},75]
{"$rows_left_out":8}
{"sheet":"Movements","index":4,"n_rows":145,"n_cols":24,"rows_kept":145,"cut":false,"hidden":true,"merged":[]}
["Inventory Movements"]
["Record Inventory Movement Transactions"]
["© www.excel-skills.com",null,null,null,null,null,null,null,null,null,null,null,null,null,{"$f":"SUBTOTAL(109,InvMovement[Transaction Value])","v":6380.03799088909},null,{"$f":"SUBTOTAL(109,InvMovement[Unit Price \nVariance])","v":-143.63612479372466},null,null,{"$f":"SUBTOTAL(109,InvMovement[Total Sales Value])","v":551140},{"$f":"SUBTOTAL(109,InvMovement[Cost of Sales Value])","v":418642.94145842484},{"$f":"SUBTOTAL(109,InvMovement[Gross Profit Value])","v":132497.05854157518}]
["Transaction Date","Transaction Type","Supplier Name / Customer Name","Document Number","Stock Code","Transaction Quantity","Per Unit \nPrice","Error Code","Stock Description","UOM","Quantity On Hand: Prev","Quantity on Hand: New","Average Cost: Previous","Average Cost: New","Transaction Value","Purchase Price per Unit","Unit Price \nVariance","Price Variance %","Total Price Variance","Total Sales Value","Cost of Sales Value","Gross Profit Value","Gross Profit \n%","Movement Date"]
["2021-01-05","Purchase","WC Depot",651779,"AA00060",20,97.484999999999999,{"$f":"IF(AND(ISBLANK(E5)=FALSE,ISNA(VLOOKUP(E5,StockCodeOnly,1,0))=TRUE),\"E2\",IF(AND(ISBLANK(B5)=FALSE,B5<>\"Purchase\",B5<>\"Sale\",B5<>\"Adjustment\"),\"E3\",IF(OR(K5<0,L5<0),\"E5\",\"-\")))","v":"-"},{"$f":"IF(ISNA(VLOOKUP($E5,StockMaster,COLUMN(StockCodes!$B$5),0))=TRUE,\"Invalid Stock Code\",VLOOKUP($E5,StockMaster,COLUMN(StockCodes!$B$5),0))","v":"Refining Scrub Cream"},{"$f":"IF(ISNA(VLOOKUP($E5,StockMaster,COLUMN(StockCodes!$C$5),0))=TRUE,\"-\",VLOOKUP($E5,StockMaster,COLUMN(StockCodes!$C$5),0))","v":"units"},{"$f":"SUMIFS(StockOpenQty,StockCodeOnly,E5)+SUMIFS(MoveQty,MoveDate,\"<\"&$X5,MoveCode,$E5)","v":10},{"$f":"K5+F5","v":30},{"$f":"IF($K5=0,0,((SUMIFS(StockOpenQty,StockCodeOnly,$E5)*SUMIFS(StockOpenCost,StockCodeOnly,$E5))+SUMIFS(MoveAmount,MoveDate,\"<\"&$X5,MoveCode,$E5))/$K5)","v":100},{"$f":"IF(B5<>\"Purchase\",M5,IF(L5=0,0,((K5*M5)+(F5*G5))/(K5+F5)))","v":98.323333333333323},{"$f":"IF(B5=\"Purchase\",F5*G5,F5*N5)","v":1949.7},{"$f":"IF(B5<>\"Purchase\",0,G5)","v":97.484999999999999},{"$f":"IF(B5<>\"Purchase\",0,IF(K5=0,0,M5-P5))","v":2.5150000000000006},{"$f":"IF(B5<>\"Purchase\",0,IF(M5=0,0,Q5/M5))","v":2.5150000000000006E-2},{"$f":"Q5*F5","v":50.300000000000011},{"$f":"IF(B5<>\"Sale\",0,-F5*G5)","v":0},{"$f":"IF(B5<>\"Sale\",0,-F5*N5)","v":0},{"$f":"T5-U5","v":0},{"$f":"IF(B5<>\"Sale\",0,IF($T5=0,0,$V5/$T5))","v":0},{"$f":"IF(ISBLANK($A5)=TRUE,TODAY()+((ROW($A5)-(86400*ROUNDDOWN(ROW($A5)/86400,0)))/86400),$A5+((ROW($A5)-(86400*ROUNDDOWN(ROW($A5)/86400,0)))/86400))","v":"2021-01-05T00:00:05"}]
["2021-01-05","Sale","L Allen","AN0152","AA00060",-10,130,"-",{"$f":"IF(ISNA(VLOOKUP($E6,StockMaster,COLUMN(StockCodes!$B$5),0))=TRUE,\"Invalid Stock Code\",VLOOKUP($E6,StockMaster,COLUMN(StockCodes!$B$5),0))","v":"Refining Scrub Cream"},{"$f":"IF(ISNA(VLOOKUP($E6,StockMaster,COLUMN(StockCodes!$C$5),0))=TRUE,\"-\",VLOOKUP($E6,StockMaster,COLUMN(StockCodes!$C$5),0))","v":"units"},30,20,{"$f":"IF($K6=0,0,((SUMIFS(StockOpenQty,StockCodeOnly,$E6)*SUMIFS(StockOpenCost,StockCodeOnly,$E6))+SUMIFS(MoveAmount,MoveDate,\"<\"&$X6,MoveCode,$E6))/$K6)","v":98.323333333333323},98.323333333333323,-983.23333333333323,0,0,0,0,1300,983.23333333333323,316.76666666666677,0.24366666666666675,"2021-01-05T00:00:06"]
["2021-01-05","Sale","S Barr","AN0153","AA00060",-10,130,"-",{"$f":"IF(ISNA(VLOOKUP($E7,StockMaster,COLUMN(StockCodes!$B$5),0))=TRUE,\"Invalid Stock Code\",VLOOKUP($E7,StockMaster,COLUMN(StockCodes!$B$5),0))","v":"Refining Scrub Cream"},{"$f":"IF(ISNA(VLOOKUP($E7,StockMaster,COLUMN(StockCodes!$C$5),0))=TRUE,\"-\",VLOOKUP($E7,StockMaster,COLUMN(StockCodes!$C$5),0))","v":"units"},20,10,{"$f":"IF($K7=0,0,((SUMIFS(StockOpenQty,StockCodeOnly,$E7)*SUMIFS(StockOpenCost,StockCodeOnly,$E7))+SUMIFS(MoveAmount,MoveDate,\"<\"&$X7,MoveCode,$E7))/$K7)","v":98.323333333333338},98.323333333333338,-983.23333333333335,0,0,0,0,1300,983.23333333333335,316.76666666666665,0.24366666666666664,"2021-01-05T00:00:07"]
["2021-01-05","Purchase","WC Depot",651779,"AD06232",40,36.3125,"-",{"$f":"IF(ISNA(VLOOKUP($E8,StockMaster,COLUMN(StockCodes!$B$5),0))=TRUE,\"Invalid Stock Code\",VLOOKUP($E8,StockMaster,COLUMN(StockCodes!$B$5),0))","v":"Baby Linen Perfume"},{"$f":"IF(ISNA(VLOOKUP($E8,StockMaster,COLUMN(StockCodes!$C$5),0))=TRUE,\"-\",VLOOKUP($E8,StockMaster,COLUMN(StockCodes!$C$5),0))","v":"units"},10,50,{"$f":"IF($K8=0,0,((SUMIFS(StockOpenQty,StockCodeOnly,$E8)*SUMIFS(StockOpenCost,StockCodeOnly,$E8))+SUMIFS(MoveAmount,MoveDate,\"<\"&$X8,MoveCode,$E8))/$K8)","v":35},36.049999999999997,1452.5,36.3125,-1.3125,-3.7499999999999999E-2,-52.5,0,0,0,0,"2021-01-05T00:00:08"]
["2021-01-05","Sale","L Allen","AN0154","AE08329",-10,32,"-",{"$f":"IF(ISNA(VLOOKUP($E9,StockMaster,COLUMN(StockCodes!$B$5),0))=TRUE,\"Invalid Stock Code\",VLOOKUP($E9,StockMaster,COLUMN(StockCodes!$B$5),0))","v":"Detox Tea (Ginger)"},{"$f":"IF(ISNA(VLOOKUP($E9,StockMaster,COLUMN(StockCodes!$C$5),0))=TRUE,\"-\",VLOOKUP($E9,StockMaster,COLUMN(StockCodes!$C$5),0))","v":"units"},80,70,{"$f":"IF($K9=0,0,((SUMIFS(StockOpenQty,StockCodeOnly,$E9)*SUMIFS(StockOpenCost,StockCodeOnly,$E9))+SUMIFS(MoveAmount,MoveDate,\"<\"&$X9,MoveCode,$E9))/$K9)","v":25},25,-250,0,0,0,0,320,250,70,0.21875,"2021-01-05T00:00:09"]
["2021-01-05","Sale","S Barr","AN0153","AE08331",-10,30,"-",{"$f":"IF(ISNA(VLOOKUP($E10,StockMaster,COLUMN(StockCodes!$B$5),0))=TRUE,\"Invalid Stock Code\",VLOOKUP($E10,StockMaster,COLUMN(StockCodes!$B$5),0))","v":"Happy Tea"},{"$f":"IF(ISNA(VLOOKUP($E10,StockMaster,COLUMN(StockCodes!$C$5),0))=TRUE,\"-\",VLOOKUP($E10,StockMaster,COLUMN(StockCodes!$C$5),0))","v":"units"},100,90,{"$f":"IF($K10=0,0,((SUMIFS(StockOpenQty,StockCodeOnly,$E10)*SUMIFS(StockOpenCost,StockCodeOnly,$E10))+SUMIFS(MoveAmount,MoveDate,\"<\"&$X10,MoveCode,$E10))/$K10)","v":25},25,-250,0,0,0,0,300,250,50,0.16666666666666666,"2021-01-05T00:00:10"]
{"$rows_left_out":136}
{"sheet":"StockCount","index":5,"n_rows":16,"n_cols":11,"rows_kept":16,"cut":false,"hidden":true,"merged":[]}
["Stock Count Variance Report",null,null,null,null,null,null,null,null,"Count Date","2021-08-31"]
["Calculate Stock Count Variances"]
["© www.excel-skills.com",null,null,null,null,{"$f":"SUBTOTAL(109,SCount[[#Data],[Count Value]])","v":66411.373320837491},null,null,{"$f":"SUBTOTAL(109,SCount[[#Data],[Theoretical Stock Value]])","v":152855.03799088908},null,{"$f":"SUBTOTAL(109,SCount[[#Data],[Variance Value]])","v":-86443.664670051585}]
["Stock Code","Description","UOM","Error Code","Quantity Counted","Count Value","Theoretical Stock Qty","Average Cost","Theoretical Stock Value","Quantity Variance","Variance Value"]
["AA00020",{"$f":"IF(ISNA(VLOOKUP($A5,StockMaster,COLUMN(StockCodes!$B$5),0))=TRUE,\"Invalid Stock Code\",VLOOKUP($A5,StockMaster,COLUMN(StockCodes!$B$5),0))","v":"Cleansing Lotion"},{"$f":"IF(ISNA(VLOOKUP($A5,StockMaster,COLUMN(StockCodes!$C$5),0))=TRUE,\"-\",VLOOKUP($A5,StockMaster,COLUMN(StockCodes!$C$5),0))","v":"units"},{"$f":"IF(AND(ISBLANK(A5)=FALSE,COUNTIF(CountCode,A5)>1)=TRUE,\"E1\",IF(AND(ISBLANK(A5)=FALSE,ISNA(VLOOKUP(A5,StockCodeOnly,1,0))=TRUE),\"E2\",\"-\"))","v":"-"},250,{"$f":"E5*H5","v":24871.470352564098},{"$f":"SUMIFS(StockOpenQty,StockCodeOnly,$A5)+SUMIFS(MoveQty,MoveDate,\"<\"&$K$1+1,MoveCode,$A5)","v":250},{"$f":"IF($G5=0,0,I5/G5)","v":99.485881410256397},{"$f":"(SUMIFS(StockOpenQty,StockCodeOnly,$A5)*SUMIFS(StockOpenCost,StockCodeOnly,$A5))+SUMIFS(MoveAmount,MoveDate,\"<\"&$K$1+1,MoveCode,$A5)","v":24871.470352564098},{"$f":"E5-G5","v":0},{"$f":"F5-I5","v":0}]
["AA00060",{"$f":"IF(ISNA(VLOOKUP($A6,StockMaster,COLUMN(StockCodes!$B$5),0))=TRUE,\"Invalid Stock Code\",VLOOKUP($A6,StockMaster,COLUMN(StockCodes!$B$5),0))","v":"Refining Scrub Cream"},{"$f":"IF(ISNA(VLOOKUP($A6,StockMaster,COLUMN(StockCodes!$C$5),0))=TRUE,\"-\",VLOOKUP($A6,StockMaster,COLUMN(StockCodes!$C$5),0))","v":"units"},"-",0,{"$f":"E6*H6","v":0},0,{"$f":"IF($G6=0,0,I6/G6)","v":0},0,{"$f":"E6-G6","v":0},{"$f":"F6-I6","v":0}]
["AA00080",{"$f":"IF(ISNA(VLOOKUP($A7,StockMaster,COLUMN(StockCodes!$B$5),0))=TRUE,\"Invalid Stock Code\",VLOOKUP($A7,StockMaster,COLUMN(StockCodes!$B$5),0))","v":"Revitalising Cream"},{"$f":"IF(ISNA(VLOOKUP($A7,StockMaster,COLUMN(StockCodes!$C$5),0))=TRUE,\"-\",VLOOKUP($A7,StockMaster,COLUMN(StockCodes!$C$5),0))","v":"units"},"-",100,23013.77223320158,210,230.13772233201578,48328.921689723313,-110,-25315.149456521733]
["AA00140",{"$f":"IF(ISNA(VLOOKUP($A8,StockMaster,COLUMN(StockCodes!$B$5),0))=TRUE,\"Invalid Stock Code\",VLOOKUP($A8,StockMaster,COLUMN(StockCodes!$B$5),0))","v":"Moisturiser for Dry Skin"},{"$f":"IF(ISNA(VLOOKUP($A8,StockMaster,COLUMN(StockCodes!$C$5),0))=TRUE,\"-\",VLOOKUP($A8,StockMaster,COLUMN(StockCodes!$C$5),0))","v":"units"},"-",70,10110.630833333333,80,144.43758333333332,11555.006666666666,-10,-1444.3758333333335]
["AA00150",{"$f":"IF(ISNA(VLOOKUP($A9,StockMaster,COLUMN(StockCodes!$B$5),0))=TRUE,\"Invalid Stock Code\",VLOOKUP($A9,StockMaster,COLUMN(StockCodes!$B$5),0))","v":"Moisture Cover SPF 15"},{"$f":"IF(ISNA(VLOOKUP($A9,StockMaster,COLUMN(StockCodes!$C$5),0))=TRUE,\"-\",VLOOKUP($A9,StockMaster,COLUMN(StockCodes!$C$5),0))","v":"units"},"-",30,1620,30,54,1620,0,0]
["AA00260",{"$f":"IF(ISNA(VLOOKUP($A10,StockMaster,COLUMN(StockCodes!$B$5),0))=TRUE,\"Invalid Stock Code\",VLOOKUP($A10,StockMaster,COLUMN(StockCodes!$B$5),0))","v":"Eye Therapy"},{"$f":"IF(ISNA(VLOOKUP($A10,StockMaster,COLUMN(StockCodes!$C$5),0))=TRUE,\"-\",VLOOKUP($A10,StockMaster,COLUMN(StockCodes!$C$5),0))","v":"units"},"-",20,3714.6337112622823,340,185.73168556311413,63148.773091458803,-320,-59434.139380196517]
{"$rows_left_out":7}
{"sheet":"Dashboard","index":6,"n_rows":216,"n_cols":10,"rows_kept":216,"cut":false,"hidden":true,"merged":[[1,1,4,1],[1,2,2,5],[1,6,1,9],[2,6,2,9],[3,2,3,3],[3,6,3,9],[4,2,4,3],[4,6,4,9],[15,1,24,9],[5,1,12,1],[5,2,12,3],[5,4,12,5],[5,6,5,9],[6,6,6,7],[7,6,7,7],[8,6,8,7],[9,6,9,7],[10,6,10,7],[11,6,11,7],[12,6,12,7],[13,1,13,5],[13,7,13,8],[14,1,14,5],[14,7,14,8],[25,1,33,4],[25,5,33,9],[34,1,35,2],[34,5,35,7],[42,1,43,2],[42,5,43,7]]}
[]
[null,"INVENTORY\nDASHBOARD","Dashboard Filters",null,null,null,"SELECTED STOCK CODE:"]
[null,null,null,null,null,null,{"$f":"IF(ISBLANK($C$5),\"ALL\",C56&\" \"&C57)","v":"ALL"}]
[null,null,"STOCK CODE",null,"FROM DATE","TO DATE","UNIT OF MEASURE:"]
[null,null,null,null,null,"2021-08-31",{"$f":"C58","v":""}]
[null,null,null,null,null,null,"Stock Movement"]
[null,null,null,null,null,null,null,null,"Qty","Value"]
[null,null,null,null,null,null,"Opening Balance",null,{"$f":"C66","v":1050},{"$f":"D66","v":146475}]
[null,null,null,null,null,null,"Purchases",null,{"$f":"C67","v":2680},416154.85000000003]
[null,null,null,null,null,null,"Cost of Sales",null,-2750,-418642.94145842484]
{"$rows_left_out":207}
{"sheet":"Profitability","index":7,"n_rows":108,"n_cols":13,"rows_kept":108,"cut":false,"hidden":true,"merged":[[5,0,5,1]]}
["Profitability Report",null,null,null,{"$f":"IF(AND(ISBLANK(E3)=FALSE,E3<E2),\"Error! The From date cannot be after the To date!\",\"\")","v":""}]
["Calculation of sales and gross profit %",null,null,"From Date",null,{"$f":"IF(ISBLANK(E2)=TRUE,IF(MIN(MoveDate)=0,DATE(YEAR($E$3),MONTH($E$3),1),DATE(YEAR(MIN(MoveDate)),MONTH(MIN(MoveDate)),1)),E2)","v":"2021-01-01"},null,"Stock Code"]
["© www.excel-skills.com",null,null,"To Date","2021-08-31",{"$f":"IF(ISBLANK(E3)=TRUE,DATE(YEAR(TODAY()),MONTH(TODAY())+1,0),E3)","v":"2021-08-31"},null,null,{"$f":"IF(ISBLANK($H$3),\"*\",$H$3)","v":"*"}]
[null,null,null,null,null,null,null,{"$f":"IF(ISBLANK($H$3),\"All stock\",IF(ISNA(VLOOKUP($H$3,StockMaster,COLUMN(StockCodes!$B$5),0)),\"Not found\",VLOOKUP($H$3,StockMaster,COLUMN(StockCodes!$B$5),0)))","v":"All stock"}]
[null,null,null,{"$f":"$F$3","v":"2021-08-31"},{"$f":"$F$3","v":"2021-08-31"}]
[null,null,"Date Range","Month To Date","Year to Date"]
[]
["Sales",null,{"$f":"SUMIFS(MoveSale,MoveDate,\">=\"&$F$2,MoveDate,\"<=\"&$F$3+1,MoveCode,$I$3)","v":551140},{"$f":"SUMIFS(MoveSale,MoveDate,\">=\"&DATE(YEAR($F$3),MONTH($F$3),1),MoveDate,\"<=\"&$F$3+1,MoveCode,$I$3)","v":96020},{"$f":"SUMIFS(MoveSale,MoveDate,\">=\"&DATE(YEAR($F$3),1,1),MoveDate,\"<=\"&$F$3+1,MoveCode,$I$3)","v":551140}]
[]
["Cost of Sales",null,{"$f":"-SUMIFS(MoveAmount,MoveDate,\">=\"&$F$2,MoveDate,\"<=\"&$F$3+1,MoveType,\"Sale\",MoveCode,$I$3)","v":418642.94145842484},{"$f":"-SUMIFS(MoveAmount,MoveDate,\">=\"&DATE(YEAR($F$3),MONTH($F$3),1),MoveDate,\"<=\"&$F$3+1,MoveType,\"Sale\",MoveCode,$I$3)","v":73502.309320146465},{"$f":"-SUMIFS(MoveAmount,MoveDate,\">=\"&DATE(YEAR($F$3),1,1),MoveDate,\"<=\"&$F$3+1,MoveType,\"Sale\",MoveCode,$I$3)","v":418642.94145842484}]
{"$rows_left_out":98}