{"text_format":"1","workbook":"xlsx","n_sheets":9,"sheets":["Info","Trial","Instructions","StockCodes","Movements","StockCount","Dashboard","Sales","Profitability"],"not_rendered":{"charts":7,"images":2,"macros":1,"external_links":0,"defined_names":41,"comments":0,"pivot_tables":0},"unopened":[],"bounds":{"document_bytes":16777216,"sheet_cells":100000,"rows_first":2000,"rows_last":500,"rows_between":2000,"halvings":0,"cell_chars":16384,"cell_head_chars":4096},"cells_cut":0,"cells_raw":0,"read":"whole","date_system":"1900"}

{"sheet":"Info","index":0,"n_rows":0,"n_cols":0,"rows_kept":0,"cut":false,"hidden":false,"merged":[]}

{"sheet":"Trial","index":1,"n_rows":0,"n_cols":0,"rows_kept":0,"cut":false,"hidden":true,"merged":[]}

{"sheet":"Instructions","index":2,"n_rows":242,"n_cols":1,"rows_kept":242,"cut":false,"hidden":true,"merged":[]}
["Excel Skills | Inventory Control Template | Usage Based"]
["Instructions"]
["www.excel-skills.com"]
[]
["This unique template enables users to analyse the profitability of a business by comparing sales to inventory usage. In many business environments, it is impractical to perform accurate calculations of cost of sales and it is a lot more feasible to compare inventory usage to sales. The functionality included in this template enables users to control inventory by creating stock codes for all individual inventory items; recording inventory purchases, usage and adjustments; performing physical stock counts and analysing stock take variances; calculating stock valuations and measuring sales, cost of sales & gross profits based on any user defined date range. All inventory valuations are performed on an average cost basis."]
[]
["The following sheets are included in this template:"]
["StockCodes - this sheet can be used to create unique stock codes for all inventory items and also includes inventory valuation and inventory movement calculations by stock code."]
["Movements - all inventory movement transactions should be recorded on this sheet."]
["StockCount - this sheet can be used to perform a physical stock count and to analyse stock take variances. Physical stock count quantities are measured against theoretical stock balances and once the accuracy of the stock take variances has been established, the calculated stock variances can be recorded as stock adjustments on the Movements sheet in order to adjust the theoretical stock quantities to the physical stock count quantities."]
{"$rows_left_out":233}
{"sheet":"StockCodes","index":3,"n_rows":13,"n_cols":27,"rows_kept":13,"cut":false,"hidden":true,"merged":[]}
["Stock Codes",null,null,null,null,null,null,null,{"$f":"IF(AND(ISBLANK(H3)=FALSE,H3<H2),\"Error! The From date cannot be after the To date!\",\"\")","v":""}]
["Set-up and Reporting",null,null,null,null,null,"From Date",null,{"$f":"IF(ISBLANK(H2)=TRUE,IF(MIN(MoveDate)=0,DATE(YEAR($I$3),MONTH($I$3),1),DATE(YEAR(MIN(MoveDate)),MONTH(MIN(MoveDate)),1)),H2)","v":"2021-07-01"},null,null,null,null,null,null,null,null,null,{"$f":"Dashboard!C55","v":"2021-07-01"}]
["© www.excel-skills.com",null,null,null,null,null,"To Date","2021-08-31",{"$f":"IF(ISBLANK(H3)=TRUE,DATE(YEAR(TODAY()),MONTH(TODAY())+1,0),H3)","v":"2021-08-31"},null,null,null,null,null,null,null,null,null,{"$f":"Dashboard!D55","v":"2021-08-31"}]
[null,null,null,null,null,null,{"$f":"SUBTOTAL(109,StockCode[[#Data],[Opening Value]])","v":18190},null,null,{"$f":"SUBTOTAL(109,StockCode[[#Data],[Inventory Valuation]])","v":31558.063491967641},null,null,null,null,{"$f":"SUBTOTAL(109,StockCode[[#Data],[Opening Value2]])","v":18190},{"$f":"SUBTOTAL(109,StockCode[[#Data],[Purchases Value]])","v":212244.6},{"$f":"SUBTOTAL(109,StockCode[[#Data],[Usages Value]])","v":-187979.80578980056},{"$f":"SUBTOTAL(109,StockCode[[#Data],[Adjustments Value]])","v":-10896.7307182318}]
["Stock Code","Stock Description","UOM","Opening Quantity","Opening Cost","Error Code","Opening Value","Quantity on Hand","Average Cost","Inventory Valuation","Opening Quantity2","Purchases Quantity","Usages Quantity","Adjustments Quantity","Opening Value2","Purchases Value","Usages Value","Adjustments Value","Dash Purch Qty","Dash Usage Qty","Dash Adjust Qty","Dash Purch Value","Dash Usage Value","Dash Adjust Value","Dash Adjust AB Value","Dash Price Value","Dash ABS Price"]
["PM2000","Plastic Wrap","Rolls",2,20,{"$f":"IF(AND(ISBLANK(A6)=FALSE,COUNTIF(StockCodeOnly,A6)>1)=TRUE,\"E1\",\"-\")","v":"-"},{"$f":"D6*E6","v":40},{"$f":"SUMIFS(MoveQty,MoveCode,$A6,MoveDate,\"<\"&$I$3+1)+D6","v":8.5},{"$f":"IF(H6=0,0,J6/H6)","v":20.54496057604862},{"$f":"SUMIFS(MoveAmount,MoveCode,$A6,MoveDate,\"<\"&$I$3+1)+(D6*E6)","v":174.63216489641326},{"$f":"D6+SUMIFS(MoveQty,MoveCode,$A6,MoveDate,\"<\"&$I$2)","v":2},{"$f":"SUMIFS(MoveQty,MoveCode,$A6,MoveDate,\">=\"&$I$2,MoveDate,\"<\"&$I$3+1,MoveType,\"Purchase\")","v":34},{"$f":"SUMIFS(MoveQty,MoveCode,$A6,MoveDate,\">=\"&$I$2,MoveDate,\"<\"&$I$3+1,MoveType,\"Usage\")","v":-26.22},{"$f":"SUMIFS(MoveQty,MoveCode,$A6,MoveDate,\">=\"&$I$2,MoveDate,\"<\"&$I$3+1,MoveType,\"Adjustment\")","v":-1.2800000000000007},{"$f":"(D6*E6)+SUMIFS(MoveAmount,MoveCode,$A6,MoveDate,\"<\"&$I$2)","v":40},{"$f":"SUMIFS(MoveAmount,MoveCode,$A6,MoveDate,\">=\"&$I$2,MoveDate,\"<\"&$I$3+1,MoveType,\"Purchase\")","v":700},{"$f":"SUMIFS(MoveAmount,MoveCode,$A6,MoveDate,\">=\"&$I$2,MoveDate,\"<\"&$I$3+1,MoveType,\"Usage\")","v":-539.11090111046724},{"$f":"SUMIFS(MoveAmount,MoveCode,$A6,MoveDate,\">=\"&$I$2,MoveDate,\"<\"&$I$3+1,MoveType,\"Adjustment\")","v":-26.25693399311951},{"$f":"SUMIFS(MoveQty,MoveCode,$A6,MoveDate,\">=\"&$S$2,MoveDate,\"<\"&$S$3+1,MoveType,\"Purchase\")","v":34},{"$f":"-SUMIFS(MoveQty,MoveCode,$A6,MoveDate,\">=\"&$S$2,MoveDate,\"<\"&$S$3+1,MoveType,\"Usage\")","v":26.22},{"$f":"SUMIFS(MoveQty,MoveCode,$A6,MoveDate,\">=\"&$S$2,MoveDate,\"<\"&$S$3+1,MoveType,\"Adjustment\")","v":-1.2800000000000007},{"$f":"SUMIFS(MoveAmount,MoveCode,$A6,MoveDate,\">=\"&$S$2,MoveDate,\"<\"&$S$3+1,MoveType,\"Purchase\")","v":700},{"$f":"-SUMIFS(MoveAmount,MoveCode,$A6,MoveDate,\">=\"&$S$2,MoveDate,\"<\"&$S$3+1,MoveType,\"Usage\")","v":539.11090111046724},{"$f":"SUMIFS(MoveAmount,MoveCode,$A6,MoveDate,\">=\"&$S$2,MoveDate,\"<\"&$S$3+1,MoveType,\"Adjustment\")","v":-26.25693399311951},{"$f":"ABS(X6)","v":26.25693399311951},{"$f":"SUMIFS(MovePrice,MoveCode,$A6,MoveDate,\">=\"&$S$2,MoveDate,\"<\"&$S$3+1,MoveType,\"Purchase\")","v":-0.71510340683592943},{"$f":"ABS(Z6)","v":0.71510340683592943}]
["PM2005","Labels",1000,1,350,"-",350,0,0,0,1,14,-14.06,-0.94,350,6470,-6397.1288185322246,-422.87118146777533,{"$f":"SUMIFS(MoveQty,MoveCode,$A7,MoveDate,\">=\"&$S$2,MoveDate,\"<\"&$S$3+1,MoveType,\"Purchase\")","v":14},{"$f":"-SUMIFS(MoveQty,MoveCode,$A7,MoveDate,\">=\"&$S$2,MoveDate,\"<\"&$S$3+1,MoveType,\"Usage\")","v":14.06},{"$f":"SUMIFS(MoveQty,MoveCode,$A7,MoveDate,\">=\"&$S$2,MoveDate,\"<\"&$S$3+1,MoveType,\"Adjustment\")","v":-0.94},{"$f":"SUMIFS(MoveAmount,MoveCode,$A7,MoveDate,\">=\"&$S$2,MoveDate,\"<\"&$S$3+1,MoveType,\"Purchase\")","v":6470},{"$f":"-SUMIFS(MoveAmount,MoveCode,$A7,MoveDate,\">=\"&$S$2,MoveDate,\"<\"&$S$3+1,MoveType,\"Usage\")","v":6397.1288185322246},{"$f":"SUMIFS(MoveAmount,MoveCode,$A7,MoveDate,\">=\"&$S$2,MoveDate,\"<\"&$S$3+1,MoveType,\"Adjustment\")","v":-422.87118146777533},422.87118146777533,{"$f":"SUMIFS(MovePrice,MoveCode,$A7,MoveDate,\">=\"&$S$2,MoveDate,\"<\"&$S$3+1,MoveType,\"Purchase\")","v":-506.07857025502551},506.07857025502551]
["PM2015","Boxes","Units",600,1.2,"-",720,17.999999999999886,1.0247813316781973,18.446063970207433,600,4400,-4972.6400000000003,-9.3600000000000065,720,4560,-5251.7059873920171,-9.8479486377748504,{"$f":"SUMIFS(MoveQty,MoveCode,$A8,MoveDate,\">=\"&$S$2,MoveDate,\"<\"&$S$3+1,MoveType,\"Purchase\")","v":4400},{"$f":"-SUMIFS(MoveQty,MoveCode,$A8,MoveDate,\">=\"&$S$2,MoveDate,\"<\"&$S$3+1,MoveType,\"Usage\")","v":4972.6400000000003},{"$f":"SUMIFS(MoveQty,MoveCode,$A8,MoveDate,\">=\"&$S$2,MoveDate,\"<\"&$S$3+1,MoveType,\"Adjustment\")","v":-9.3600000000000065},{"$f":"SUMIFS(MoveAmount,MoveCode,$A8,MoveDate,\">=\"&$S$2,MoveDate,\"<\"&$S$3+1,MoveType,\"Purchase\")","v":4560},{"$f":"-SUMIFS(MoveAmount,MoveCode,$A8,MoveDate,\">=\"&$S$2,MoveDate,\"<\"&$S$3+1,MoveType,\"Usage\")","v":5251.7059873920171},{"$f":"SUMIFS(MoveAmount,MoveCode,$A8,MoveDate,\">=\"&$S$2,MoveDate,\"<\"&$S$3+1,MoveType,\"Adjustment\")","v":-9.8479486377748504},9.8479486377748504,{"$f":"SUMIFS(MovePrice,MoveCode,$A8,MoveDate,\">=\"&$S$2,MoveDate,\"<\"&$S$3+1,MoveType,\"Purchase\")","v":191.92091908510588},191.92091908510588]
["RM1000","Meat","Kg",300,50,"-",15000,600,50.450891015539931,30270.534609323957,300,3760,-3240,-220,15000,185840,-159696.72557233815,-10872.739818337881,{"$f":"SUMIFS(MoveQty,MoveCode,$A9,MoveDate,\">=\"&$S$2,MoveDate,\"<\"&$S$3+1,MoveType,\"Purchase\")","v":3760},{"$f":"-SUMIFS(MoveQty,MoveCode,$A9,MoveDate,\">=\"&$S$2,MoveDate,\"<\"&$S$3+1,MoveType,\"Usage\")","v":3240},{"$f":"SUMIFS(MoveQty,MoveCode,$A9,MoveDate,\">=\"&$S$2,MoveDate,\"<\"&$S$3+1,MoveType,\"Adjustment\")","v":-220},{"$f":"SUMIFS(MoveAmount,MoveCode,$A9,MoveDate,\">=\"&$S$2,MoveDate,\"<\"&$S$3+1,MoveType,\"Purchase\")","v":185840},{"$f":"-SUMIFS(MoveAmount,MoveCode,$A9,MoveDate,\">=\"&$S$2,MoveDate,\"<\"&$S$3+1,MoveType,\"Usage\")","v":159696.72557233815},{"$f":"SUMIFS(MoveAmount,MoveCode,$A9,MoveDate,\">=\"&$S$2,MoveDate,\"<\"&$S$3+1,MoveType,\"Adjustment\")","v":-10872.739818337881},10872.739818337881,{"$f":"SUMIFS(MovePrice,MoveCode,$A9,MoveDate,\">=\"&$S$2,MoveDate,\"<\"&$S$3+1,MoveType,\"Purchase\")","v":1239.3677980620982},1239.3677980620982]
["RM1005","Bread Rolls","Dozen",50,36,"-",1800,10,41.736348781687958,417.36348781687957,50,314,-350.72,-3.2800000000000007,1800,13080,-14327.241695807948,-135.39481637517406,{"$f":"SUMIFS(MoveQty,MoveCode,$A10,MoveDate,\">=\"&$S$2,MoveDate,\"<\"&$S$3+1,MoveType,\"Purchase\")","v":314},{"$f":"-SUMIFS(MoveQty,MoveCode,$A10,MoveDate,\">=\"&$S$2,MoveDate,\"<\"&$S$3+1,MoveType,\"Usage\")","v":350.72},{"$f":"SUMIFS(MoveQty,MoveCode,$A10,MoveDate,\">=\"&$S$2,MoveDate,\"<\"&$S$3+1,MoveType,\"Adjustment\")","v":-3.2800000000000007},{"$f":"SUMIFS(MoveAmount,MoveCode,$A10,MoveDate,\">=\"&$S$2,MoveDate,\"<\"&$S$3+1,MoveType,\"Purchase\")","v":13080},{"$f":"-SUMIFS(MoveAmount,MoveCode,$A10,MoveDate,\">=\"&$S$2,MoveDate,\"<\"&$S$3+1,MoveType,\"Usage\")","v":14327.241695807948},{"$f":"SUMIFS(MoveAmount,MoveCode,$A10,MoveDate,\">=\"&$S$2,MoveDate,\"<\"&$S$3+1,MoveType,\"Adjustment\")","v":-135.39481637517406},135.39481637517406,{"$f":"SUMIFS(MovePrice,MoveCode,$A10,MoveDate,\">=\"&$S$2,MoveDate,\"<\"&$S$3+1,MoveType,\"Purchase\")","v":-479.73982629394027},479.73982629394027]
{"$rows_left_out":4}
{"sheet":"Movements","index":4,"n_rows":148,"n_cols":20,"rows_kept":148,"cut":false,"hidden":true,"merged":[]}
["Stock Movements"]
["Record Inventory Movement Transactions"]
["© www.excel-skills.com",null,null,null,null,null,{"$f":"SUBTOTAL(109,InvMovement[[#Data],[Invoice Amount]])","v":212244.59999999998},null,null,null,null,null,null,null,{"$f":"SUBTOTAL(109,InvMovement[[#Data],[Transaction Value]])","v":13368.063491967647},null,{"$f":"SUBTOTAL(109,InvMovement[[#Data],[Unit Price Variance]])","v":-228.22167782027199}]
["Transaction Date","Transaction Type","Supplier Name","Document Number","Stock Code","Transaction Quantity","Invoice Amount","Error Code","Stock Description","UOM","Quantity on Hand: Prev","Quantity on Hand: New","Average Cost: Prev","Average Cost: New","Transaction Value","Purchase Price per Unit","Unit Price Variance","Price Variance %","Total Price Variance","Movement Date"]
["2021-07-07","Purchase","XY Packaging","IN0009","PM2000",5,105,{"$f":"IF(AND(ISBLANK(E5)=FALSE,ISNA(VLOOKUP(E5,StockCodeOnly,1,0))=TRUE),\"E2\",IF(AND(ISBLANK(B5)=FALSE,B5<>\"Purchase\",B5<>\"Usage\",B5<>\"Adjustment\"),\"E3\",IF(AND(B5=\"Usage\",F5>0),\"E4\",IF(OR(K5<0,L5<0),\"E5\",\"-\"))))","v":"-"},{"$f":"IF(ISNA(VLOOKUP($E5,StockCode[],COLUMN(StockCodes!$B$3),0))=TRUE,\"Invalid Stock Code\",VLOOKUP($E5,StockCode[],COLUMN(StockCodes!$B$3),0))","v":"Plastic Wrap"},{"$f":"IF(ISNA(VLOOKUP($E5,StockCode[],COLUMN(StockCodes!$C$3),0))=TRUE,\"-\",VLOOKUP($E5,StockCode[],COLUMN(StockCodes!$C$3),0))","v":"Rolls"},{"$f":"SUMIFS(StockOpenQty,StockCodeOnly,$E5)+SUMIFS(MoveQty,MoveDate,\"<\"&$T5,MoveCode,$E5)","v":2},{"$f":"K5+F5","v":7},{"$f":"IF($K5=0,0,((SUMIFS(StockOpenQty,StockCodeOnly,$E5)*SUMIFS(StockOpenCost,StockCodeOnly,$E5))+SUMIFS(MoveAmount,MoveDate,\"<\"&$T5,MoveCode,$E5))/$K5)","v":20},{"$f":"IF(B5<>\"Purchase\",M5,IF(L5=0,0,((K5*M5)+G5)/(F5+K5)))","v":20.714285714285715},{"$f":"IF(B5=\"Purchase\",G5,N5*F5)","v":105},{"$f":"IF(B5<>\"Purchase\",0,IF(F5=0,0,G5/F5))","v":21},{"$f":"IF(B5<>\"Purchase\",0,IF(K5=0,0,M5-P5))","v":-1},{"$f":"IF(B5<>\"Purchase\",0,IF(M5=0,0,Q5/M5))","v":-0.05},{"$f":"Q5*F5","v":-5},{"$f":"IF(ISBLANK($A5)=TRUE,TODAY()+((ROW($A5)-(86400*ROUNDDOWN(ROW($A5)/86400,0)))/86400),$A5+((ROW($A5)-(86400*ROUNDDOWN(ROW($A5)/86400,0)))/86400))","v":"2021-07-07T00:00:05"}]
["2021-07-07","Purchase","QS Printers",76868,"PM2005",2,750,"-",{"$f":"IF(ISNA(VLOOKUP($E6,StockCode[],COLUMN(StockCodes!$B$3),0))=TRUE,\"Invalid Stock Code\",VLOOKUP($E6,StockCode[],COLUMN(StockCodes!$B$3),0))","v":"Labels"},{"$f":"IF(ISNA(VLOOKUP($E6,StockCode[],COLUMN(StockCodes!$C$3),0))=TRUE,\"-\",VLOOKUP($E6,StockCode[],COLUMN(StockCodes!$C$3),0))","v":1000},1,3,{"$f":"IF($K6=0,0,((SUMIFS(StockOpenQty,StockCodeOnly,$E6)*SUMIFS(StockOpenCost,StockCodeOnly,$E6))+SUMIFS(MoveAmount,MoveDate,\"<\"&$T6,MoveCode,$E6))/$K6)","v":350},366.66666666666669,750,375,-25,-7.1428571428571425E-2,-50,"2021-07-07T00:00:06"]
["2021-07-07","Purchase","ABC Packaging","INV999","PM2015",700,700,"-",{"$f":"IF(ISNA(VLOOKUP($E7,StockCode[],COLUMN(StockCodes!$B$3),0))=TRUE,\"Invalid Stock Code\",VLOOKUP($E7,StockCode[],COLUMN(StockCodes!$B$3),0))","v":"Boxes"},{"$f":"IF(ISNA(VLOOKUP($E7,StockCode[],COLUMN(StockCodes!$C$3),0))=TRUE,\"-\",VLOOKUP($E7,StockCode[],COLUMN(StockCodes!$C$3),0))","v":"Units"},600,1300,{"$f":"IF($K7=0,0,((SUMIFS(StockOpenQty,StockCodeOnly,$E7)*SUMIFS(StockOpenCost,StockCodeOnly,$E7))+SUMIFS(MoveAmount,MoveDate,\"<\"&$T7,MoveCode,$E7))/$K7)","v":1.2},1.0923076923076922,700,1,0.19999999999999996,0.16666666666666663,139.99999999999997,"2021-07-07T00:00:07"]
["2021-07-07","Purchase","WW Butchery",5765765,"RM1000",400,21760,"-",{"$f":"IF(ISNA(VLOOKUP($E8,StockCode[],COLUMN(StockCodes!$B$3),0))=TRUE,\"Invalid Stock Code\",VLOOKUP($E8,StockCode[],COLUMN(StockCodes!$B$3),0))","v":"Meat"},{"$f":"IF(ISNA(VLOOKUP($E8,StockCode[],COLUMN(StockCodes!$C$3),0))=TRUE,\"-\",VLOOKUP($E8,StockCode[],COLUMN(StockCodes!$C$3),0))","v":"Kg"},300,700,{"$f":"IF($K8=0,0,((SUMIFS(StockOpenQty,StockCodeOnly,$E8)*SUMIFS(StockOpenCost,StockCodeOnly,$E8))+SUMIFS(MoveAmount,MoveDate,\"<\"&$T8,MoveCode,$E8))/$K8)","v":50},52.514285714285712,21760,54.4,-4.3999999999999986,-8.7999999999999967E-2,-1759.9999999999995,"2021-07-07T00:00:08"]
["2021-07-07","Purchase","Aurora Bakery",67887,"RM1005",45,1800,"-",{"$f":"IF(ISNA(VLOOKUP($E9,StockCode[],COLUMN(StockCodes!$B$3),0))=TRUE,\"Invalid Stock Code\",VLOOKUP($E9,StockCode[],COLUMN(StockCodes!$B$3),0))","v":"Bread Rolls"},{"$f":"IF(ISNA(VLOOKUP($E9,StockCode[],COLUMN(StockCodes!$C$3),0))=TRUE,\"-\",VLOOKUP($E9,StockCode[],COLUMN(StockCodes!$C$3),0))","v":"Dozen"},50,95,{"$f":"IF($K9=0,0,((SUMIFS(StockOpenQty,StockCodeOnly,$E9)*SUMIFS(StockOpenCost,StockCodeOnly,$E9))+SUMIFS(MoveAmount,MoveDate,\"<\"&$T9,MoveCode,$E9))/$K9)","v":36},37.89473684210526,1800,40,-4,-0.1111111111111111,-180,"2021-07-07T00:00:09"]
["2021-07-07","Purchase","Fruit & Veg","IN0009","RM1010",11,59,"-",{"$f":"IF(ISNA(VLOOKUP($E10,StockCode[],COLUMN(StockCodes!$B$3),0))=TRUE,\"Invalid Stock Code\",VLOOKUP($E10,StockCode[],COLUMN(StockCodes!$B$3),0))","v":"Lettuce"},{"$f":"IF(ISNA(VLOOKUP($E10,StockCode[],COLUMN(StockCodes!$C$3),0))=TRUE,\"-\",VLOOKUP($E10,StockCode[],COLUMN(StockCodes!$C$3),0))","v":"Kg"},10,21,{"$f":"IF($K10=0,0,((SUMIFS(StockOpenQty,StockCodeOnly,$E10)*SUMIFS(StockOpenCost,StockCodeOnly,$E10))+SUMIFS(MoveAmount,MoveDate,\"<\"&$T10,MoveCode,$E10))/$K10)","v":5},5.1904761904761907,59,5.3636363636363633,-0.36363636363636331,-7.2727272727272668E-2,-3.9999999999999964,"2021-07-07T00:00:10"]
{"$rows_left_out":139}
{"sheet":"StockCount","index":5,"n_rows":12,"n_cols":11,"rows_kept":12,"cut":false,"hidden":true,"merged":[]}
["Stock Count Variance Report",null,null,null,null,null,null,null,null,"Count Date","2021-08-31"]
["Calculate Stock Count Variances"]
["© www.excel-skills.com",null,null,null,null,{"$f":"SUBTOTAL(109,SCount[[#Data],[Count Value]])","v":30925.991495864688},null,null,{"$f":"SUBTOTAL(109,SCount[[#Data],[Theoretical Stock Value]])","v":31558.063491967641},null,{"$f":"SUBTOTAL(109,SCount[[#Data],[Variance Value]])","v":-632.07199610295118}]
["Stock Code","Description","UOM","Error Code","Quantity Counted","Count Value","Theoretical Stock Qty","Average Cost","Theoretical Stock Value","Quantity Variance","Variance Value"]
["PM2000",{"$f":"IF(ISNA(VLOOKUP($A5,StockCode[],COLUMN(StockCodes!$B$5),0))=TRUE,\"Invalid Stock Code\",VLOOKUP($A5,StockCode[],COLUMN(StockCodes!$B$5),0))","v":"Plastic Wrap"},{"$f":"IF(ISNA(VLOOKUP($A5,StockCode[],COLUMN(StockCodes!$C$5),0))=TRUE,\"-\",VLOOKUP($A5,StockCode[],COLUMN(StockCodes!$C$5),0))","v":"Rolls"},{"$f":"IF(AND(ISBLANK(A5)=FALSE,COUNTIF(CountCode,A5)>1)=TRUE,\"E1\",IF(AND(ISBLANK(A5)=FALSE,ISNA(VLOOKUP(A5,StockCodeOnly,1,0))=TRUE),\"E2\",\"-\"))","v":"-"},8.5,{"$f":"E5*H5","v":174.63216489641326},{"$f":"SUMIFS(StockCode[Opening Quantity],StockCode[Stock Code],$A5)+SUMIFS(MoveQty,MoveDate,\"<\"&$K$1+1,MoveCode,$A5)","v":8.5},{"$f":"IF($G5=0,0,I5/G5)","v":20.54496057604862},{"$f":"(SUMIFS(StockOpenQty,StockCodeOnly,$A5)*SUMIFS(StockOpenCost,StockCodeOnly,$A5))+SUMIFS(MoveAmount,MoveDate,\"<\"&$K$1+1,MoveCode,$A5)","v":174.63216489641326},{"$f":"E5-G5","v":0},{"$f":"J5*H5","v":0}]
["PM2005",{"$f":"IF(ISNA(VLOOKUP($A6,StockCode[],COLUMN(StockCodes!$B$5),0))=TRUE,\"Invalid Stock Code\",VLOOKUP($A6,StockCode[],COLUMN(StockCodes!$B$5),0))","v":"Labels"},{"$f":"IF(ISNA(VLOOKUP($A6,StockCode[],COLUMN(StockCodes!$C$5),0))=TRUE,\"-\",VLOOKUP($A6,StockCode[],COLUMN(StockCodes!$C$5),0))","v":1000},"-",0,0,{"$f":"SUMIFS(StockCode[Opening Quantity],StockCode[Stock Code],$A6)+SUMIFS(MoveQty,MoveDate,\"<\"&$K$1+1,MoveCode,$A6)","v":0},0,0,0,0]
["PM2015",{"$f":"IF(ISNA(VLOOKUP($A7,StockCode[],COLUMN(StockCodes!$B$5),0))=TRUE,\"Invalid Stock Code\",VLOOKUP($A7,StockCode[],COLUMN(StockCodes!$B$5),0))","v":"Boxes"},{"$f":"IF(ISNA(VLOOKUP($A7,StockCode[],COLUMN(StockCodes!$C$5),0))=TRUE,\"-\",VLOOKUP($A7,StockCode[],COLUMN(StockCodes!$C$5),0))","v":"Units"},"-",18,18.44606397020755,{"$f":"SUMIFS(StockCode[Opening Quantity],StockCode[Stock Code],$A7)+SUMIFS(MoveQty,MoveDate,\"<\"&$K$1+1,MoveCode,$A7)","v":17.999999999999886},1.0247813316781973,18.446063970207433,1.1368683772161603E-13,1.1650414895464079E-13]
["RM1000",{"$f":"IF(ISNA(VLOOKUP($A8,StockCode[],COLUMN(StockCodes!$B$5),0))=TRUE,\"Invalid Stock Code\",VLOOKUP($A8,StockCode[],COLUMN(StockCodes!$B$5),0))","v":"Meat"},{"$f":"IF(ISNA(VLOOKUP($A8,StockCode[],COLUMN(StockCodes!$C$5),0))=TRUE,\"-\",VLOOKUP($A8,StockCode[],COLUMN(StockCodes!$C$5),0))","v":"Kg"},"-",600,30270.534609323957,{"$f":"SUMIFS(StockCode[Opening Quantity],StockCode[Stock Code],$A8)+SUMIFS(MoveQty,MoveDate,\"<\"&$K$1+1,MoveCode,$A8)","v":600},50.450891015539931,30270.534609323957,0,0]
["RM1005",{"$f":"IF(ISNA(VLOOKUP($A9,StockCode[],COLUMN(StockCodes!$B$5),0))=TRUE,\"Invalid Stock Code\",VLOOKUP($A9,StockCode[],COLUMN(StockCodes!$B$5),0))","v":"Bread Rolls"},{"$f":"IF(ISNA(VLOOKUP($A9,StockCode[],COLUMN(StockCodes!$C$5),0))=TRUE,\"-\",VLOOKUP($A9,StockCode[],COLUMN(StockCodes!$C$5),0))","v":"Dozen"},"-",10,417.36348781687957,{"$f":"SUMIFS(StockCode[Opening Quantity],StockCode[Stock Code],$A9)+SUMIFS(MoveQty,MoveDate,\"<\"&$K$1+1,MoveCode,$A9)","v":10},41.736348781687958,417.36348781687957,0,0]
["RM1010",{"$f":"IF(ISNA(VLOOKUP($A10,StockCode[],COLUMN(StockCodes!$B$5),0))=TRUE,\"Invalid Stock Code\",VLOOKUP($A10,StockCode[],COLUMN(StockCodes!$B$5),0))","v":"Lettuce"},{"$f":"IF(ISNA(VLOOKUP($A10,StockCode[],COLUMN(StockCodes!$C$5),0))=TRUE,\"-\",VLOOKUP($A10,StockCode[],COLUMN(StockCodes!$C$5),0))","v":"Kg"},"-",1,5.0792173841536918,{"$f":"SUMIFS(StockCode[Opening Quantity],StockCode[Stock Code],$A10)+SUMIFS(MoveQty,MoveDate,\"<\"&$K$1+1,MoveCode,$A10)","v":1.0000000000000018},5.0792173841536918,5.0792173841537007,-1.7763568394002505E-15,-9.0225025391420598E-15]
{"$rows_left_out":3}
{"sheet":"Dashboard","index":6,"n_rows":216,"n_cols":10,"rows_kept":216,"cut":false,"hidden":true,"merged":[[12,6,12,7],[13,7,13,8],[14,7,14,8],[15,1,24,9],[42,1,43,2],[42,5,43,7],[25,1,33,4],[25,5,33,9],[13,1,13,5],[14,1,14,5],[34,1,35,2],[34,5,35,7],[11,6,11,7],[1,6,1,9],[2,6,2,9],[3,6,3,9],[4,6,4,9],[5,6,5,9],[6,6,6,7],[7,6,7,7],[8,6,8,7],[9,6,9,7],[10,6,10,7],[1,1,4,1],[3,2,3,3],[1,2,2,5],[4,2,4,3],[5,1,12,1],[5,2,12,3],[5,4,12,5]]}
[]
[null,"INVENTORY\nDASHBOARD","Dashboard Filters",null,null,null,"SELECTED STOCK CODE:"]
[null,null,null,null,null,null,{"$f":"IF(ISBLANK($C$5),\"ALL\",C56&\" \"&C57)","v":"ALL"}]
[null,null,"STOCK CODE",null,"FROM DATE","TO DATE","UNIT OF MEASURE:"]
[null,null,null,null,null,"2021-08-31",{"$f":"C58","v":""}]
[null,null,null,null,null,null,"Stock Movement"]
[null,null,null,null,null,null,null,null,"Qty","Value"]
[null,null,null,null,null,null,"Opening Balance",null,{"$f":"C66","v":988},{"$f":"D66","v":18190}]
[null,null,null,null,null,null,"Purchases",null,{"$f":"C67","v":8686},{"$f":"D67","v":212244.59999999998}]
[null,null,null,null,null,null,"Usage",null,-8796.34,-187979.80578980054]
{"$rows_left_out":207}
{"sheet":"Sales","index":7,"n_rows":48,"n_cols":5,"rows_kept":48,"cut":false,"hidden":true,"merged":[]}
["Sales Data"]
["Record Inventory Related Sales Transactions"]
["© www.excel-skills.com",null,null,null,{"$f":"SUBTOTAL(109,Sale[[#Data],[Exclusive Sales Amount]])","v":292757}]
["Invoice Number","Invoice Date","Customer","Description","Exclusive Sales Amount"]
["Cash","2021-07-01","Cash Sales","Daily Sales",4800]
["Cash","2021-07-02","Cash Sales","Daily Sales",4200]
["Cash","2021-07-05","Cash Sales","Daily Sales",5300]
["Cash","2021-07-06","Cash Sales","Daily Sales",4500]
["Cash","2021-07-07","Cash Sales","Daily Sales",4800]
["Cash","2021-07-08","Cash Sales","Daily Sales",4250]
{"$rows_left_out":39}
{"sheet":"Profitability","index":8,"n_rows":47,"n_cols":11,"rows_kept":47,"cut":false,"hidden":true,"merged":[[5,0,5,1]]}
["Profitability Report",null,null,null,{"$f":"IF(AND(ISBLANK(E3)=FALSE,E3<E2),\"Error! The From date cannot be after the To date!\",\"\")","v":""}]
["Calculation of sales, cost of sales and gross profit",null,null,"From Date","2021-08-16",{"$f":"IF(ISBLANK(E2)=TRUE,IF(MIN(MoveDate)=0,DATE(YEAR($E$3),MONTH($E$3),1),DATE(YEAR(MIN(MoveDate)),MONTH(MIN(MoveDate)),1)),E2)","v":"2021-08-16"}]
[null,null,null,"To Date","2021-08-31",{"$f":"IF(ISBLANK(E3)=TRUE,DATE(YEAR(TODAY()),MONTH(TODAY())+1,0),E3)","v":"2021-08-31"}]
["© www.excel-skills.com"]
[null,null,null,{"$f":"$F$3","v":"2021-08-31"},{"$f":"F3","v":"2021-08-31"}]
[null,null,"Date Range","Month-to-Date","Year-to-Date"]
[]
["Sales",null,{"$f":"SUMIFS(SaleAmount,SaleDate,\">=\"&$F$2,SaleDate,\"<\"&$F$3+1)","v":90350},{"$f":"SUMIFS(SaleAmount,SaleDate,\">=\"&DATE(YEAR($F$3),MONTH($F$3),1),SaleDate,\"<\"&$F$3+1)","v":164544},{"$f":"SUMIFS(SaleAmount,SaleDate,\">=\"&DATE(YEAR($F$3),1,1),SaleDate,\"<\"&$F$3+1)","v":292757}]
[]
["Cost of Sales",null,{"$f":"-SUMIFS(MoveAmount,MoveDate,\">=\"&$F$2,MoveDate,\"<\"&$F$3+1,MoveType,\"<>\"&\"Purchase\")","v":67565.016803529361},{"$f":"-SUMIFS(MoveAmount,MoveDate,\">=\"&DATE(YEAR($F$3),MONTH($F$3),1),MoveDate,\"<\"&$F$3+1,MoveType,\"<>\"&\"Purchase\")","v":105253.32238461962},{"$f":"-SUMIFS(MoveAmount,MoveDate,\">=\"&DATE(YEAR($F$3),1,1),MoveDate,\"<\"&$F$3+1,MoveType,\"<>\"&\"Purchase\")","v":198876.53650803232}]
{"$rows_left_out":37}