{"text_format":"1","workbook":"xlsx","n_sheets":9,"sheets":["Info","Trial","Instructions","Setup","Data","Campaigns","AdGroups","CamCharts","AgCharts"],"not_rendered":{"charts":16,"images":3,"macros":1,"external_links":0,"defined_names":25,"comments":0,"pivot_tables":0},"unopened":[],"bounds":{"document_bytes":16777216,"sheet_cells":100000,"rows_first":2000,"rows_last":500,"rows_between":2000,"halvings":0,"cell_chars":16384,"cell_head_chars":4096},"cells_cut":0,"cells_raw":0,"read":"whole","date_system":"1900"}

{"sheet":"Info","index":0,"n_rows":0,"n_cols":0,"rows_kept":0,"cut":false,"hidden":false,"merged":[]}

{"sheet":"Trial","index":1,"n_rows":0,"n_cols":0,"rows_kept":0,"cut":false,"hidden":true,"merged":[]}

{"sheet":"Instructions","index":2,"n_rows":127,"n_cols":1,"rows_kept":127,"cut":false,"hidden":true,"merged":[]}
["Excel Skills | Google Adwords - Monthly Statistics Template"]
["Instructions"]
["www.excel-skills.com"]
[]
["This template enables users to analyse their monthly Google Ads data on an overall, campaign, ad group and device level. The template can be used for any Ads account by adding all the relevant campaigns & ad group names to the template and copying the monthly Ads data from an Excel extract of their Ads account. The template includes a lot of automated calculations & charts which make it easy to spot trends in the data."]
[]
["The following sheets are included in the template:"]
["Set-up - enter a report date & maintain the list of devices. The report date determines the reporting periods which are included on the other sheets. You can therefore compile the reports on all the sheets in this template for any date range by simply changing the date at the top of this sheet. Devices can be added to the list boxes on the other sheets by inserting them in a new row above the \"End of list\" item."]
["Data - create a report by using the Reports feature in Google Ads and export your report data to Excel before copying & pasting your data onto this sheet. The columns that need to be included in the report are exactly the same as our column headings and the columns need to be included in the report in the same sequence as they are included on this sheet. The campaign & ad group data on this sheet is automatically updated in the calculations & charts on the other sheets in this template."]
["Campaigns - include all your Ads campaigns on this sheet by adding the campaign name in column A. All the calculations in the columns with light blue column headings are automated. You can select a device at the top of the sheet and select the values to display (cost, clicks, cost per click, click through rate, conversions, conversion rates, revenue, return on investment & more). The data on this sheet provides a monthly analysis of Ads campaign data for a 12-month period based on the report date which is entered on the Setup sheet."]
["AdGroups - include all your Ads ad groups in column A and link the ad groups to campaigns in column B.  All the calculations in the columns with light blue column headings are automated. You can select a device at the top of the sheet and select the values to display (cost, clicks, cost per click, click through rate, conversions, conversion rates, revenue, return on investment & more). The data on this sheet provides a monthly analysis of Ads ad group data for a 12-month period based on the report date which is entered on the Setup sheet."]
["CamCharts - select a campaign & device at the top of the sheet in order to analyse your Ads campaign data. You can also clear these input cells in order to view all campaign or device data. All the calculations & charts on this sheet are fully automated. The campaigns which are included in the list box at the top of the sheet are based on the contents of the Campaigns sheet and the dates are based on the report date which is specified on the Setup sheet."]
["AgCharts - select an ad group & device at the top of the sheet in order to analyse your Ads ad group data. Only the ad groups that are associated with the campaign which is currently selected on the CamCharts sheet will be available for selection. You can also clear these input cells in order to view all ad group or device data (for the selected campaign). All the calculations & charts on this sheet are fully automated. The ad groups which are included in the list box at the top of the sheet are based on the contents of the AdGroups sheet and the campaign which has been selected on the CamCharts sheet. The dates are based on the report date which is specified on the Setup sheet."]
[]
["Set-up"]
[]
["All the date ranges which are included on the reports in this template are based on the Report Date specified in cell B4 on the Setup sheet. The date entered here represents the end date of the date range whether it is a 12-month or other period of analysis."]
[]
["The Setup sheet also includes a list of devices which can be edited by simply inserting a new row anywhere above the \"End of list\" row and adding a new entry in column A. All the entries in the list will be included automatically in the device selection cells on the other sheets."]
[]
["Data"]
[]
["All monthly AdWords data needs to be included on this sheet. The easiest way of including your monthly data is by creating the appropriate report through the Google Ads account interface and then exporting the data to Excel before copying the data from the Excel extract onto this sheet. The report needs to be created so that the columns are included in exactly the same sequence as the columns on the Data sheet although you can add columns or move columns so that the sequence between your extract file and the columns on the Data sheet are the same."]
[]
["Note: The Google Ads fields which you need to add to your report will have the exact same field names as the column headings included on the Data sheet. The Month, Campaign, Ad Group and Device columns need to be added to the Row section of the report and the other fields need to be added to the Columns section."]
[]
["The Ads report can be extracted as an Excel or CSV file and downloaded. When you then open the report, you will be able to copy the data onto the Data sheet in this template. Note that some columns may contain a currency symbol which may result in the data in that column being interpreted as text instead of values by Excel. We therefore recommend removing all currency symbols from your Google data (Control + H for Replace and then replace currency text with nothing for the entire data selection)."]
[]
["Note: All the columns on the Data sheet have been included in an Excel table. This feature is extremely useful when entering or copying data in a table format because the cell range to which the table refers is automatically extended when you add data to the table. The table also extends automatically to include the copied data as long as you copy the data into the first blank row below the table."]
[]
["Campaigns"]
[]
["All the campaign names that form part of your Google Ads account need to be included in column A on the Campaigns sheet. The easiest way of adding all the campaign names is by extracting the data from Ads and copying the names into column A. This is the only user input data that needs to be added to the sheet - all the columns with light blue column headings contain formulas which are automatically calculated."]
[]
["Note: All the columns on the Campaigns sheet have been included in an Excel table. The table feature is extremely useful when entering or copying data in a table format because the calculated columns (columns with light blue column headings) are automatically extended when you add data to the table. The table also extends automatically to include the copied data as long as you copy the data into the first blank row below the table."]
[]
["New campaign names can therefore be added to the Campaigns sheet by simply entering or copying the new campaign names into the first blank cell in column A. The Excel table will then automatically extend to include the new campaign name and the formulas in all the other columns will be included in the new row automatically."]
[]
["The totals for the selected metric (the values selected from the list box at the top of the sheet) & device are included in row 4 and the reporting periods included in row 5 are based on the report date entered on the Setup sheet."]
[]
["Note: If you want to extend the default 12-month reporting period, you can do so by copying the formulas from the last column - this includes the formulas which have been added to the Excel table as well as the formulas in the two rows above the column heading (totals and months). You also then need to add a new column heading."]
[]
["You can select any of a number of value metrics to be displayed on the Campaigns sheet. These include clicks, impressions, click through rates (CTR), costs, cost per click (CPC), conversions, cost per conversion, conversion rates, revenue and return on investment (ROI). The appropriate metrics can be selected from the list box in cell L2 at the top of the sheet. If the contents of the list box are deleted, the calculations default to display costs."]
[]
["You can also view the calculations for the selected metric for all devices or a selected device. The device can be selected from the list box in cell J2 and the contents of this list box can be cleared in order to display campaign data for all devices. The device list which is included in the list box can be maintained on the Setup sheet."]
[]
["When you add new campaigns to your Ads account, the campaign names need to be added to the Campaigns sheet in order for the overall calculations to be accurate. If you neglect to add all the new campaign names to the sheet, the overall Ads data will not include all campaigns and therefore not be accurate."]
[]
["We have therefore built in a completeness check which compares the overall costs on the Campaigns sheet to the calculated overall costs of all the campaigns added to the Data sheet. If the costs do not match, it means that there is a campaign name which has not been added to the Campaigns sheet. This calculation is not displayed on the sheet but has been added as a conditional formatting formula."]
[]
["Note: If the completeness check reveals that there is a campaign name missing, the campaign name heading in cell A6 will be highlighted in red. This indicates that there is a campaign name missing and that you need to review the Data sheet to determine which campaign name has not been added to the Campaigns sheet. Once you add the campaign name(s), the red highlighting will be removed automatically."]
[]
["We have also used conditional formatting rules to format the data on the Campaigns sheet with the appropriate number formatting. This means that where a metric is displayed which is a percentage, the values on the Campaigns sheet will automatically be displayed as percentages."]
[]
["Note: If some rows are displayed as percentages and some as decimal values, it indicates that the conditional formatting rules are not correct. You then need to open the Conditional Formatting - Manage Rules feature from the Home tab on the ribbon and review the cell selections. The rules which relate to the data below the column headings need to be applied to all the rows that contain data. You therefore may need to extend the cell range to include all the rows."]
[]
["Analysing Campaign Data"]
[]
["The data on the Campaigns sheet enables users to compare monthly Google Ads statistics for all campaigns by selecting the appropriate values that you want to compare from the list box at the top of the sheet. You can also view statistics for all devices by clearing the device list box or view statistics for a specific device by selecting the appropriate device from the list box."]
[]
["If you then want to analyse the data for a specific campaign in more detail, you can go to the CamCharts sheet and select the appropriate campaign from the list box at the top of the sheet. If you want to analyse data for all campaigns, simply clear the Campaign list box."]
[]
["Note: The 14-month reporting period which is included on the sheet is based on the report date specified on the Setup sheet. If you want to change this date range, all you need to do is enter a new date on the Setup sheet."]
[]
["Note: If you want to extend the default 14-month period, we recommend adding the appropriate number of rows in the middle of the current data section (say in row 10). Then copy all the formulas from row 6 and paste them into the rows from row 7 and up to the row above the total row. This will ensure that all the formulas are added correctly and that you do not need to extend the chart source data ranges manually."]
[]
["The CamCharts sheet also contains a device list box at the top of the sheet which can be used to analyse Ads data for a selected device. If this list box is cleared, the campaign data for all devices will be displayed."]
[]
["Note: Aside from the list box selections at the top of the sheet, the CamCharts sheet requires no user input - all the calculations on this sheet as well as all the charts which have been included below the calculations are fully automated."]
[]
["Note: The column headings in row 4 on the CamCharts sheet are used as the names of the value metrics on the other sheets in this template and should therefore not be changed. If you change any of these column headings, the affected cell will be highlighted in red in order to remind you that the column headings cannot be changed. Simply undo your changes in order to have the red highlighting removed automatically."]
[]
["Ad Groups"]
[]
["All the ad group names that form part of your Google Ads account need to be included in column A on the AdGroups sheet and each ad group needs to be linked to a campaign by including the appropriate campaign name in column B. The easiest way of adding all the ad group & campaign names is by extracting the data from Ads and copying the data into columns A & B. This is the only user input data that needs to be added to the sheet - all the columns with light blue column headings contain formulas which are automatically calculated."]
[]
["Note: All the columns on the AdGroups sheet have been included in an Excel table. The table feature is extremely useful when entering or copying data in a table format because the calculated columns (columns with light blue column headings) are automatically extended when you add data to the table. The table also extends automatically to include the copied data as long as you copy the data into the first blank row below the Excel table."]
[]
["New ad groups can therefore be added to the AdGroups sheet by simply entering or copying the new ad groups into the first blank cell in column A. The Excel table will then automatically extend to include the new ad groups and the formulas in all the other columns will be included in the new row automatically."]
[]
["The totals for the selected metric (the values that are selected from the list box at the top of the sheet) & device are included in row 4 and the reporting periods which are included in row 5 are based on the report date entered on the Setup sheet."]
[]
["Note: If you want to extend the default 12-month reporting period, you can do so by copying the formulas from the last column - this includes the formulas which have been added to the Excel table as well as the formulas in the two rows above the column heading (totals and months). You also then need to add a new column heading."]
[]
["You can select any of a number of value metrics to be displayed on the AdGroups sheet. These include clicks, impressions, click through rates (CTR), costs, cost per click (CPC), conversions, cost per conversion, conversion rates, revenue and return on investment (ROI). The appropriate metrics can be selected from the list box in cell K2 at the top of the sheet. If the contents of the list box are deleted, the calculations default to display costs."]
[]
["You can also view the calculations for the selected metric for all devices or a selected device. The device can be selected from the list box in cell I2 and the contents of this list box can be cleared in order to display ad group data for all devices. The device list which is included in the list box can be maintained on the Setup sheet."]
[]
["When you add new ad groups to your Ads account, the ad group names need to be added to the AdGroups sheet in order for the overall calculations to be accurate. If you neglect to add all the new ad group names to the sheet, the overall Ads data will not include all ad groups and therefore not be accurate."]
[]
["We have therefore built in a completeness check which compares the overall costs on the AdGroups sheet to the calculated overall costs of all the ad groups that have been added to the Data sheet. If the costs do not match, it means that there is an ad group name which has not been added to the AdGroups sheet. This calculation is not displayed on the sheet but has been added as a conditional formatting formula."]
[]
["Note: If the above completeness check reveals that there is an ad group name missing, the ad group & campaign name headings in cells A6 & B6 will be highlighted in red. This indicates that there is an ad group name missing and that you need to review the Data sheet to determine which ad group name has not been added to the AdGroups sheet. Once you add the appropriate ad group name(s), the red highlighting will be removed automatically."]
[]
["We have also used conditional formatting rules to format the data on the AdGroups sheet with the appropriate number formatting. This means that where a metric is displayed which is a percentage, the values on the AdGroups sheet will automatically be displayed as percentages."]
[]
["Note: If some rows are displayed as percentages and some as decimal values, it indicates that the conditional formatting rules are not correct. You then need to open the Conditional Formatting - Manage Rules feature from the Home tab on the ribbon and review the cell selections. The rules that relate to the data below the column headings need to be applied to all the rows that contain data. You therefore may need to extend the cell range to include all the rows."]
[]
["Analysing Ad Group Data"]
[]
["The data on the AdGroups sheet enables users to compare monthly AdWords statistics for all ad groups by selecting the appropriate values that you want to compare from the list box at the top of the sheet. You can also view statistics for all devices by clearing the device list box or view statistics for a specific device by selecting the appropriate device from the list box."]
[]
["If you then want to analyse the data for a specific ad group in more detail, you can go to the AgCharts sheet and select the appropriate ad group from the list box at the top of the sheet. If you want to analyse data for all ad groups linked to the selected campaign, simply clear the Ad Groups list box."]
[]
["Note: The campaign name which is reflected at the top of the AgCharts sheet is based on the campaign which has been selected on the CamCharts sheet. Only the ad groups which have been linked to this campaign on the AdGroups sheet will be available for selection from the Ad Groups list box. If the selected campaign is indicated with an asterisk (*), it means that no campaign has been selected on the CamCharts sheet and that all ad groups will therefore be available for selection."]
[]
["Note: We recommend reviewing campaign data on the CamCharts sheet first and to then drill down in more detail by selecting the appropriate campaign on the CamCharts sheet before opening the AgCharts sheet to review ad group data. Start by clearing the Ad Group list box at the top of the sheet to display data for the entire campaign and then select the available ad groups one at a time in order to view the individual ad group data."]
[]
["Note: If the Ad Group list box at the top of the sheet is highlighted in red, it means that the currently selected ad group is not linked to the active campaign (the campaign that is currently selected on the CamCharts sheet). You can simply delete the ad group in order to remove the red highlighting and to display all ad group data for the active campaign before selecting the linked ad groups individually from the list box."]
[]
["Note: The 14-month reporting period which is included on the sheet is based on the report date which is specified on the Setup sheet. If you want to change this date range, all you need to do is enter a new date on the Setup sheet."]
[]
["Note: If you want to extend the default 14-month period, we recommend adding the appropriate number of rows in the middle of the current data section (say in row 10). Then copy all the formulas from row 6 and paste them into the rows from row 7 and up to the row above the total row. This will ensure that all the formulas are added correctly and that you do not need to extend the chart source data ranges manually."]
[]
["The AgCharts sheet also contains a device list box at the top of the sheet which can be used to analyse AdWords data for a selected device. If this list box is cleared, the ad group data for all devices will be displayed."]
[]
["Note: Aside from the list box selections at the top of the sheet, the AgCharts sheet requires no user input - all the calculations on this sheet as well as all the charts that have been included below the calculations are fully automated."]
[]
["Note: The column headings in row 4 on the AgCharts sheet are used as the names of the value metrics on the other sheets in this template and should therefore not be changed. If you change any of these column headings, the affected cell will be highlighted in red in order to remind you that the column headings cannot be changed. Simply undo your changes in order to have the red highlighting removed automatically."]
[]
["Help & Customization"]
[]
["If you experience any difficulty while using this template and you are not able to find the appropriate guidance in these instructions, please e-mail us at support@excel-skills.com for assistance. This template has been designed with flexibility in mind to ensure that it can be used in most business environments. If however you need an Excel based template that is customized specifically for your business requirements, please e-mail our Support function and provide a brief explanation of your requirements."]
[]
["© Copyright"]
[]
["This template remains the intellectual property of www.excel-skills.com and is protected by international copyright laws. Any publication or distribution of this template outside the scope of the permitted use of the template is expressly prohibited. In terms of the permitted use of this template, only the distribution of the template to persons within the same organisation as the registered user or persons outside the organisation who can reasonably be expected to require access to the template as a direct result of the use of the template by the registered user is allowed. Subsequent distribution of the template by parties outside of the organisation is however expressly prohibited and represents an infringement of international copyright laws."]

{"sheet":"Setup","index":3,"n_rows":11,"n_cols":2,"rows_kept":11,"cut":false,"hidden":true,"merged":[]}
["Google Adwords - Monthly Statistics"]
["Setup"]
["© www.excel-skills.com"]
["Report Date","2021-04-30"]
[]
["Device List"]
["Desktop"]
["Mobile"]
["Tablet"]
["Other"]
["End of list"]

{"sheet":"Data","index":4,"n_rows":529,"n_cols":9,"rows_kept":529,"cut":false,"hidden":true,"merged":[]}
["Google Adwords - Monthly Statistics"]
["Import Data"]
["© www.excel-skills.com"]
["Month","Campaign","Ad Group","Device","Clicks","Impressions","Cost","Conversions","Total Conv. Value"]
["2020-01-01","Campaign 1","Ad Group 1.1","Desktop",80,9758,24.74,19,741]
["2020-01-01","Campaign 1","Ad Group 1.1","Mobile",34,2927,13.61,8,356]
["2020-01-01","Campaign 1","Ad Group 1.1","Tablet",40,3900,12,5,180]
["2020-01-01","Campaign 1","Ad Group 1.2","Desktop",6,122,9.6,1,35]
["2020-01-01","Campaign 1","Ad Group 1.2","Mobile",3,37,5.28,0,17]
["2020-01-01","Campaign 1","Ad Group 1.2","Tablet",0,120,0,0,0]
["2020-01-01","Campaign 1","Ad Group 1.3","Desktop",38,1596,15.34,7,263]
["2020-01-01","Campaign 1","Ad Group 1.3","Mobile",16,479,8.44,3,126]
["2020-01-01","Campaign 1","Ad Group 1.3","Tablet",0,580,0,0,0]
["2020-01-01","Campaign 2","Ad Group 2.1","Desktop",44,484,74.66,5,173]
["2020-01-01","Campaign 2","Ad Group 2.1","Mobile",19,145,41.06,2,83]
["2020-01-01","Campaign 2","Ad Group 2.1","Tablet",0,160,0,0,0]
["2020-01-01","Campaign 2","Ad Group 2.2","Desktop",88,2210,51.24,14,504]
["2020-01-01","Campaign 2","Ad Group 2.2","Mobile",38,663,28.18,6,242]
["2020-01-01","Campaign 2","Ad Group 2.2","Tablet",40,1460,24.6,6,216]
["2020-01-01","Campaign 3","Ad Group 3.1","Desktop",4,22,8.08,0,0]
["2020-01-01","Campaign 3","Ad Group 3.1","Mobile",2,7,4.4400000000000004,0,0]
["2020-01-01","Campaign 4","Ad Group 4.1","Desktop",0,172,0,0,0]
["2020-01-01","Campaign 4","Ad Group 4.1","Tablet",0,40,0,0,0]
["2020-01-01","Campaign 4","Ad Group 4.2","Desktop",4,66,14.36,0,0]
["2020-01-01","Campaign 4","Ad Group 4.2","Tablet",0,80,0,0,0]
["2020-01-01","Campaign 4","Ad Group 4.3","Desktop",26,648,30.74,4,144]
["2020-01-01","Campaign 4","Ad Group 4.3","Tablet",0,440,0,0,0]
["2020-01-01","Campaign 5","Ad Group 5.1","Desktop",0,50,0,0,0]
["2020-01-01","Campaign 5","Ad Group 5.1","Mobile",0,15,0,0,0]
["2020-01-01","Campaign 5","Ad Group 5.2","Desktop",2,78,9.9,0,0]
["2020-01-01","Campaign 5","Ad Group 5.2","Mobile",1,23,5.45,0,0]
["2020-01-01","Campaign 5","Ad Group 5.2","Tablet",0,40,0,0,0]
["2020-01-01","Campaign 5","Ad Group 5.3","Desktop",2,28,3.4,0,0]
["2020-01-01","Campaign 5","Ad Group 5.3","Mobile",1,8,1.87,0,0]
["2020-01-01","Campaign 5","Ad Group 5.3","Tablet",0,20,0,0,0]
["2020-02-01","Campaign 1","Ad Group 1.1","Desktop",238,23744,77.040000000000006,51,1989]
["2020-02-01","Campaign 1","Ad Group 1.1","Mobile",102,7123,42.37,20,955]
["2020-02-01","Campaign 1","Ad Group 1.1","Tablet",80,9340,24,10,345]
["2020-02-01","Campaign 1","Ad Group 1.2","Desktop",30,272,70.900000000000006,3,99]
["2020-02-01","Campaign 1","Ad Group 1.2","Mobile",13,82,39,1,48]
["2020-02-01","Campaign 1","Ad Group 1.2","Tablet",0,20,0,0,0]
["2020-02-01","Campaign 1","Ad Group 1.3","Desktop",140,5234,80.040000000000006,21,756]
["2020-02-01","Campaign 1","Ad Group 1.3","Mobile",60,1570,44.02,8,363]
["2020-02-01","Campaign 1","Ad Group 1.3","Tablet",0,1780,0,0,0]
["2020-02-01","Campaign 2","Ad Group 2.1","Desktop",150,1938,214.6,15,518]
["2020-02-01","Campaign 2","Ad Group 2.1","Mobile",65,581,118.03,6,249]
["2020-02-01","Campaign 2","Ad Group 2.1","Tablet",120,820,123.80000000000001,14,483]
["2020-02-01","Campaign 2","Ad Group 2.2","Desktop",224,6194,132.26,35,1260]
["2020-02-01","Campaign 2","Ad Group 2.2","Mobile",96,1858,72.739999999999995,14,605]
["2020-02-01","Campaign 2","Ad Group 2.2","Tablet",140,3780,118,20,720]
["2020-02-01","Campaign 3","Ad Group 3.1","Desktop",48,194,173.6,3,99]
["2020-02-01","Campaign 3","Ad Group 3.1","Mobile",21,58,95.48,1,48]
["2020-02-01","Campaign 3","Ad Group 3.1","Tablet",0,40,0,0,0]
["2020-02-01","Campaign 4","Ad Group 4.1","Desktop",30,2152,5.0999999999999996,5,180]
["2020-02-01","Campaign 4","Ad Group 4.1","Tablet",0,860,0,0,0]
["2020-02-01","Campaign 4","Ad Group 4.2","Desktop",64,1248,211.54,4,132]
["2020-02-01","Campaign 4","Ad Group 4.2","Tablet",40,620,102.2,3,99]
["2020-02-01","Campaign 4","Ad Group 4.3","Desktop",238,10422,232.02,33,1188]
["2020-02-01","Campaign 4","Ad Group 4.3","Tablet",260,6280,212,35,1260]
["2020-02-01","Campaign 5","Ad Group 5.1","Desktop",2,488,0.34,0,0]
["2020-02-01","Campaign 5","Ad Group 5.1","Mobile",1,146,0.19,0,0]
["2020-02-01","Campaign 5","Ad Group 5.1","Tablet",0,280,0,0,0]
["2020-02-01","Campaign 5","Ad Group 5.2","Desktop",38,920,181.96,7,263]
["2020-02-01","Campaign 5","Ad Group 5.2","Mobile",16,276,100.08,3,126]
["2020-02-01","Campaign 5","Ad Group 5.2","Tablet",0,560,0,0,0]
["2020-02-01","Campaign 5","Ad Group 5.3","Desktop",28,682,50.28,6,234]
["2020-02-01","Campaign 5","Ad Group 5.3","Mobile",12,205,27.65,2,112]
["2020-02-01","Campaign 5","Ad Group 5.3","Tablet",0,360,0,0,0]
["2020-03-01","Campaign 1","Ad Group 1.1","Desktop",132,12936,39.479999999999997,20,720]
["2020-03-01","Campaign 1","Ad Group 1.1","Mobile",57,3881,21.71,8,346]
["2020-03-01","Campaign 1","Ad Group 1.1","Tablet",20,7980,3,3,108]
["2020-03-01","Campaign 1","Ad Group 1.2","Desktop",14,302,25.7,1,33]
["2020-03-01","Campaign 1","Ad Group 1.2","Mobile",6,91,14.14,0,16]
["2020-03-01","Campaign 1","Ad Group 1.2","Tablet",0,40,0,0,0]
["2020-03-01","Campaign 1","Ad Group 1.3","Desktop",258,7308,297.7,34,1173]
["2020-03-01","Campaign 1","Ad Group 1.3","Mobile",111,2192,163.74,14,563]
["2020-03-01","Campaign 1","Ad Group 1.3","Tablet",40,3260,28.4,6,216]
["2020-03-01","Campaign 2","Ad Group 2.1","Desktop",124,2130,174.04,12,396]
["2020-03-01","Campaign 2","Ad Group 2.1","Mobile",53,639,95.72,5,190]
["2020-03-01","Campaign 2","Ad Group 2.1","Tablet",120,1340,257.2,12,414]
["2020-03-01","Campaign 2","Ad Group 2.2","Desktop",278,5624,231.82,35,1208]
["2020-03-01","Campaign 2","Ad Group 2.2","Mobile",120,1687,127.5,14,580]
["2020-03-01","Campaign 2","Ad Group 2.2","Tablet",40,3300,41.4,6,216]
["2020-03-01","Campaign 3","Ad Group 3.1","Desktop",58,200,167.96,3,95]
["2020-03-01","Campaign 3","Ad Group 3.1","Mobile",25,60,92.38,1,46]
["2020-03-01","Campaign 3","Ad Group 3.1","Tablet",0,40,0,0,0]
["2020-03-01","Campaign 4","Ad Group 4.1","Desktop",20,1178,4.28,3,32]
["2020-03-01","Campaign 4","Ad Group 4.1","Tablet",0,600,0,0,0]
["2020-03-01","Campaign 4","Ad Group 4.2","Desktop",48,1082,157.82,3,99]
["2020-03-01","Campaign 4","Ad Group 4.2","Tablet",20,700,56.8,1,33]
["2020-03-01","Campaign 4","Ad Group 4.3","Desktop",276,10382,340.02,35,1208]
["2020-03-01","Campaign 4","Ad Group 4.3","Tablet",40,4600,36.200000000000003,5,180]
["2020-03-01","Campaign 5","Ad Group 5.1","Desktop",4,382,0.64,1,36]
["2020-03-01","Campaign 5","Ad Group 5.1","Mobile",2,115,0.35,0,17]
["2020-03-01","Campaign 5","Ad Group 5.1","Tablet",0,660,0,0,0]
["2020-03-01","Campaign 5","Ad Group 5.2","Desktop",44,996,218.64,6,207]
["2020-03-01","Campaign 5","Ad Group 5.2","Mobile",19,299,120.25,2,99]
["2020-03-01","Campaign 5","Ad Group 5.2","Tablet",20,520,122.6,2,69]
["2020-03-01","Campaign 5","Ad Group 5.3","Desktop",52,812,141.46,7,252]
["2020-03-01","Campaign 5","Ad Group 5.3","Mobile",22,244,77.8,3,121]
["2020-03-01","Campaign 5","Ad Group 5.3","Tablet",40,1020,71,10,390]
["2020-04-01","Campaign 1","Ad Group 1.1","Desktop",206,15248,78.92,43,1677]
["2020-04-01","Campaign 1","Ad Group 1.1","Mobile",89,4574,43.41,17,805]
["2020-04-01","Campaign 1","Ad Group 1.1","Tablet",20,8760,8.6,4,150]
["2020-04-01","Campaign 1","Ad Group 1.2","Desktop",20,218,32.36,2,66]
["2020-04-01","Campaign 1","Ad Group 1.2","Mobile",9,65,17.8,1,32]
["2020-04-01","Campaign 1","Ad Group 1.2","Tablet",0,80,0,0,0]
["2020-04-01","Campaign 1","Ad Group 1.3","Desktop",248,7694,314.2,33,1188]
["2020-04-01","Campaign 1","Ad Group 1.3","Mobile",107,2308,172.81,13,570]
["2020-04-01","Campaign 1","Ad Group 1.3","Tablet",40,3560,47.599999999999994,5,180]
["2020-04-01","Campaign 2","Ad Group 2.1","Desktop",228,2166,343.36,22,759]
["2020-04-01","Campaign 2","Ad Group 2.1","Mobile",98,650,188.85,9,364]
["2020-04-01","Campaign 2","Ad Group 2.1","Tablet",40,960,72.400000000000006,5,173]
["2020-04-01","Campaign 2","Ad Group 2.2","Desktop",324,7122,326.74,40,1380]
["2020-04-01","Campaign 2","Ad Group 2.2","Mobile",139,2137,179.71,16,662]
["2020-04-01","Campaign 2","Ad Group 2.2","Tablet",160,3780,186,22,792]
["2020-04-01","Campaign 3","Ad Group 3.1","Desktop",36,220,93.78,2,66]
["2020-04-01","Campaign 3","Ad Group 3.1","Mobile",15,66,51.58,1,32]
["2020-04-01","Campaign 3","Ad Group 3.1","Tablet",40,80,147.4,2,63]
["2020-04-01","Campaign 4","Ad Group 4.1","Desktop",36,1766,12.84,6,216]
["2020-04-01","Campaign 4","Ad Group 4.1","Tablet",20,1060,19.2,3,108]
["2020-04-01","Campaign 4","Ad Group 4.2","Desktop",66,1136,172.56,4,132]
["2020-04-01","Campaign 4","Ad Group 4.2","Tablet",20,640,113,2,66]
["2020-04-01","Campaign 4","Ad Group 4.3","Desktop",270,10322,332.82,38,1368]
["2020-04-01","Campaign 4","Ad Group 4.3","Tablet",100,4960,157,17,612]
["2020-04-01","Campaign 5","Ad Group 5.1","Desktop",42,1432,85.9,7,263]
["2020-04-01","Campaign 5","Ad Group 5.1","Mobile",18,430,47.25,3,126]
["2020-04-01","Campaign 5","Ad Group 5.1","Tablet",0,860,0,0,0]
["2020-04-01","Campaign 5","Ad Group 5.2","Desktop",54,1092,309.18,6,207]
["2020-04-01","Campaign 5","Ad Group 5.2","Mobile",23,328,170.05,2,99]
["2020-04-01","Campaign 5","Ad Group 5.2","Tablet",60,1040,256.60000000000002,8,288]
["2020-04-01","Campaign 5","Ad Group 5.3","Desktop",64,1168,224.58,8,288]
["2020-04-01","Campaign 5","Ad Group 5.3","Mobile",28,350,123.52,3,138]
["2020-04-01","Campaign 5","Ad Group 5.3","Tablet",80,1260,349.4,11,396]
["2020-05-01","Campaign 1","Ad Group 1.1","Desktop",370,23888,270.82,76,2964]
["2020-05-01","Campaign 1","Ad Group 1.1","Mobile",159,7166,148.94999999999999,30,1423]
["2020-05-01","Campaign 1","Ad Group 1.1","Tablet",180,15100,139.80000000000001,38,1482]
["2020-05-01","Campaign 1","Ad Group 1.2","Desktop",20,236,35.72,2,66]
["2020-05-01","Campaign 1","Ad Group 1.2","Mobile",9,71,19.649999999999999,1,32]
["2020-05-01","Campaign 1","Ad Group 1.2","Tablet",20,180,64.2,2,69]
["2020-05-01","Campaign 1","Ad Group 1.3","Desktop",182,6264,242.06,25,900]
["2020-05-01","Campaign 1","Ad Group 1.3","Mobile",78,1879,133.13,10,432]
["2020-05-01","Campaign 1","Ad Group 1.3","Tablet",80,3380,90.399999999999991,12,432]
["2020-05-01","Campaign 2","Ad Group 2.1","Desktop",164,1858,318.54000000000002,14,462]
["2020-05-01","Campaign 2","Ad Group 2.1","Mobile",71,557,175.2,6,222]
["2020-05-01","Campaign 2","Ad Group 2.1","Tablet",60,820,106.6,6,207]
["2020-05-01","Campaign 2","Ad Group 2.2","Desktop",432,8106,650.44000000000005,48,1656]
["2020-05-01","Campaign 2","Ad Group 2.2","Mobile",186,2432,357.74,19,795]
["2020-05-01","Campaign 2","Ad Group 2.2","Tablet",140,5420,212.2,19,684]
["2020-05-01","Campaign 3","Ad Group 3.1","Desktop",48,178,200.42,3,99]
["2020-05-01","Campaign 3","Ad Group 3.1","Mobile",21,53,110.23,1,48]
["2020-05-01","Campaign 3","Ad Group 3.1","Tablet",0,60,0,0,0]
["2020-05-01","Campaign 4","Ad Group 4.1","Desktop",132,8314,111.26,21,756]
["2020-05-01","Campaign 4","Ad Group 4.1","Tablet",40,5160,53.2,7,252]
["2020-05-01","Campaign 4","Ad Group 4.2","Desktop",66,1250,174.84,4,132]
["2020-05-01","Campaign 4","Ad Group 4.2","Tablet",20,580,55,2,66]
["2020-05-01","Campaign 4","Ad Group 4.3","Desktop",220,7096,303.95999999999998,29,1044]
["2020-05-01","Campaign 4","Ad Group 4.3","Tablet",40,4220,46.8,6,216]
["2020-05-01","Campaign 5","Ad Group 5.1","Desktop",176,5494,637.4,26,936]
["2020-05-01","Campaign 5","Ad Group 5.1","Mobile",76,1648,350.57,10,449]
["2020-05-01","Campaign 5","Ad Group 5.1","Tablet",300,6860,1100.8,45,1620]
["2020-05-01","Campaign 5","Ad Group 5.2","Desktop",64,1062,416.18,6,207]
["2020-05-01","Campaign 5","Ad Group 5.2","Mobile",28,319,228.9,2,99]
["2020-05-01","Campaign 5","Ad Group 5.2","Tablet",60,1000,438.6,7,242]
["2020-05-01","Campaign 5","Ad Group 5.3","Desktop",72,1430,355.84,8,276]
["2020-05-01","Campaign 5","Ad Group 5.3","Mobile",31,429,195.71,3,132]
["2020-05-01","Campaign 5","Ad Group 5.3","Tablet",80,1240,389.79999999999995,11,396]
["2020-06-01","Campaign 1","Ad Group 1.1","Desktop",810,40352,514.98,143,5363]
["2020-06-01","Campaign 1","Ad Group 1.1","Mobile",348,12106,283.24,57,2574]
["2020-06-01","Campaign 1","Ad Group 1.1","Tablet",320,22460,157,54,2025]
["2020-06-01","Campaign 1","Ad Group 1.2","Desktop",26,224,54.94,2,66]
["2020-06-01","Campaign 1","Ad Group 1.2","Mobile",11,67,30.22,1,32]
["2020-06-01","Campaign 1","Ad Group 1.2","Tablet",0,80,0,0,0]
["2020-06-01","Campaign 1","Ad Group 1.3","Desktop",292,7430,327.9,38,1368]
["2020-06-01","Campaign 1","Ad Group 1.3","Mobile",126,2229,180.35,15,657]
["2020-06-01","Campaign 1","Ad Group 1.3","Tablet",160,3500,220.79999999999998,23,828]
["2020-06-01","Campaign 2","Ad Group 2.1","Desktop",222,1788,412.7,18,594]
["2020-06-01","Campaign 2","Ad Group 2.1","Mobile",95,536,226.99,7,285]
["2020-06-01","Campaign 2","Ad Group 2.1","Tablet",100,940,76.399999999999991,12,414]
["2020-06-01","Campaign 2","Ad Group 2.2","Desktop",630,8888,881.22,66,2277]
["2020-06-01","Campaign 2","Ad Group 2.2","Mobile",271,2666,484.67,26,1093]
["2020-06-01","Campaign 2","Ad Group 2.2","Tablet",160,4840,185.79999999999998,21,725]
["2020-06-01","Campaign 3","Ad Group 3.1","Desktop",74,220,276.72000000000003,4,126]
["2020-06-01","Campaign 3","Ad Group 3.1","Mobile",32,66,152.19999999999999,2,60]
["2020-06-01","Campaign 3","Ad Group 3.1","Tablet",20,80,15.4,1,32]
["2020-06-01","Campaign 4","Ad Group 4.1","Desktop",262,16252,236.36,40,1440]
["2020-06-01","Campaign 4","Ad Group 4.1","Tablet",80,9120,78.8,12,432]
["2020-06-01","Campaign 4","Ad Group 4.2","Desktop",110,1192,271.3,7,231]
["2020-06-01","Campaign 4","Ad Group 4.2","Tablet",0,560,0,0,0]
["2020-06-01","Campaign 4","Ad Group 4.3","Desktop",356,8438,495.74,45,1553]
["2020-06-01","Campaign 4","Ad Group 4.3","Tablet",280,5580,454,36,1242]
["2020-06-01","Campaign 5","Ad Group 5.1","Desktop",334,7008,999.3,45,1620]
["2020-06-01","Campaign 5","Ad Group 5.1","Mobile",144,2102,549.62,18,778]
["2020-06-01","Campaign 5","Ad Group 5.1","Tablet",300,6500,1073.8,40,1440]
["2020-06-01","Campaign 5","Ad Group 5.2","Desktop",74,1192,492.66,7,242]
["2020-06-01","Campaign 5","Ad Group 5.2","Mobile",32,358,270.95999999999998,3,116]
["2020-06-01","Campaign 5","Ad Group 5.2","Tablet",40,520,198.79999999999998,4,138]
["2020-06-01","Campaign 5","Ad Group 5.3","Desktop",112,1516,456.78,11,380]
["2020-06-01","Campaign 5","Ad Group 5.3","Mobile",48,455,251.23,4,182]
["2020-06-01","Campaign 5","Ad Group 5.3","Tablet",100,800,409.20000000000005,10,345]
["2020-07-01","Campaign 1","Ad Group 1.1","Desktop",630,35486,263.06,94,3384]
["2020-07-01","Campaign 1","Ad Group 1.1","Mobile",271,10646,144.68,38,1624]
["2020-07-01","Campaign 1","Ad Group 1.1","Tablet",340,21260,128.6,46,1656]
["2020-07-01","Campaign 1","Ad Group 1.2","Desktop",26,260,37.24,2,66]
["2020-07-01","Campaign 1","Ad Group 1.2","Mobile",11,78,20.48,1,32]
["2020-07-01","Campaign 1","Ad Group 1.2","Tablet",0,160,0,0,0]
["2020-07-01","Campaign 1","Ad Group 1.3","Desktop",390,9144,548.32000000000005,52,1872]
["2020-07-01","Campaign 1","Ad Group 1.3","Mobile",168,2743,301.58,21,899]
["2020-07-01","Campaign 1","Ad Group 1.3","Tablet",220,5440,429.6,32,1152]
["2020-07-01","Campaign 2","Ad Group 2.1","Desktop",224,1920,286.54000000000002,19,627]
["2020-07-01","Campaign 2","Ad Group 2.1","Mobile",96,576,157.6,8,301]
["2020-07-01","Campaign 2","Ad Group 2.1","Tablet",40,1040,9,4,132]
["2020-07-01","Campaign 2","Ad Group 2.2","Desktop",590,7662,482.54,65,2243]
["2020-07-01","Campaign 2","Ad Group 2.2","Mobile",254,2299,265.39999999999998,26,1077]
["2020-07-01","Campaign 2","Ad Group 2.2","Tablet",240,5300,219.60000000000002,32,1152]
["2020-07-01","Campaign 3","Ad Group 3.1","Desktop",70,238,220.8,4,126]
["2020-07-01","Campaign 3","Ad Group 3.1","Mobile",30,71,121.44,2,60]
["2020-07-01","Campaign 3","Ad Group 3.1","Tablet",40,80,135.80000000000001,3,99]
["2020-07-01","Campaign 4","Ad Group 4.1","Desktop",372,23502,376.02,52,1872]
["2020-07-01","Campaign 4","Ad Group 4.1","Tablet",160,14620,203.79999999999998,21,725]
["2020-07-01","Campaign 4","Ad Group 4.2","Desktop",108,1128,186.58,6,189]
["2020-07-01","Campaign 4","Ad Group 4.2","Tablet",60,980,101.4,3,95]
["2020-07-01","Campaign 4","Ad Group 4.3","Desktop",362,9730,496.62,41,1415]
["2020-07-01","Campaign 4","Ad Group 4.3","Tablet",120,6120,207,13,449]
["2020-07-01","Campaign 5","Ad Group 5.1","Desktop",206,5054,415.36,32,1152]
["2020-07-01","Campaign 5","Ad Group 5.1","Mobile",89,1516,228.45,13,553]
["2020-07-01","Campaign 5","Ad Group 5.1","Tablet",180,5100,339.79999999999995,29,1044]
["2020-07-01","Campaign 5","Ad Group 5.2","Desktop",70,1448,480.08,7,242]
["2020-07-01","Campaign 5","Ad Group 5.2","Mobile",30,434,264.04000000000002,3,116]
["2020-07-01","Campaign 5","Ad Group 5.2","Tablet",40,1020,396.8,5,173]
["2020-07-01","Campaign 5","Ad Group 5.3","Desktop",88,1120,230.46,11,380]
["2020-07-01","Campaign 5","Ad Group 5.3","Mobile",38,336,126.75,4,182]
["2020-07-01","Campaign 5","Ad Group 5.3","Tablet",60,800,200.2,7,242]
["2020-08-01","Campaign 1","Ad Group 1.1","Desktop",750,37502,334.6,117,4212]
["2020-08-01","Campaign 1","Ad Group 1.1","Mobile",323,11251,184.03,47,2022]
["2020-08-01","Campaign 1","Ad Group 1.1","Tablet",400,27720,192.2,56,2016]
["2020-08-01","Campaign 1","Ad Group 1.2","Desktop",42,360,64.44,3,99]
["2020-08-01","Campaign 1","Ad Group 1.2","Mobile",18,108,35.44,1,48]
["2020-08-01","Campaign 1","Ad Group 1.2","Tablet",0,240,0,0,0]
["2020-08-01","Campaign 1","Ad Group 1.3","Desktop",360,10416,540.14,45,1553]
["2020-08-01","Campaign 1","Ad Group 1.3","Mobile",155,3125,297.08,18,745]
["2020-08-01","Campaign 1","Ad Group 1.3","Tablet",180,6600,220.39999999999998,25,900]
["2020-08-01","Campaign 2","Ad Group 2.1","Desktop",244,2090,331.32,23,759]
["2020-08-01","Campaign 2","Ad Group 2.1","Mobile",105,627,182.23,9,364]
["2020-08-01","Campaign 2","Ad Group 2.1","Tablet",120,1060,213.79999999999998,12,414]
["2020-08-01","Campaign 2","Ad Group 2.2","Desktop",692,9106,646.58000000000004,77,2657]
["2020-08-01","Campaign 2","Ad Group 2.2","Mobile",298,2732,355.62,31,1275]
["2020-08-01","Campaign 2","Ad Group 2.2","Tablet",240,6360,229.4,31,1070]
["2020-08-01","Campaign 3","Ad Group 3.1","Desktop",86,212,251.9,5,158]
["2020-08-01","Campaign 3","Ad Group 3.1","Mobile",37,64,138.55000000000001,2,76]
["2020-08-01","Campaign 3","Ad Group 3.1","Tablet",20,80,24.8,1,32]
["2020-08-01","Campaign 4","Ad Group 4.1","Desktop",372,23406,423.28,53,1908]
["2020-08-01","Campaign 4","Ad Group 4.1","Tablet",120,14340,155.6,17,612]
["2020-08-01","Campaign 4","Ad Group 4.2","Desktop",76,1246,136.36000000000001,5,165]
["2020-08-01","Campaign 4","Ad Group 4.2","Tablet",0,280,0,0,0]
["2020-08-01","Campaign 4","Ad Group 4.3","Desktop",326,8528,410.7,35,1208]
["2020-08-01","Campaign 4","Ad Group 4.3","Tablet",240,6080,337.8,30,1035]
["2020-08-01","Campaign 5","Ad Group 5.1","Desktop",270,5890,540.9,39,1404]
["2020-08-01","Campaign 5","Ad Group 5.1","Mobile",116,1767,297.5,16,674]
["2020-08-01","Campaign 5","Ad Group 5.1","Tablet",300,5580,429.79999999999995,40,1440]
["2020-08-01","Campaign 5","Ad Group 5.2","Desktop",70,1520,494.34,7,242]
["2020-08-01","Campaign 5","Ad Group 5.2","Mobile",30,456,271.89,3,116]
["2020-08-01","Campaign 5","Ad Group 5.2","Tablet",0,880,0,0,0]
["2020-08-01","Campaign 5","Ad Group 5.3","Desktop",96,1142,273.76,10,345]
["2020-08-01","Campaign 5","Ad Group 5.3","Mobile",41,343,150.57,4,166]
["2020-08-01","Campaign 5","Ad Group 5.3","Tablet",40,980,144,4,138]
["2020-09-01","Campaign 1","Ad Group 1.1","Desktop",556,33952,253.14,89,3204]
["2020-09-01","Campaign 1","Ad Group 1.1","Mobile",239,10186,139.22999999999999,36,1538]
["2020-09-01","Campaign 1","Ad Group 1.1","Tablet",460,34720,167.39999999999998,60,2160]
["2020-09-01","Campaign 1","Ad Group 1.2","Desktop",26,376,25.24,2,66]
["2020-09-01","Campaign 1","Ad Group 1.2","Mobile",11,113,13.88,1,32]
["2020-09-01","Campaign 1","Ad Group 1.2","Tablet",0,80,0,0,0]
["2020-09-01","Campaign 1","Ad Group 1.3","Desktop",426,10978,599.78,54,1863]
["2020-09-01","Campaign 1","Ad Group 1.3","Mobile",183,3293,329.88,22,894]
["2020-09-01","Campaign 1","Ad Group 1.3","Tablet",280,8020,387.59999999999997,36,1242]
["2020-09-01","Campaign 2","Ad Group 2.1","Desktop",256,2412,354.8,23,759]
["2020-09-01","Campaign 2","Ad Group 2.1","Mobile",110,724,195.14,9,364]
["2020-09-01","Campaign 2","Ad Group 2.1","Tablet",80,1360,94,8,276]
["2020-09-01","Campaign 2","Ad Group 2.2","Desktop",440,6622,345.54,50,1725]
["2020-09-01","Campaign 2","Ad Group 2.2","Mobile",189,1987,190.05,20,828]
["2020-09-01","Campaign 2","Ad Group 2.2","Tablet",300,4320,229,38,1311]
["2020-09-01","Campaign 3","Ad Group 3.1","Desktop",98,250,262.18,6,198]
["2020-09-01","Campaign 3","Ad Group 3.1","Mobile",42,75,144.19999999999999,2,95]
["2020-09-01","Campaign 3","Ad Group 3.1","Tablet",0,80,0,0,0]
["2020-09-01","Campaign 4","Ad Group 4.1","Desktop",312,25034,352.52,44,1584]
["2020-09-01","Campaign 4","Ad Group 4.1","Tablet",220,18900,445.6,28,966]
["2020-09-01","Campaign 4","Ad Group 4.2","Desktop",128,1580,252.78,8,264]
["2020-09-01","Campaign 4","Ad Group 4.2","Tablet",80,520,196.20000000000002,5,165]
["2020-09-01","Campaign 4","Ad Group 4.3","Desktop",296,6870,457.72,34,1173]
["2020-09-01","Campaign 4","Ad Group 4.3","Tablet",100,4480,165.39999999999998,12,414]
["2020-09-01","Campaign 5","Ad Group 5.1","Desktop",156,3406,221.92,25,900]
["2020-09-01","Campaign 5","Ad Group 5.1","Mobile",67,1022,122.06,10,432]
["2020-09-01","Campaign 5","Ad Group 5.1","Tablet",180,4080,260.39999999999998,27,972]
["2020-09-01","Campaign 5","Ad Group 5.2","Desktop",114,1362,796.56,12,414]
["2020-09-01","Campaign 5","Ad Group 5.2","Mobile",49,409,438.11,5,199]
["2020-09-01","Campaign 5","Ad Group 5.2","Tablet",40,980,243,4,138]
["2020-09-01","Campaign 5","Ad Group 5.3","Desktop",100,1324,280.3,11,380]
["2020-09-01","Campaign 5","Ad Group 5.3","Mobile",43,397,154.16999999999999,4,182]
["2020-09-01","Campaign 5","Ad Group 5.3","Tablet",120,1300,409.6,13,449]
["2020-10-01","Campaign 1","Ad Group 1.1","Desktop",866,43702,408.26,138,4968]
["2020-10-01","Campaign 1","Ad Group 1.1","Mobile",372,13111,224.54,55,2385]
["2020-10-01","Campaign 1","Ad Group 1.1","Tablet",540,46200,187.8,69,2381]
["2020-10-01","Campaign 1","Ad Group 1.2","Desktop",24,284,33.96,2,66]
["2020-10-01","Campaign 1","Ad Group 1.2","Mobile",10,85,18.68,1,32]
["2020-10-01","Campaign 1","Ad Group 1.2","Tablet",0,120,0,0,0]
["2020-10-01","Campaign 1","Ad Group 1.3","Desktop",526,12502,735.06,65,2243]
["2020-10-01","Campaign 1","Ad Group 1.3","Mobile",226,3751,404.28,26,1077]
["2020-10-01","Campaign 1","Ad Group 1.3","Tablet",280,8760,545.6,34,1173]
["2020-10-01","Campaign 2","Ad Group 2.1","Desktop",314,2534,474.54,25,825]
["2020-10-01","Campaign 2","Ad Group 2.1","Mobile",135,760,261,10,396]
["2020-10-01","Campaign 2","Ad Group 2.1","Tablet",160,1660,243,14,462]
["2020-10-01","Campaign 2","Ad Group 2.2","Desktop",494,6658,402.58,55,1898]
["2020-10-01","Campaign 2","Ad Group 2.2","Mobile",212,1997,221.42,22,911]
["2020-10-01","Campaign 2","Ad Group 2.2","Tablet",180,3600,117.6,20,690]
["2020-10-01","Campaign 3","Ad Group 3.1","Desktop",56,190,171.58,3,99]
["2020-10-01","Campaign 3","Ad Group 3.1","Mobile",24,57,94.37,1,48]
["2020-10-01","Campaign 3","Ad Group 3.1","Tablet",20,120,6.4,1,32]
["2020-10-01","Campaign 4","Ad Group 4.1","Desktop",420,27132,482.36,57,2052]
["2020-10-01","Campaign 4","Ad Group 4.1","Tablet",340,22400,395,40,1380]
["2020-10-01","Campaign 4","Ad Group 4.2","Desktop",114,1254,197.14,7,231]
["2020-10-01","Campaign 4","Ad Group 4.2","Tablet",60,520,298.60000000000002,4,132]
["2020-10-01","Campaign 4","Ad Group 4.3","Desktop",290,8106,438.94,31,1070]
["2020-10-01","Campaign 4","Ad Group 4.3","Tablet",180,5240,260.2,18,621]
["2020-10-01","Campaign 5","Ad Group 5.1","Desktop",180,3966,257.32,28,1008]
["2020-10-01","Campaign 5","Ad Group 5.1","Mobile",77,1190,141.53,11,484]
["2020-10-01","Campaign 5","Ad Group 5.1","Tablet",120,5160,174.20000000000002,17,612]
["2020-10-01","Campaign 5","Ad Group 5.2","Desktop",72,940,481.4,7,242]
["2020-10-01","Campaign 5","Ad Group 5.2","Mobile",31,282,264.77,3,116]
["2020-10-01","Campaign 5","Ad Group 5.2","Tablet",180,1000,1241.4000000000001,15,495]
["2020-10-01","Campaign 5","Ad Group 5.3","Desktop",100,1702,338.12,11,380]
["2020-10-01","Campaign 5","Ad Group 5.3","Mobile",43,511,185.97,4,182]
["2020-10-01","Campaign 5","Ad Group 5.3","Tablet",100,1360,279.8,11,380]
["2020-11-01","Campaign 1","Ad Group 1.1","Desktop",480,26390,213.96,81,3038]
["2020-11-01","Campaign 1","Ad Group 1.1","Mobile",206,7917,117.68,32,1458]
["2020-11-01","Campaign 1","Ad Group 1.1","Tablet",280,29760,125.39999999999999,40,1440]
["2020-11-01","Campaign 1","Ad Group 1.2","Desktop",28,286,30.68,2,66]
["2020-11-01","Campaign 1","Ad Group 1.2","Mobile",12,86,16.87,1,32]
["2020-11-01","Campaign 1","Ad Group 1.2","Tablet",20,100,1,1,33]
["2020-11-01","Campaign 1","Ad Group 1.3","Desktop",374,8820,487.86,47,1622]
["2020-11-01","Campaign 1","Ad Group 1.3","Mobile",161,2646,268.32,19,779]
["2020-11-01","Campaign 1","Ad Group 1.3","Tablet",80,5040,181.20000000000002,10,345]
["2020-11-01","Campaign 2","Ad Group 2.1","Desktop",356,2522,499.84,29,957]
["2020-11-01","Campaign 2","Ad Group 2.1","Mobile",153,757,274.91000000000003,12,459]
["2020-11-01","Campaign 2","Ad Group 2.1","Tablet",100,1040,167.8,8,264]
["2020-11-01","Campaign 2","Ad Group 2.2","Desktop",438,5248,356.28,52,1794]
["2020-11-01","Campaign 2","Ad Group 2.2","Mobile",188,1574,195.95,21,861]
["2020-11-01","Campaign 2","Ad Group 2.2","Tablet",100,3360,105.19999999999999,11,380]
["2020-11-01","Campaign 3","Ad Group 3.1","Desktop",96,230,271.08,5,158]
["2020-11-01","Campaign 3","Ad Group 3.1","Mobile",41,69,149.09,2,76]
["2020-11-01","Campaign 3","Ad Group 3.1","Tablet",0,20,0,0,0]
["2020-11-01","Campaign 4","Ad Group 4.1","Desktop",368,26816,430.56,53,1908]
["2020-11-01","Campaign 4","Ad Group 4.1","Tablet",140,19420,151.80000000000001,17,587]
["2020-11-01","Campaign 4","Ad Group 4.2","Desktop",134,1350,196.72,8,264]
["2020-11-01","Campaign 4","Ad Group 4.2","Tablet",120,640,221.20000000000002,8,264]
["2020-11-01","Campaign 4","Ad Group 4.3","Desktop",346,6680,462.96,38,1311]
["2020-11-01","Campaign 4","Ad Group 4.3","Tablet",80,4960,193.4,10,345]
["2020-11-01","Campaign 5","Ad Group 5.1","Desktop",142,3520,202.3,24,900]
["2020-11-01","Campaign 5","Ad Group 5.1","Mobile",61,1056,111.27,10,432]
["2020-11-01","Campaign 5","Ad Group 5.1","Tablet",260,5120,453.8,41,1476]
["2020-11-01","Campaign 5","Ad Group 5.2","Desktop",58,758,443.68,5,165]
["2020-11-01","Campaign 5","Ad Group 5.2","Mobile",25,227,244.02,2,79]
["2020-11-01","Campaign 5","Ad Group 5.2","Tablet",80,560,587.4,7,231]
["2020-11-01","Campaign 5","Ad Group 5.3","Desktop",114,1658,404.44,13,449]
["2020-11-01","Campaign 5","Ad Group 5.3","Mobile",49,497,222.44,5,216]
["2020-11-01","Campaign 5","Ad Group 5.3","Tablet",80,1140,164.8,10,345]
["2020-12-01","Campaign 1","Ad Group 1.1","Desktop",192,11246,84.32,31,1116]
["2020-12-01","Campaign 1","Ad Group 1.1","Mobile",83,3374,46.38,12,536]
["2020-12-01","Campaign 1","Ad Group 1.1","Tablet",180,17860,76,26,936]
["2020-12-01","Campaign 1","Ad Group 1.2","Desktop",18,188,18.98,2,69]
["2020-12-01","Campaign 1","Ad Group 1.2","Mobile",8,56,10.44,1,33]
["2020-12-01","Campaign 1","Ad Group 1.2","Tablet",20,80,11.200000000000001,2,66]
["2020-12-01","Campaign 1","Ad Group 1.3","Desktop",164,3092,173.5,20,690]
["2020-12-01","Campaign 1","Ad Group 1.3","Mobile",71,928,95.43,8,331]
["2020-12-01","Campaign 1","Ad Group 1.3","Tablet",80,2040,66,10,345]
["2020-12-01","Campaign 2","Ad Group 2.1","Desktop",184,1512,235.52,18,621]
["2020-12-01","Campaign 2","Ad Group 2.1","Mobile",79,454,129.54,7,298]
["2020-12-01","Campaign 2","Ad Group 2.1","Tablet",80,820,30.2,8,276]
["2020-12-01","Campaign 2","Ad Group 2.2","Desktop",174,2400,118.92,22,759]
["2020-12-01","Campaign 2","Ad Group 2.2","Mobile",75,720,65.41,9,364]
["2020-12-01","Campaign 2","Ad Group 2.2","Tablet",120,1380,71.399999999999991,14,483]
["2020-12-01","Campaign 3","Ad Group 3.1","Desktop",58,142,169.48,4,132]
["2020-12-01","Campaign 3","Ad Group 3.1","Mobile",25,43,93.21,2,63]
["2020-12-01","Campaign 3","Ad Group 3.1","Tablet",0,80,0,0,0]
["2020-12-01","Campaign 4","Ad Group 4.1","Desktop",214,14584,302.45999999999998,31,1116]
["2020-12-01","Campaign 4","Ad Group 4.1","Tablet",140,14880,185.79999999999998,17,587]
["2020-12-01","Campaign 4","Ad Group 4.2","Desktop",38,556,66.94,2,66]
["2020-12-01","Campaign 4","Ad Group 4.2","Tablet",0,280,0,0,0]
["2020-12-01","Campaign 4","Ad Group 4.3","Desktop",186,3608,286.52,21,725]
["2020-12-01","Campaign 4","Ad Group 4.3","Tablet",160,3120,195.6,16,552]
["2020-12-01","Campaign 5","Ad Group 5.1","Desktop",36,1562,54.82,7,263]
["2020-12-01","Campaign 5","Ad Group 5.1","Mobile",15,469,30.15,3,126]
["2020-12-01","Campaign 5","Ad Group 5.1","Tablet",60,2820,62.599999999999994,9,324]
["2020-12-01","Campaign 5","Ad Group 5.2","Desktop",40,302,346.64,4,132]
["2020-12-01","Campaign 5","Ad Group 5.2","Mobile",17,91,190.65,2,63]
["2020-12-01","Campaign 5","Ad Group 5.2","Tablet",20,260,174.8,2,66]
["2020-12-01","Campaign 5","Ad Group 5.3","Desktop",64,932,238.68,9,324]
["2020-12-01","Campaign 5","Ad Group 5.3","Mobile",28,280,131.27000000000001,4,156]
["2020-12-01","Campaign 5","Ad Group 5.3","Tablet",100,840,353.6,12,414]
["2021-01-01","Campaign 1","Ad Group 1.1","Desktop",350,12740,215.68,63,2363]
["2021-01-01","Campaign 1","Ad Group 1.1","Mobile",151,3822,118.62,25,1134]
["2021-01-01","Campaign 1","Ad Group 1.1","Tablet",240,18400,139,38,1368]
["2021-01-01","Campaign 1","Ad Group 1.2","Desktop",22,218,21.42,2,66]
["2021-01-01","Campaign 1","Ad Group 1.2","Mobile",9,65,11.78,1,32]
["2021-01-01","Campaign 1","Ad Group 1.2","Tablet",0,140,0,0,0]
["2021-01-01","Campaign 1","Ad Group 1.3","Desktop",204,3500,268.72000000000003,22,759]
["2021-01-01","Campaign 1","Ad Group 1.3","Mobile",88,1050,147.80000000000001,9,364]
["2021-01-01","Campaign 1","Ad Group 1.3","Tablet",140,1960,253.6,15,518]
["2021-01-01","Campaign 2","Ad Group 2.1","Desktop",226,1712,328.2,18,594]
["2021-01-01","Campaign 2","Ad Group 2.1","Mobile",97,514,180.51,7,285]
["2021-01-01","Campaign 2","Ad Group 2.1","Tablet",120,840,176.4,9,297]
["2021-01-01","Campaign 2","Ad Group 2.2","Desktop",260,2602,219.54,29,1001]
["2021-01-01","Campaign 2","Ad Group 2.2","Mobile",112,781,120.75,12,480]
["2021-01-01","Campaign 2","Ad Group 2.2","Tablet",140,1920,89.600000000000009,15,518]
["2021-01-01","Campaign 3","Ad Group 3.1","Desktop",68,168,177.86,4,132]
["2021-01-01","Campaign 3","Ad Group 3.1","Mobile",29,50,97.82,2,63]
["2021-01-01","Campaign 3","Ad Group 3.1","Tablet",20,20,33.199999999999996,1,32]
["2021-01-01","Campaign 4","Ad Group 4.1","Desktop",240,25430,418.94,34,1224]
["2021-01-01","Campaign 4","Ad Group 4.1","Tablet",240,26040,383,30,1035]
["2021-01-01","Campaign 4","Ad Group 4.2","Desktop",80,850,160.12,5,165]
["2021-01-01","Campaign 4","Ad Group 4.2","Tablet",20,440,2.8000000000000003,2,66]
["2021-01-01","Campaign 4","Ad Group 4.3","Desktop",248,5628,406.44,30,1035]
["2021-01-01","Campaign 4","Ad Group 4.3","Tablet",160,6160,247.8,21,756]
["2021-01-01","Campaign 5","Ad Group 5.1","Desktop",210,2800,336.02,34,1224]
["2021-01-01","Campaign 5","Ad Group 5.1","Mobile",90,840,184.81,14,588]
["2021-01-01","Campaign 5","Ad Group 5.1","Tablet",120,4040,174.20000000000002,16,576]
["2021-01-01","Campaign 5","Ad Group 5.2","Desktop",30,346,161.97999999999999,2,66]
["2021-01-01","Campaign 5","Ad Group 5.2","Mobile",13,104,89.09,1,32]
["2021-01-01","Campaign 5","Ad Group 5.2","Tablet",20,220,180,1,33]
["2021-01-01","Campaign 5","Ad Group 5.3","Desktop",154,1424,525.86,15,518]
["2021-01-01","Campaign 5","Ad Group 5.3","Mobile",66,427,289.22000000000003,6,249]
["2021-01-01","Campaign 5","Ad Group 5.3","Tablet",220,1240,477.40000000000003,20,660]
["2021-02-01","Campaign 1","Ad Group 1.1","Desktop",244,4664,163.06,46,1725]
["2021-02-01","Campaign 1","Ad Group 1.1","Mobile",105,1399,89.68,18,828]
["2021-02-01","Campaign 1","Ad Group 1.1","Tablet",60,5180,53,10,360]
["2021-02-01","Campaign 1","Ad Group 1.2","Desktop",24,218,36.22,2,66]
["2021-02-01","Campaign 1","Ad Group 1.2","Mobile",10,65,19.920000000000002,1,32]
["2021-02-01","Campaign 1","Ad Group 1.2","Tablet",40,80,80.399999999999991,2,63]
["2021-02-01","Campaign 1","Ad Group 1.3","Desktop",108,1538,200.14,12,414]
["2021-02-01","Campaign 1","Ad Group 1.3","Mobile",46,461,110.08,5,199]
["2021-02-01","Campaign 1","Ad Group 1.3","Tablet",120,840,192.8,15,518]
["2021-02-01","Campaign 2","Ad Group 2.1","Desktop",244,1522,316.56,22,726]
["2021-02-01","Campaign 2","Ad Group 2.1","Mobile",105,457,174.11,9,348]
["2021-02-01","Campaign 2","Ad Group 2.1","Tablet",160,860,340.6,16,552]
["2021-02-01","Campaign 2","Ad Group 2.2","Desktop",314,2536,293.56,41,1415]
["2021-02-01","Campaign 2","Ad Group 2.2","Mobile",135,761,161.46,16,679]
["2021-02-01","Campaign 2","Ad Group 2.2","Tablet",180,1460,170.39999999999998,25,900]
["2021-02-01","Campaign 3","Ad Group 3.1","Desktop",38,126,70.739999999999995,2,66]
["2021-02-01","Campaign 3","Ad Group 3.1","Mobile",16,38,38.909999999999997,1,32]
["2021-02-01","Campaign 3","Ad Group 3.1","Tablet",0,60,0,0,0]
["2021-02-01","Campaign 4","Ad Group 4.1","Desktop",130,16312,258.77999999999997,21,756]
["2021-02-01","Campaign 4","Ad Group 4.1","Tablet",180,17140,281.60000000000002,26,936]
["2021-02-01","Campaign 4","Ad Group 4.2","Desktop",96,1162,183.08,6,198]
["2021-02-01","Campaign 4","Ad Group 4.2","Tablet",20,180,67.599999999999994,1,33]
["2021-02-01","Campaign 4","Ad Group 4.3","Desktop",246,4806,444.4,32,1152]
["2021-02-01","Campaign 4","Ad Group 4.3","Tablet",40,5000,49,6,216]
["2021-02-01","Campaign 5","Ad Group 5.1","Desktop",204,2296,286.7,33,1188]
["2021-02-01","Campaign 5","Ad Group 5.1","Mobile",88,689,157.69,13,570]
["2021-02-01","Campaign 5","Ad Group 5.1","Tablet",80,1960,125.19999999999999,11,396]
["2021-02-01","Campaign 5","Ad Group 5.2","Desktop",52,322,325.02,3,99]
["2021-02-01","Campaign 5","Ad Group 5.2","Mobile",22,97,178.76,1,48]
["2021-02-01","Campaign 5","Ad Group 5.2","Tablet",0,180,0,0,0]
["2021-02-01","Campaign 5","Ad Group 5.3","Desktop",192,1732,715.62,19,656]
["2021-02-01","Campaign 5","Ad Group 5.3","Mobile",83,520,393.59,8,315]
["2021-02-01","Campaign 5","Ad Group 5.3","Tablet",120,1260,328,8,264]
["2021-03-01","Campaign 1","Ad Group 1.1","Desktop",236,3688,138.88,41,1538]
["2021-03-01","Campaign 1","Ad Group 1.1","Mobile",101,1106,76.38,16,738]
["2021-03-01","Campaign 1","Ad Group 1.1","Tablet",340,5540,240.79999999999998,52,1872]
["2021-03-01","Campaign 1","Ad Group 1.2","Desktop",24,218,32.76,2,66]
["2021-03-01","Campaign 1","Ad Group 1.2","Mobile",10,65,18.02,1,32]
["2021-03-01","Campaign 1","Ad Group 1.2","Tablet",20,200,17.600000000000001,1,33]
["2021-03-01","Campaign 1","Ad Group 1.3","Desktop",170,2466,306.16000000000003,18,621]
["2021-03-01","Campaign 1","Ad Group 1.3","Mobile",73,740,168.39,7,298]
["2021-03-01","Campaign 1","Ad Group 1.3","Tablet",60,1380,95.600000000000009,6,198]
["2021-03-01","Campaign 2","Ad Group 2.1","Desktop",276,1670,288.44,21,693]
["2021-03-01","Campaign 2","Ad Group 2.1","Mobile",119,501,158.63999999999999,8,333]
["2021-03-01","Campaign 2","Ad Group 2.1","Tablet",120,840,171.6,10,330]
["2021-03-01","Campaign 2","Ad Group 2.2","Desktop",560,4302,442.54,59,2036]
["2021-03-01","Campaign 2","Ad Group 2.2","Mobile",241,1291,243.4,24,977]
["2021-03-01","Campaign 2","Ad Group 2.2","Tablet",420,3600,345.20000000000005,45,1553]
["2021-03-01","Campaign 3","Ad Group 3.1","Desktop",70,168,149.91999999999999,4,126]
["2021-03-01","Campaign 3","Ad Group 3.1","Mobile",30,50,82.46,2,60]
["2021-03-01","Campaign 4","Ad Group 4.1","Desktop",140,10642,283.3,23,828]
["2021-03-01","Campaign 4","Ad Group 4.1","Tablet",80,14420,224,12,432]
["2021-03-01","Campaign 4","Ad Group 4.2","Desktop",82,1046,245.36,6,198]
["2021-03-01","Campaign 4","Ad Group 4.2","Tablet",40,620,92.4,3,99]
["2021-03-01","Campaign 4","Ad Group 4.3","Desktop",144,2858,283.2,18,621]
["2021-03-01","Campaign 4","Ad Group 4.3","Tablet",20,2200,41.8,3,104]
["2021-03-01","Campaign 5","Ad Group 5.1","Desktop",110,1128,96.62,21,788]
["2021-03-01","Campaign 5","Ad Group 5.1","Mobile",47,338,53.14,8,378]
["2021-03-01","Campaign 5","Ad Group 5.1","Tablet",120,1080,87.8,21,788]
["2021-03-01","Campaign 5","Ad Group 5.2","Desktop",44,270,187.18,3,99]
["2021-03-01","Campaign 5","Ad Group 5.2","Mobile",19,81,102.95,1,48]
["2021-03-01","Campaign 5","Ad Group 5.2","Tablet",20,340,142.6,1,33]
["2021-03-01","Campaign 5","Ad Group 5.3","Desktop",166,1626,449.58,17,587]
["2021-03-01","Campaign 5","Ad Group 5.3","Mobile",71,488,247.27,7,282]
["2021-03-01","Campaign 5","Ad Group 5.3","Tablet",180,980,532,19,656]
["2021-04-01","Campaign 1","Ad Group 1.1","Desktop",94,1120,68.599999999999994,14,504]
["2021-04-01","Campaign 1","Ad Group 1.1","Mobile",40,336,37.729999999999997,6,242]
["2021-04-01","Campaign 1","Ad Group 1.1","Tablet",40,2080,20,5,173]
["2021-04-01","Campaign 1","Ad Group 1.2","Desktop",14,166,36.22,1,33]
["2021-04-01","Campaign 1","Ad Group 1.2","Mobile",6,50,19.920000000000002,0,16]
["2021-04-01","Campaign 1","Ad Group 1.2","Tablet",40,120,135.39999999999998,3,99]
["2021-04-01","Campaign 1","Ad Group 1.3","Desktop",100,1778,217.08,10,345]
["2021-04-01","Campaign 1","Ad Group 1.3","Mobile",43,533,119.39,4,166]
["2021-04-01","Campaign 1","Ad Group 1.3","Tablet",60,1620,133.6,5,165]
["2021-04-01","Campaign 2","Ad Group 2.1","Desktop",280,1420,332.62,23,759]
["2021-04-01","Campaign 2","Ad Group 2.1","Mobile",120,426,182.94,9,364]
["2021-04-01","Campaign 2","Ad Group 2.1","Tablet",180,860,204.4,17,587]
["2021-04-01","Campaign 2","Ad Group 2.2","Desktop",382,3142,351.78,42,1449]
["2021-04-01","Campaign 2","Ad Group 2.2","Mobile",164,943,193.48,17,696]
["2021-04-01","Campaign 2","Ad Group 2.2","Tablet",260,3300,256.39999999999998,28,966]
["2021-04-01","Campaign 3","Ad Group 3.1","Desktop",56,150,135.54,3,95]
["2021-04-01","Campaign 3","Ad Group 3.1","Mobile",24,45,74.55,1,46]
["2021-04-01","Campaign 3","Ad Group 3.1","Tablet",0,40,0,0,0]
["2021-04-01","Campaign 4","Ad Group 4.1","Desktop",37,1332,89.35,6,190]
["2021-04-01","Campaign 4","Ad Group 4.1","Tablet",10,1060,5.7,1,35]
["2021-04-01","Campaign 4","Ad Group 4.2","Desktop",64,878,164.25,4,132]
["2021-04-01","Campaign 4","Ad Group 4.2","Tablet",21,520,124.9,3,83]
["2021-04-01","Campaign 4","Ad Group 4.3","Desktop",16,660,42.35,4,121]
["2021-04-01","Campaign 4","Ad Group 4.3","Tablet",1,580,1.25,0,0]
["2021-04-01","Campaign 5","Ad Group 5.1","Desktop",126,1034,97.98,23,863]
["2021-04-01","Campaign 5","Ad Group 5.1","Mobile",54,310,53.89,9,414]
["2021-04-01","Campaign 5","Ad Group 5.1","Tablet",60,1200,40.199999999999996,10,360]
["2021-04-01","Campaign 5","Ad Group 5.2","Desktop",62,390,284.52,5,165]
["2021-04-01","Campaign 5","Ad Group 5.2","Mobile",27,117,156.49,2,79]
["2021-04-01","Campaign 5","Ad Group 5.2","Tablet",60,540,284,4,132]
["2021-04-01","Campaign 5","Ad Group 5.3","Desktop",136,1072,337.5,15,518]
["2021-04-01","Campaign 5","Ad Group 5.3","Mobile",58,322,185.63,6,249]
["2021-04-01","Campaign 5","Ad Group 5.3","Tablet",60,1000,157.6,5,165]

{"sheet":"Campaigns","index":5,"n_rows":11,"n_cols":13,"rows_kept":11,"cut":false,"hidden":true,"merged":[[1,11,1,12],[0,11,0,12]]}
["Google Adwords - Monthly Statistics",null,null,null,null,null,null,null,null,"Device:",null,"Select values to display:"]
["Campaigns",null,null,{"$f":"IF(AND($L$2=\"Cost\",$K$2=\"*\"),IF(ROUND(SUM(OFFSET($B$6,1,0,CampCount,COLUMN($M$5)-1)),2)=ROUND(SUMIFS(GCost,GDate,\"<=\"&$B$5,GDate,\">=\"&DATE(YEAR($M$5),MONTH($M$5),1)),2),\"ok\",\"error!\"),\"ok\")","v":"ok"},{"$f":"IF(ISERROR(FIND(\"*\",$H$2)),\"error!\",MID($H$2,FIND(\"*\",$H$2)+1,LEN($H$2)-FIND(\"*\",$H$2)))","v":"N0"},{"$f":"IF(ISERROR(FIND(\"-\",$H$2)),\"error!\",MID($H$2,1,FIND(\"-\",$H$2)-1))","v":"Cost"},{"$f":"IF(ISERROR(FIND(\"-\",$H$2)),\"error!\",IF(ISERROR(FIND(\"*\",$H$2)),\"error!\",MID($H$2,FIND(\"-\",$H$2)+1,FIND(\"*\",$H$2)-1-FIND(\"-\",$H$2))))","v":"None"},{"$f":"IF(ISNA(MATCH($L$2,CTypeList,0)),\"Cost-None*N0\",OFFSET(CamCharts!$A$4,-1,MATCH($L$2,CTypeList,0),1,1))","v":"Cost-None*N0"},null,null,{"$f":"IF(ISBLANK($J$2),\"*\",$J$2)","v":"*"},"Cost"]
["© www.excel-skills.com"]
[{"$f":"IF(ISBLANK($L$2),\"Total Cost: \",\"Total \"&$L$2&\": \")","v":"Total Cost: "},{"$f":"IF($G$2=\"None\",SUMIFS(INDIRECT(\"G\"&$F$2),GDate,\"<=\"&B$5,GDate,\">=\"&DATE(YEAR(B$5),MONTH(B$5),1),GDevice,$K$2),IF(SUMIFS(INDIRECT(\"G\"&$G$2),GDate,\"<=\"&B$5,GDate,\">=\"&DATE(YEAR(B$5),MONTH(B$5),1),GDevice,$K$2)=0,0,SUMIFS(INDIRECT(\"G\"&$F$2),GDate,\"<=\"&B$5,GDate,\">=\"&DATE(YEAR(B$5),MONTH(B$5),1),GDevice,$K$2)/SUMIFS(INDIRECT(\"G\"&$G$2),GDate,\"<=\"&B$5,GDate,\">=\"&DATE(YEAR(B$5),MONTH(B$5),1),GDevice,$K$2)))","v":4545.26},{"$f":"IF($G$2=\"None\",SUMIFS(INDIRECT(\"G\"&$F$2),GDate,\"<=\"&C$5,GDate,\">=\"&DATE(YEAR(C$5),MONTH(C$5),1),GDevice,$K$2),IF(SUMIFS(INDIRECT(\"G\"&$G$2),GDate,\"<=\"&C$5,GDate,\">=\"&DATE(YEAR(C$5),MONTH(C$5),1),GDevice,$K$2)=0,0,SUMIFS(INDIRECT(\"G\"&$F$2),GDate,\"<=\"&C$5,GDate,\">=\"&DATE(YEAR(C$5),MONTH(C$5),1),GDevice,$K$2)/SUMIFS(INDIRECT(\"G\"&$G$2),GDate,\"<=\"&C$5,GDate,\">=\"&DATE(YEAR(C$5),MONTH(C$5),1),GDevice,$K$2)))","v":6045.9900000000016},{"$f":"IF($G$2=\"None\",SUMIFS(INDIRECT(\"G\"&$F$2),GDate,\"<=\"&D$5,GDate,\">=\"&DATE(YEAR(D$5),MONTH(D$5),1),GDevice,$K$2),IF(SUMIFS(INDIRECT(\"G\"&$G$2),GDate,\"<=\"&D$5,GDate,\">=\"&DATE(YEAR(D$5),MONTH(D$5),1),GDevice,$K$2)=0,0,SUMIFS(INDIRECT(\"G\"&$F$2),GDate,\"<=\"&D$5,GDate,\">=\"&DATE(YEAR(D$5),MONTH(D$5),1),GDevice,$K$2)/SUMIFS(INDIRECT(\"G\"&$G$2),GDate,\"<=\"&D$5,GDate,\">=\"&DATE(YEAR(D$5),MONTH(D$5),1),GDevice,$K$2)))","v":6306.6799999999994},{"$f":"IF($G$2=\"None\",SUMIFS(INDIRECT(\"G\"&$F$2),GDate,\"<=\"&E$5,GDate,\">=\"&DATE(YEAR(E$5),MONTH(E$5),1),GDevice,$K$2),IF(SUMIFS(INDIRECT(\"G\"&$G$2),GDate,\"<=\"&E$5,GDate,\">=\"&DATE(YEAR(E$5),MONTH(E$5),1),GDevice,$K$2)=0,0,SUMIFS(INDIRECT(\"G\"&$F$2),GDate,\"<=\"&E$5,GDate,\">=\"&DATE(YEAR(E$5),MONTH(E$5),1),GDevice,$K$2)/SUMIFS(INDIRECT(\"G\"&$G$2),GDate,\"<=\"&E$5,GDate,\">=\"&DATE(YEAR(E$5),MONTH(E$5),1),GDevice,$K$2)))","v":6638.18},{"$f":"IF($G$2=\"None\",SUMIFS(INDIRECT(\"G\"&$F$2),GDate,\"<=\"&F$5,GDate,\">=\"&DATE(YEAR(F$5),MONTH(F$5),1),GDevice,$K$2),IF(SUMIFS(INDIRECT(\"G\"&$G$2),GDate,\"<=\"&F$5,GDate,\">=\"&DATE(YEAR(F$5),MONTH(F$5),1),GDevice,$K$2)=0,0,SUMIFS(INDIRECT(\"G\"&$F$2),GDate,\"<=\"&F$5,GDate,\">=\"&DATE(YEAR(F$5),MONTH(F$5),1),GDevice,$K$2)/SUMIFS(INDIRECT(\"G\"&$G$2),GDate,\"<=\"&F$5,GDate,\">=\"&DATE(YEAR(F$5),MONTH(F$5),1),GDevice,$K$2)))","v":4116.46},{"$f":"IF($G$2=\"None\",SUMIFS(INDIRECT(\"G\"&$F$2),GDate,\"<=\"&G$5,GDate,\">=\"&DATE(YEAR(G$5),MONTH(G$5),1),GDevice,$K$2),IF(SUMIFS(INDIRECT(\"G\"&$G$2),GDate,\"<=\"&G$5,GDate,\">=\"&DATE(YEAR(G$5),MONTH(G$5),1),GDevice,$K$2)=0,0,SUMIFS(INDIRECT(\"G\"&$F$2),GDate,\"<=\"&G$5,GDate,\">=\"&DATE(YEAR(G$5),MONTH(G$5),1),GDevice,$K$2)/SUMIFS(INDIRECT(\"G\"&$G$2),GDate,\"<=\"&G$5,GDate,\">=\"&DATE(YEAR(G$5),MONTH(G$5),1),GDevice,$K$2)))","v":7953.91},{"$f":"IF($G$2=\"None\",SUMIFS(INDIRECT(\"G\"&$F$2),GDate,\"<=\"&H$5,GDate,\">=\"&DATE(YEAR(H$5),MONTH(H$5),1),GDevice,$K$2),IF(SUMIFS(INDIRECT(\"G\"&$G$2),GDate,\"<=\"&H$5,GDate,\">=\"&DATE(YEAR(H$5),MONTH(H$5),1),GDevice,$K$2)=0,0,SUMIFS(INDIRECT(\"G\"&$F$2),GDate,\"<=\"&H$5,GDate,\">=\"&DATE(YEAR(H$5),MONTH(H$5),1),GDevice,$K$2)/SUMIFS(INDIRECT(\"G\"&$G$2),GDate,\"<=\"&H$5,GDate,\">=\"&DATE(YEAR(H$5),MONTH(H$5),1),GDevice,$K$2)))","v":9987.4199999999964},{"$f":"IF($G$2=\"None\",SUMIFS(INDIRECT(\"G\"&$F$2),GDate,\"<=\"&I$5,GDate,\">=\"&DATE(YEAR(I$5),MONTH(I$5),1),GDevice,$K$2),IF(SUMIFS(INDIRECT(\"G\"&$G$2),GDate,\"<=\"&I$5,GDate,\">=\"&DATE(YEAR(I$5),MONTH(I$5),1),GDevice,$K$2)=0,0,SUMIFS(INDIRECT(\"G\"&$F$2),GDate,\"<=\"&I$5,GDate,\">=\"&DATE(YEAR(I$5),MONTH(I$5),1),GDevice,$K$2)/SUMIFS(INDIRECT(\"G\"&$G$2),GDate,\"<=\"&I$5,GDate,\">=\"&DATE(YEAR(I$5),MONTH(I$5),1),GDevice,$K$2)))","v":8527.4},{"$f":"IF($G$2=\"None\",SUMIFS(INDIRECT(\"G\"&$F$2),GDate,\"<=\"&J$5,GDate,\">=\"&DATE(YEAR(J$5),MONTH(J$5),1),GDevice,$K$2),IF(SUMIFS(INDIRECT(\"G\"&$G$2),GDate,\"<=\"&J$5,GDate,\">=\"&DATE(YEAR(J$5),MONTH(J$5),1),GDevice,$K$2)=0,0,SUMIFS(INDIRECT(\"G\"&$F$2),GDate,\"<=\"&J$5,GDate,\">=\"&DATE(YEAR(J$5),MONTH(J$5),1),GDevice,$K$2)/SUMIFS(INDIRECT(\"G\"&$G$2),GDate,\"<=\"&J$5,GDate,\">=\"&DATE(YEAR(J$5),MONTH(J$5),1),GDevice,$K$2)))","v":8309.0300000000007},{"$f":"IF($G$2=\"None\",SUMIFS(INDIRECT(\"G\"&$F$2),GDate,\"<=\"&K$5,GDate,\">=\"&DATE(YEAR(K$5),MONTH(K$5),1),GDevice,$K$2),IF(SUMIFS(INDIRECT(\"G\"&$G$2),GDate,\"<=\"&K$5,GDate,\">=\"&DATE(YEAR(K$5),MONTH(K$5),1),GDevice,$K$2)=0,0,SUMIFS(INDIRECT(\"G\"&$F$2),GDate,\"<=\"&K$5,GDate,\">=\"&DATE(YEAR(K$5),MONTH(K$5),1),GDevice,$K$2)/SUMIFS(INDIRECT(\"G\"&$G$2),GDate,\"<=\"&K$5,GDate,\">=\"&DATE(YEAR(K$5),MONTH(K$5),1),GDevice,$K$2)))","v":8025.6399999999994},{"$f":"IF($G$2=\"None\",SUMIFS(INDIRECT(\"G\"&$F$2),GDate,\"<=\"&L$5,GDate,\">=\"&DATE(YEAR(L$5),MONTH(L$5),1),GDevice,$K$2),IF(SUMIFS(INDIRECT(\"G\"&$G$2),GDate,\"<=\"&L$5,GDate,\">=\"&DATE(YEAR(L$5),MONTH(L$5),1),GDevice,$K$2)=0,0,SUMIFS(INDIRECT(\"G\"&$F$2),GDate,\"<=\"&L$5,GDate,\">=\"&DATE(YEAR(L$5),MONTH(L$5),1),GDevice,$K$2)/SUMIFS(INDIRECT(\"G\"&$G$2),GDate,\"<=\"&L$5,GDate,\">=\"&DATE(YEAR(L$5),MONTH(L$5),1),GDevice,$K$2)))","v":10720.079999999998},{"$f":"IF($G$2=\"None\",SUMIFS(INDIRECT(\"G\"&$F$2),GDate,\"<=\"&M$5,GDate,\">=\"&DATE(YEAR(M$5),MONTH(M$5),1),GDevice,$K$2),IF(SUMIFS(INDIRECT(\"G\"&$G$2),GDate,\"<=\"&M$5,GDate,\">=\"&DATE(YEAR(M$5),MONTH(M$5),1),GDevice,$K$2)=0,0,SUMIFS(INDIRECT(\"G\"&$F$2),GDate,\"<=\"&M$5,GDate,\">=\"&DATE(YEAR(M$5),MONTH(M$5),1),GDevice,$K$2)/SUMIFS(INDIRECT(\"G\"&$G$2),GDate,\"<=\"&M$5,GDate,\">=\"&DATE(YEAR(M$5),MONTH(M$5),1),GDevice,$K$2)))","v":8134.9600000000009}]
["Month: ",{"$f":"DATE(YEAR(Setup!$B$4),MONTH(Setup!$B$4)+1,0)","v":"2021-04-30"},{"$f":"DATE(YEAR(B5),MONTH(B5),0)","v":"2021-03-31"},{"$f":"DATE(YEAR(C5),MONTH(C5),0)","v":"2021-02-28"},"2021-01-31","2020-12-31","2020-11-30","2020-10-31","2020-09-30","2020-08-31","2020-07-31","2020-06-30","2020-05-31"]
["Campaign Name","Period1","Period2","Period3","Period4","Period5","Period6","Period7","Period8","Period9","Period10","Period11","Period12"]
["Campaign 1",{"$f":"IF($G$2=\"None\",SUMIFS(INDIRECT(\"G\"&$F$2),GDate,\"<=\"&B$5,GDate,\">=\"&DATE(YEAR(B$5),MONTH(B$5),1),GCampaign,$A7,GDevice,$K$2),IF(SUMIFS(INDIRECT(\"G\"&$G$2),GDate,\"<=\"&B$5,GDate,\">=\"&DATE(YEAR(B$5),MONTH(B$5),1),GCampaign,$A7,GDevice,$K$2)=0,0,SUMIFS(INDIRECT(\"G\"&$F$2),GDate,\"<=\"&B$5,GDate,\">=\"&DATE(YEAR(B$5),MONTH(B$5),1),GCampaign,$A7,GDevice,$K$2)/SUMIFS(INDIRECT(\"G\"&$G$2),GDate,\"<=\"&B$5,GDate,\">=\"&DATE(YEAR(B$5),MONTH(B$5),1),GCampaign,$A7,GDevice,$K$2)))","v":787.93999999999994},{"$f":"IF($G$2=\"None\",SUMIFS(INDIRECT(\"G\"&$F$2),GDate,\"<=\"&C$5,GDate,\">=\"&DATE(YEAR(C$5),MONTH(C$5),1),GCampaign,$A7,GDevice,$K$2),IF(SUMIFS(INDIRECT(\"G\"&$G$2),GDate,\"<=\"&C$5,GDate,\">=\"&DATE(YEAR(C$5),MONTH(C$5),1),GCampaign,$A7,GDevice,$K$2)=0,0,SUMIFS(INDIRECT(\"G\"&$F$2),GDate,\"<=\"&C$5,GDate,\">=\"&DATE(YEAR(C$5),MONTH(C$5),1),GCampaign,$A7,GDevice,$K$2)/SUMIFS(INDIRECT(\"G\"&$G$2),GDate,\"<=\"&C$5,GDate,\">=\"&DATE(YEAR(C$5),MONTH(C$5),1),GCampaign,$A7,GDevice,$K$2)))","v":1094.5899999999999},{"$f":"IF($G$2=\"None\",SUMIFS(INDIRECT(\"G\"&$F$2),GDate,\"<=\"&D$5,GDate,\">=\"&DATE(YEAR(D$5),MONTH(D$5),1),GCampaign,$A7,GDevice,$K$2),IF(SUMIFS(INDIRECT(\"G\"&$G$2),GDate,\"<=\"&D$5,GDate,\">=\"&DATE(YEAR(D$5),MONTH(D$5),1),GCampaign,$A7,GDevice,$K$2)=0,0,SUMIFS(INDIRECT(\"G\"&$F$2),GDate,\"<=\"&D$5,GDate,\">=\"&DATE(YEAR(D$5),MONTH(D$5),1),GCampaign,$A7,GDevice,$K$2)/SUMIFS(INDIRECT(\"G\"&$G$2),GDate,\"<=\"&D$5,GDate,\">=\"&DATE(YEAR(D$5),MONTH(D$5),1),GCampaign,$A7,GDevice,$K$2)))","v":945.30000000000018},{"$f":"IF($G$2=\"None\",SUMIFS(INDIRECT(\"G\"&$F$2),GDate,\"<=\"&E$5,GDate,\">=\"&DATE(YEAR(E$5),MONTH(E$5),1),GCampaign,$A7,GDevice,$K$2),IF(SUMIFS(INDIRECT(\"G\"&$G$2),GDate,\"<=\"&E$5,GDate,\">=\"&DATE(YEAR(E$5),MONTH(E$5),1),GCampaign,$A7,GDevice,$K$2)=0,0,SUMIFS(INDIRECT(\"G\"&$F$2),GDate,\"<=\"&E$5,GDate,\">=\"&DATE(YEAR(E$5),MONTH(E$5),1),GCampaign,$A7,GDevice,$K$2)/SUMIFS(INDIRECT(\"G\"&$G$2),GDate,\"<=\"&E$5,GDate,\">=\"&DATE(YEAR(E$5),MONTH(E$5),1),GCampaign,$A7,GDevice,$K$2)))","v":1176.6199999999999},{"$f":"IF($G$2=\"None\",SUMIFS(INDIRECT(\"G\"&$F$2),GDate,\"<=\"&F$5,GDate,\">=\"&DATE(YEAR(F$5),MONTH(F$5),1),GCampaign,$A7,GDevice,$K$2),IF(SUMIFS(INDIRECT(\"G\"&$G$2),GDate,\"<=\"&F$5,GDate,\">=\"&DATE(YEAR(F$5),MONTH(F$5),1),GCampaign,$A7,GDevice,$K$2)=0,0,SUMIFS(INDIRECT(\"G\"&$F$2),GDate,\"<=\"&F$5,GDate,\">=\"&DATE(YEAR(F$5),MONTH(F$5),1),GCampaign,$A7,GDevice,$K$2)/SUMIFS(INDIRECT(\"G\"&$G$2),GDate,\"<=\"&F$5,GDate,\">=\"&DATE(YEAR(F$5),MONTH(F$5),1),GCampaign,$A7,GDevice,$K$2)))","v":582.25},{"$f":"IF($G$2=\"None\",SUMIFS(INDIRECT(\"G\"&$F$2),GDate,\"<=\"&G$5,GDate,\">=\"&DATE(YEAR(G$5),MONTH(G$5),1),GCampaign,$A7,GDevice,$K$2),IF(SUMIFS(INDIRECT(\"G\"&$G$2),GDate,\"<=\"&G$5,GDate,\">=\"&DATE(YEAR(G$5),MONTH(G$5),1),GCampaign,$A7,GDevice,$K$2)=0,0,SUMIFS(INDIRECT(\"G\"&$F$2),GDate,\"<=\"&G$5,GDate,\">=\"&DATE(YEAR(G$5),MONTH(G$5),1),GCampaign,$A7,GDevice,$K$2)/SUMIFS(INDIRECT(\"G\"&$G$2),GDate,\"<=\"&G$5,GDate,\">=\"&DATE(YEAR(G$5),MONTH(G$5),1),GCampaign,$A7,GDevice,$K$2)))","v":1442.97},{"$f":"IF($G$2=\"None\",SUMIFS(INDIRECT(\"G\"&$F$2),GDate,\"<=\"&H$5,GDate,\">=\"&DATE(YEAR(H$5),MONTH(H$5),1),GCampaign,$A7,GDevice,$K$2),IF(SUMIFS(INDIRECT(\"G\"&$G$2),GDate,\"<=\"&H$5,GDate,\">=\"&DATE(YEAR(H$5),MONTH(H$5),1),GCampaign,$A7,GDevice,$K$2)=0,0,SUMIFS(INDIRECT(\"G\"&$F$2),GDate,\"<=\"&H$5,GDate,\">=\"&DATE(YEAR(H$5),MONTH(H$5),1),GCampaign,$A7,GDevice,$K$2)/SUMIFS(INDIRECT(\"G\"&$G$2),GDate,\"<=\"&H$5,GDate,\">=\"&DATE(YEAR(H$5),MONTH(H$5),1),GCampaign,$A7,GDevice,$K$2)))","v":2558.1799999999998},{"$f":"IF($G$2=\"None\",SUMIFS(INDIRECT(\"G\"&$F$2),GDate,\"<=\"&I$5,GDate,\">=\"&DATE(YEAR(I$5),MONTH(I$5),1),GCampaign,$A7,GDevice,$K$2),IF(SUMIFS(INDIRECT(\"G\"&$G$2),GDate,\"<=\"&I$5,GDate,\">=\"&DATE(YEAR(I$5),MONTH(I$5),1),GCampaign,$A7,GDevice,$K$2)=0,0,SUMIFS(INDIRECT(\"G\"&$F$2),GDate,\"<=\"&I$5,GDate,\">=\"&DATE(YEAR(I$5),MONTH(I$5),1),GCampaign,$A7,GDevice,$K$2)/SUMIFS(INDIRECT(\"G\"&$G$2),GDate,\"<=\"&I$5,GDate,\">=\"&DATE(YEAR(I$5),MONTH(I$5),1),GCampaign,$A7,GDevice,$K$2)))","v":1916.15},{"$f":"IF($G$2=\"None\",SUMIFS(INDIRECT(\"G\"&$F$2),GDate,\"<=\"&J$5,GDate,\">=\"&DATE(YEAR(J$5),MONTH(J$5),1),GCampaign,$A7,GDevice,$K$2),IF(SUMIFS(INDIRECT(\"G\"&$G$2),GDate,\"<=\"&J$5,GDate,\">=\"&DATE(YEAR(J$5),MONTH(J$5),1),GCampaign,$A7,GDevice,$K$2)=0,0,SUMIFS(INDIRECT(\"G\"&$F$2),GDate,\"<=\"&J$5,GDate,\">=\"&DATE(YEAR(J$5),MONTH(J$5),1),GCampaign,$A7,GDevice,$K$2)/SUMIFS(INDIRECT(\"G\"&$G$2),GDate,\"<=\"&J$5,GDate,\">=\"&DATE(YEAR(J$5),MONTH(J$5),1),GCampaign,$A7,GDevice,$K$2)))","v":1868.33},{"$f":"IF($G$2=\"None\",SUMIFS(INDIRECT(\"G\"&$F$2),GDate,\"<=\"&K$5,GDate,\">=\"&DATE(YEAR(K$5),MONTH(K$5),1),GCampaign,$A7,GDevice,$K$2),IF(SUMIFS(INDIRECT(\"G\"&$G$2),GDate,\"<=\"&K$5,GDate,\">=\"&DATE(YEAR(K$5),MONTH(K$5),1),GCampaign,$A7,GDevice,$K$2)=0,0,SUMIFS(INDIRECT(\"G\"&$F$2),GDate,\"<=\"&K$5,GDate,\">=\"&DATE(YEAR(K$5),MONTH(K$5),1),GCampaign,$A7,GDevice,$K$2)/SUMIFS(INDIRECT(\"G\"&$G$2),GDate,\"<=\"&K$5,GDate,\">=\"&DATE(YEAR(K$5),MONTH(K$5),1),GCampaign,$A7,GDevice,$K$2)))","v":1873.56},{"$f":"IF($G$2=\"None\",SUMIFS(INDIRECT(\"G\"&$F$2),GDate,\"<=\"&L$5,GDate,\">=\"&DATE(YEAR(L$5),MONTH(L$5),1),GCampaign,$A7,GDevice,$K$2),IF(SUMIFS(INDIRECT(\"G\"&$G$2),GDate,\"<=\"&L$5,GDate,\">=\"&DATE(YEAR(L$5),MONTH(L$5),1),GCampaign,$A7,GDevice,$K$2)=0,0,SUMIFS(INDIRECT(\"G\"&$F$2),GDate,\"<=\"&L$5,GDate,\">=\"&DATE(YEAR(L$5),MONTH(L$5),1),GCampaign,$A7,GDevice,$K$2)/SUMIFS(INDIRECT(\"G\"&$G$2),GDate,\"<=\"&L$5,GDate,\">=\"&DATE(YEAR(L$5),MONTH(L$5),1),GCampaign,$A7,GDevice,$K$2)))","v":1769.43},{"$f":"IF($G$2=\"None\",SUMIFS(INDIRECT(\"G\"&$F$2),GDate,\"<=\"&M$5,GDate,\">=\"&DATE(YEAR(M$5),MONTH(M$5),1),GCampaign,$A7,GDevice,$K$2),IF(SUMIFS(INDIRECT(\"G\"&$G$2),GDate,\"<=\"&M$5,GDate,\">=\"&DATE(YEAR(M$5),MONTH(M$5),1),GCampaign,$A7,GDevice,$K$2)=0,0,SUMIFS(INDIRECT(\"G\"&$F$2),GDate,\"<=\"&M$5,GDate,\">=\"&DATE(YEAR(M$5),MONTH(M$5),1),GCampaign,$A7,GDevice,$K$2)/SUMIFS(INDIRECT(\"G\"&$G$2),GDate,\"<=\"&M$5,GDate,\">=\"&DATE(YEAR(M$5),MONTH(M$5),1),GCampaign,$A7,GDevice,$K$2)))","v":1144.73}]
["Campaign 2",{"$f":"IF($G$2=\"None\",SUMIFS(INDIRECT(\"G\"&$F$2),GDate,\"<=\"&B$5,GDate,\">=\"&DATE(YEAR(B$5),MONTH(B$5),1),GCampaign,$A8,GDevice,$K$2),IF(SUMIFS(INDIRECT(\"G\"&$G$2),GDate,\"<=\"&B$5,GDate,\">=\"&DATE(YEAR(B$5),MONTH(B$5),1),GCampaign,$A8,GDevice,$K$2)=0,0,SUMIFS(INDIRECT(\"G\"&$F$2),GDate,\"<=\"&B$5,GDate,\">=\"&DATE(YEAR(B$5),MONTH(B$5),1),GCampaign,$A8,GDevice,$K$2)/SUMIFS(INDIRECT(\"G\"&$G$2),GDate,\"<=\"&B$5,GDate,\">=\"&DATE(YEAR(B$5),MONTH(B$5),1),GCampaign,$A8,GDevice,$K$2)))","v":1521.62},{"$f":"IF($G$2=\"None\",SUMIFS(INDIRECT(\"G\"&$F$2),GDate,\"<=\"&C$5,GDate,\">=\"&DATE(YEAR(C$5),MONTH(C$5),1),GCampaign,$A8,GDevice,$K$2),IF(SUMIFS(INDIRECT(\"G\"&$G$2),GDate,\"<=\"&C$5,GDate,\">=\"&DATE(YEAR(C$5),MONTH(C$5),1),GCampaign,$A8,GDevice,$K$2)=0,0,SUMIFS(INDIRECT(\"G\"&$F$2),GDate,\"<=\"&C$5,GDate,\">=\"&DATE(YEAR(C$5),MONTH(C$5),1),GCampaign,$A8,GDevice,$K$2)/SUMIFS(INDIRECT(\"G\"&$G$2),GDate,\"<=\"&C$5,GDate,\">=\"&DATE(YEAR(C$5),MONTH(C$5),1),GCampaign,$A8,GDevice,$K$2)))","v":1649.8200000000002},{"$f":"IF($G$2=\"None\",SUMIFS(INDIRECT(\"G\"&$F$2),GDate,\"<=\"&D$5,GDate,\">=\"&DATE(YEAR(D$5),MONTH(D$5),1),GCampaign,$A8,GDevice,$K$2),IF(SUMIFS(INDIRECT(\"G\"&$G$2),GDate,\"<=\"&D$5,GDate,\">=\"&DATE(YEAR(D$5),MONTH(D$5),1),GCampaign,$A8,GDevice,$K$2)=0,0,SUMIFS(INDIRECT(\"G\"&$F$2),GDate,\"<=\"&D$5,GDate,\">=\"&DATE(YEAR(D$5),MONTH(D$5),1),GCampaign,$A8,GDevice,$K$2)/SUMIFS(INDIRECT(\"G\"&$G$2),GDate,\"<=\"&D$5,GDate,\">=\"&DATE(YEAR(D$5),MONTH(D$5),1),GCampaign,$A8,GDevice,$K$2)))","v":1456.69},{"$f":"IF($G$2=\"None\",SUMIFS(INDIRECT(\"G\"&$F$2),GDate,\"<=\"&E$5,GDate,\">=\"&DATE(YEAR(E$5),MONTH(E$5),1),GCampaign,$A8,GDevice,$K$2),IF(SUMIFS(INDIRECT(\"G\"&$G$2),GDate,\"<=\"&E$5,GDate,\">=\"&DATE(YEAR(E$5),MONTH(E$5),1),GCampaign,$A8,GDevice,$K$2)=0,0,SUMIFS(INDIRECT(\"G\"&$F$2),GDate,\"<=\"&E$5,GDate,\">=\"&DATE(YEAR(E$5),MONTH(E$5),1),GCampaign,$A8,GDevice,$K$2)/SUMIFS(INDIRECT(\"G\"&$G$2),GDate,\"<=\"&E$5,GDate,\">=\"&DATE(YEAR(E$5),MONTH(E$5),1),GCampaign,$A8,GDevice,$K$2)))","v":1115},{"$f":"IF($G$2=\"None\",SUMIFS(INDIRECT(\"G\"&$F$2),GDate,\"<=\"&F$5,GDate,\">=\"&DATE(YEAR(F$5),MONTH(F$5),1),GCampaign,$A8,GDevice,$K$2),IF(SUMIFS(INDIRECT(\"G\"&$G$2),GDate,\"<=\"&F$5,GDate,\">=\"&DATE(YEAR(F$5),MONTH(F$5),1),GCampaign,$A8,GDevice,$K$2)=0,0,SUMIFS(INDIRECT(\"G\"&$F$2),GDate,\"<=\"&F$5,GDate,\">=\"&DATE(YEAR(F$5),MONTH(F$5),1),GCampaign,$A8,GDevice,$K$2)/SUMIFS(INDIRECT(\"G\"&$G$2),GDate,\"<=\"&F$5,GDate,\">=\"&DATE(YEAR(F$5),MONTH(F$5),1),GCampaign,$A8,GDevice,$K$2)))","v":650.9899999999999},{"$f":"IF($G$2=\"None\",SUMIFS(INDIRECT(\"G\"&$F$2),GDate,\"<=\"&G$5,GDate,\">=\"&DATE(YEAR(G$5),MONTH(G$5),1),GCampaign,$A8,GDevice,$K$2),IF(SUMIFS(INDIRECT(\"G\"&$G$2),GDate,\"<=\"&G$5,GDate,\">=\"&DATE(YEAR(G$5),MONTH(G$5),1),GCampaign,$A8,GDevice,$K$2)=0,0,SUMIFS(INDIRECT(\"G\"&$F$2),GDate,\"<=\"&G$5,GDate,\">=\"&DATE(YEAR(G$5),MONTH(G$5),1),GCampaign,$A8,GDevice,$K$2)/SUMIFS(INDIRECT(\"G\"&$G$2),GDate,\"<=\"&G$5,GDate,\">=\"&DATE(YEAR(G$5),MONTH(G$5),1),GCampaign,$A8,GDevice,$K$2)))","v":1599.98},{"$f":"IF($G$2=\"None\",SUMIFS(INDIRECT(\"G\"&$F$2),GDate,\"<=\"&H$5,GDate,\">=\"&DATE(YEAR(H$5),MONTH(H$5),1),GCampaign,$A8,GDevice,$K$2),IF(SUMIFS(INDIRECT(\"G\"&$G$2),GDate,\"<=\"&H$5,GDate,\">=\"&DATE(YEAR(H$5),MONTH(H$5),1),GCampaign,$A8,GDevice,$K$2)=0,0,SUMIFS(INDIRECT(\"G\"&$F$2),GDate,\"<=\"&H$5,GDate,\">=\"&DATE(YEAR(H$5),MONTH(H$5),1),GCampaign,$A8,GDevice,$K$2)/SUMIFS(INDIRECT(\"G\"&$G$2),GDate,\"<=\"&H$5,GDate,\">=\"&DATE(YEAR(H$5),MONTH(H$5),1),GCampaign,$A8,GDevice,$K$2)))","v":1720.1399999999999},{"$f":"IF($G$2=\"None\",SUMIFS(INDIRECT(\"G\"&$F$2),GDate,\"<=\"&I$5,GDate,\">=\"&DATE(YEAR(I$5),MONTH(I$5),1),GCampaign,$A8,GDevice,$K$2),IF(SUMIFS(INDIRECT(\"G\"&$G$2),GDate,\"<=\"&I$5,GDate,\">=\"&DATE(YEAR(I$5),MONTH(I$5),1),GCampaign,$A8,GDevice,$K$2)=0,0,SUMIFS(INDIRECT(\"G\"&$F$2),GDate,\"<=\"&I$5,GDate,\">=\"&DATE(YEAR(I$5),MONTH(I$5),1),GCampaign,$A8,GDevice,$K$2)/SUMIFS(INDIRECT(\"G\"&$G$2),GDate,\"<=\"&I$5,GDate,\">=\"&DATE(YEAR(I$5),MONTH(I$5),1),GCampaign,$A8,GDevice,$K$2)))","v":1408.53},{"$f":"IF($G$2=\"None\",SUMIFS(INDIRECT(\"G\"&$F$2),GDate,\"<=\"&J$5,GDate,\">=\"&DATE(YEAR(J$5),MONTH(J$5),1),GCampaign,$A8,GDevice,$K$2),IF(SUMIFS(INDIRECT(\"G\"&$G$2),GDate,\"<=\"&J$5,GDate,\">=\"&DATE(YEAR(J$5),MONTH(J$5),1),GCampaign,$A8,GDevice,$K$2)=0,0,SUMIFS(INDIRECT(\"G\"&$F$2),GDate,\"<=\"&J$5,GDate,\">=\"&DATE(YEAR(J$5),MONTH(J$5),1),GCampaign,$A8,GDevice,$K$2)/SUMIFS(INDIRECT(\"G\"&$G$2),GDate,\"<=\"&J$5,GDate,\">=\"&DATE(YEAR(J$5),MONTH(J$5),1),GCampaign,$A8,GDevice,$K$2)))","v":1958.9499999999998},{"$f":"IF($G$2=\"None\",SUMIFS(INDIRECT(\"G\"&$F$2),GDate,\"<=\"&K$5,GDate,\">=\"&DATE(YEAR(K$5),MONTH(K$5),1),GCampaign,$A8,GDevice,$K$2),IF(SUMIFS(INDIRECT(\"G\"&$G$2),GDate,\"<=\"&K$5,GDate,\">=\"&DATE(YEAR(K$5),MONTH(K$5),1),GCampaign,$A8,GDevice,$K$2)=0,0,SUMIFS(INDIRECT(\"G\"&$F$2),GDate,\"<=\"&K$5,GDate,\">=\"&DATE(YEAR(K$5),MONTH(K$5),1),GCampaign,$A8,GDevice,$K$2)/SUMIFS(INDIRECT(\"G\"&$G$2),GDate,\"<=\"&K$5,GDate,\">=\"&DATE(YEAR(K$5),MONTH(K$5),1),GCampaign,$A8,GDevice,$K$2)))","v":1420.6799999999998},{"$f":"IF($G$2=\"None\",SUMIFS(INDIRECT(\"G\"&$F$2),GDate,\"<=\"&L$5,GDate,\">=\"&DATE(YEAR(L$5),MONTH(L$5),1),GCampaign,$A8,GDevice,$K$2),IF(SUMIFS(INDIRECT(\"G\"&$G$2),GDate,\"<=\"&L$5,GDate,\">=\"&DATE(YEAR(L$5),MONTH(L$5),1),GCampaign,$A8,GDevice,$K$2)=0,0,SUMIFS(INDIRECT(\"G\"&$F$2),GDate,\"<=\"&L$5,GDate,\">=\"&DATE(YEAR(L$5),MONTH(L$5),1),GCampaign,$A8,GDevice,$K$2)/SUMIFS(INDIRECT(\"G\"&$G$2),GDate,\"<=\"&L$5,GDate,\">=\"&DATE(YEAR(L$5),MONTH(L$5),1),GCampaign,$A8,GDevice,$K$2)))","v":2267.7800000000002},{"$f":"IF($G$2=\"None\",SUMIFS(INDIRECT(\"G\"&$F$2),GDate,\"<=\"&M$5,GDate,\">=\"&DATE(YEAR(M$5),MONTH(M$5),1),GCampaign,$A8,GDevice,$K$2),IF(SUMIFS(INDIRECT(\"G\"&$G$2),GDate,\"<=\"&M$5,GDate,\">=\"&DATE(YEAR(M$5),MONTH(M$5),1),GCampaign,$A8,GDevice,$K$2)=0,0,SUMIFS(INDIRECT(\"G\"&$F$2),GDate,\"<=\"&M$5,GDate,\">=\"&DATE(YEAR(M$5),MONTH(M$5),1),GCampaign,$A8,GDevice,$K$2)/SUMIFS(INDIRECT(\"G\"&$G$2),GDate,\"<=\"&M$5,GDate,\">=\"&DATE(YEAR(M$5),MONTH(M$5),1),GCampaign,$A8,GDevice,$K$2)))","v":1820.7200000000003}]
["Campaign 3",{"$f":"IF($G$2=\"None\",SUMIFS(INDIRECT(\"G\"&$F$2),GDate,\"<=\"&B$5,GDate,\">=\"&DATE(YEAR(B$5),MONTH(B$5),1),GCampaign,$A9,GDevice,$K$2),IF(SUMIFS(INDIRECT(\"G\"&$G$2),GDate,\"<=\"&B$5,GDate,\">=\"&DATE(YEAR(B$5),MONTH(B$5),1),GCampaign,$A9,GDevice,$K$2)=0,0,SUMIFS(INDIRECT(\"G\"&$F$2),GDate,\"<=\"&B$5,GDate,\">=\"&DATE(YEAR(B$5),MONTH(B$5),1),GCampaign,$A9,GDevice,$K$2)/SUMIFS(INDIRECT(\"G\"&$G$2),GDate,\"<=\"&B$5,GDate,\">=\"&DATE(YEAR(B$5),MONTH(B$5),1),GCampaign,$A9,GDevice,$K$2)))","v":210.08999999999997},{"$f":"IF($G$2=\"None\",SUMIFS(INDIRECT(\"G\"&$F$2),GDate,\"<=\"&C$5,GDate,\">=\"&DATE(YEAR(C$5),MONTH(C$5),1),GCampaign,$A9,GDevice,$K$2),IF(SUMIFS(INDIRECT(\"G\"&$G$2),GDate,\"<=\"&C$5,GDate,\">=\"&DATE(YEAR(C$5),MONTH(C$5),1),GCampaign,$A9,GDevice,$K$2)=0,0,SUMIFS(INDIRECT(\"G\"&$F$2),GDate,\"<=\"&C$5,GDate,\">=\"&DATE(YEAR(C$5),MONTH(C$5),1),GCampaign,$A9,GDevice,$K$2)/SUMIFS(INDIRECT(\"G\"&$G$2),GDate,\"<=\"&C$5,GDate,\">=\"&DATE(YEAR(C$5),MONTH(C$5),1),GCampaign,$A9,GDevice,$K$2)))","v":232.38},{"$f":"IF($G$2=\"None\",SUMIFS(INDIRECT(\"G\"&$F$2),GDate,\"<=\"&D$5,GDate,\">=\"&DATE(YEAR(D$5),MONTH(D$5),1),GCampaign,$A9,GDevice,$K$2),IF(SUMIFS(INDIRECT(\"G\"&$G$2),GDate,\"<=\"&D$5,GDate,\">=\"&DATE(YEAR(D$5),MONTH(D$5),1),GCampaign,$A9,GDevice,$K$2)=0,0,SUMIFS(INDIRECT(\"G\"&$F$2),GDate,\"<=\"&D$5,GDate,\">=\"&DATE(YEAR(D$5),MONTH(D$5),1),GCampaign,$A9,GDevice,$K$2)/SUMIFS(INDIRECT(\"G\"&$G$2),GDate,\"<=\"&D$5,GDate,\">=\"&DATE(YEAR(D$5),MONTH(D$5),1),GCampaign,$A9,GDevice,$K$2)))","v":109.64999999999999},{"$f":"IF($G$2=\"None\",SUMIFS(INDIRECT(\"G\"&$F$2),GDate,\"<=\"&E$5,GDate,\">=\"&DATE(YEAR(E$5),MONTH(E$5),1),GCampaign,$A9,GDevice,$K$2),IF(SUMIFS(INDIRECT(\"G\"&$G$2),GDate,\"<=\"&E$5,GDate,\">=\"&DATE(YEAR(E$5),MONTH(E$5),1),GCampaign,$A9,GDevice,$K$2)=0,0,SUMIFS(INDIRECT(\"G\"&$F$2),GDate,\"<=\"&E$5,GDate,\">=\"&DATE(YEAR(E$5),MONTH(E$5),1),GCampaign,$A9,GDevice,$K$2)/SUMIFS(INDIRECT(\"G\"&$G$2),GDate,\"<=\"&E$5,GDate,\">=\"&DATE(YEAR(E$5),MONTH(E$5),1),GCampaign,$A9,GDevice,$K$2)))","v":308.88},{"$f":"IF($G$2=\"None\",SUMIFS(INDIRECT(\"G\"&$F$2),GDate,\"<=\"&F$5,GDate,\">=\"&DATE(YEAR(F$5),MONTH(F$5),1),GCampaign,$A9,GDevice,$K$2),IF(SUMIFS(INDIRECT(\"G\"&$G$2),GDate,\"<=\"&F$5,GDate,\">=\"&DATE(YEAR(F$5),MONTH(F$5),1),GCampaign,$A9,GDevice,$K$2)=0,0,SUMIFS(INDIRECT(\"G\"&$F$2),GDate,\"<=\"&F$5,GDate,\">=\"&DATE(YEAR(F$5),MONTH(F$5),1),GCampaign,$A9,GDevice,$K$2)/SUMIFS(INDIRECT(\"G\"&$G$2),GDate,\"<=\"&F$5,GDate,\">=\"&DATE(YEAR(F$5),MONTH(F$5),1),GCampaign,$A9,GDevice,$K$2)))","v":262.69},{"$f":"IF($G$2=\"None\",SUMIFS(INDIRECT(\"G\"&$F$2),GDate,\"<=\"&G$5,GDate,\">=\"&DATE(YEAR(G$5),MONTH(G$5),1),GCampaign,$A9,GDevice,$K$2),IF(SUMIFS(INDIRECT(\"G\"&$G$2),GDate,\"<=\"&G$5,GDate,\">=\"&DATE(YEAR(G$5),MONTH(G$5),1),GCampaign,$A9,GDevice,$K$2)=0,0,SUMIFS(INDIRECT(\"G\"&$F$2),GDate,\"<=\"&G$5,GDate,\">=\"&DATE(YEAR(G$5),MONTH(G$5),1),GCampaign,$A9,GDevice,$K$2)/SUMIFS(INDIRECT(\"G\"&$G$2),GDate,\"<=\"&G$5,GDate,\">=\"&DATE(YEAR(G$5),MONTH(G$5),1),GCampaign,$A9,GDevice,$K$2)))","v":420.16999999999996},{"$f":"IF($G$2=\"None\",SUMIFS(INDIRECT(\"G\"&$F$2),GDate,\"<=\"&H$5,GDate,\">=\"&DATE(YEAR(H$5),MONTH(H$5),1),GCampaign,$A9,GDevice,$K$2),IF(SUMIFS(INDIRECT(\"G\"&$G$2),GDate,\"<=\"&H$5,GDate,\">=\"&DATE(YEAR(H$5),MONTH(H$5),1),GCampaign,$A9,GDevice,$K$2)=0,0,SUMIFS(INDIRECT(\"G\"&$F$2),GDate,\"<=\"&H$5,GDate,\">=\"&DATE(YEAR(H$5),MONTH(H$5),1),GCampaign,$A9,GDevice,$K$2)/SUMIFS(INDIRECT(\"G\"&$G$2),GDate,\"<=\"&H$5,GDate,\">=\"&DATE(YEAR(H$5),MONTH(H$5),1),GCampaign,$A9,GDevice,$K$2)))","v":272.35000000000002},{"$f":"IF($G$2=\"None\",SUMIFS(INDIRECT(\"G\"&$F$2),GDate,\"<=\"&I$5,GDate,\">=\"&DATE(YEAR(I$5),MONTH(I$5),1),GCampaign,$A9,GDevice,$K$2),IF(SUMIFS(INDIRECT(\"G\"&$G$2),GDate,\"<=\"&I$5,GDate,\">=\"&DATE(YEAR(I$5),MONTH(I$5),1),GCampaign,$A9,GDevice,$K$2)=0,0,SUMIFS(INDIRECT(\"G\"&$F$2),GDate,\"<=\"&I$5,GDate,\">=\"&DATE(YEAR(I$5),MONTH(I$5),1),GCampaign,$A9,GDevice,$K$2)/SUMIFS(INDIRECT(\"G\"&$G$2),GDate,\"<=\"&I$5,GDate,\">=\"&DATE(YEAR(I$5),MONTH(I$5),1),GCampaign,$A9,GDevice,$K$2)))","v":406.38},{"$f":"IF($G$2=\"None\",SUMIFS(INDIRECT(\"G\"&$F$2),GDate,\"<=\"&J$5,GDate,\">=\"&DATE(YEAR(J$5),MONTH(J$5),1),GCampaign,$A9,GDevice,$K$2),IF(SUMIFS(INDIRECT(\"G\"&$G$2),GDate,\"<=\"&J$5,GDate,\">=\"&DATE(YEAR(J$5),MONTH(J$5),1),GCampaign,$A9,GDevice,$K$2)=0,0,SUMIFS(INDIRECT(\"G\"&$F$2),GDate,\"<=\"&J$5,GDate,\">=\"&DATE(YEAR(J$5),MONTH(J$5),1),GCampaign,$A9,GDevice,$K$2)/SUMIFS(INDIRECT(\"G\"&$G$2),GDate,\"<=\"&J$5,GDate,\">=\"&DATE(YEAR(J$5),MONTH(J$5),1),GCampaign,$A9,GDevice,$K$2)))","v":415.25000000000006},{"$f":"IF($G$2=\"None\",SUMIFS(INDIRECT(\"G\"&$F$2),GDate,\"<=\"&K$5,GDate,\">=\"&DATE(YEAR(K$5),MONTH(K$5),1),GCampaign,$A9,GDevice,$K$2),IF(SUMIFS(INDIRECT(\"G\"&$G$2),GDate,\"<=\"&K$5,GDate,\">=\"&DATE(YEAR(K$5),MONTH(K$5),1),GCampaign,$A9,GDevice,$K$2)=0,0,SUMIFS(INDIRECT(\"G\"&$F$2),GDate,\"<=\"&K$5,GDate,\">=\"&DATE(YEAR(K$5),MONTH(K$5),1),GCampaign,$A9,GDevice,$K$2)/SUMIFS(INDIRECT(\"G\"&$G$2),GDate,\"<=\"&K$5,GDate,\">=\"&DATE(YEAR(K$5),MONTH(K$5),1),GCampaign,$A9,GDevice,$K$2)))","v":478.04},{"$f":"IF($G$2=\"None\",SUMIFS(INDIRECT(\"G\"&$F$2),GDate,\"<=\"&L$5,GDate,\">=\"&DATE(YEAR(L$5),MONTH(L$5),1),GCampaign,$A9,GDevice,$K$2),IF(SUMIFS(INDIRECT(\"G\"&$G$2),GDate,\"<=\"&L$5,GDate,\">=\"&DATE(YEAR(L$5),MONTH(L$5),1),GCampaign,$A9,GDevice,$K$2)=0,0,SUMIFS(INDIRECT(\"G\"&$F$2),GDate,\"<=\"&L$5,GDate,\">=\"&DATE(YEAR(L$5),MONTH(L$5),1),GCampaign,$A9,GDevice,$K$2)/SUMIFS(INDIRECT(\"G\"&$G$2),GDate,\"<=\"&L$5,GDate,\">=\"&DATE(YEAR(L$5),MONTH(L$5),1),GCampaign,$A9,GDevice,$K$2)))","v":444.32},{"$f":"IF($G$2=\"None\",SUMIFS(INDIRECT(\"G\"&$F$2),GDate,\"<=\"&M$5,GDate,\">=\"&DATE(YEAR(M$5),MONTH(M$5),1),GCampaign,$A9,GDevice,$K$2),IF(SUMIFS(INDIRECT(\"G\"&$G$2),GDate,\"<=\"&M$5,GDate,\">=\"&DATE(YEAR(M$5),MONTH(M$5),1),GCampaign,$A9,GDevice,$K$2)=0,0,SUMIFS(INDIRECT(\"G\"&$F$2),GDate,\"<=\"&M$5,GDate,\">=\"&DATE(YEAR(M$5),MONTH(M$5),1),GCampaign,$A9,GDevice,$K$2)/SUMIFS(INDIRECT(\"G\"&$G$2),GDate,\"<=\"&M$5,GDate,\">=\"&DATE(YEAR(M$5),MONTH(M$5),1),GCampaign,$A9,GDevice,$K$2)))","v":310.64999999999998}]
["Campaign 4",{"$f":"IF($G$2=\"None\",SUMIFS(INDIRECT(\"G\"&$F$2),GDate,\"<=\"&B$5,GDate,\">=\"&DATE(YEAR(B$5),MONTH(B$5),1),GCampaign,$A10,GDevice,$K$2),IF(SUMIFS(INDIRECT(\"G\"&$G$2),GDate,\"<=\"&B$5,GDate,\">=\"&DATE(YEAR(B$5),MONTH(B$5),1),GCampaign,$A10,GDevice,$K$2)=0,0,SUMIFS(INDIRECT(\"G\"&$F$2),GDate,\"<=\"&B$5,GDate,\">=\"&DATE(YEAR(B$5),MONTH(B$5),1),GCampaign,$A10,GDevice,$K$2)/SUMIFS(INDIRECT(\"G\"&$G$2),GDate,\"<=\"&B$5,GDate,\">=\"&DATE(YEAR(B$5),MONTH(B$5),1),GCampaign,$A10,GDevice,$K$2)))","v":427.80000000000007},{"$f":"IF($G$2=\"None\",SUMIFS(INDIRECT(\"G\"&$F$2),GDate,\"<=\"&C$5,GDate,\">=\"&DATE(YEAR(C$5),MONTH(C$5),1),GCampaign,$A10,GDevice,$K$2),IF(SUMIFS(INDIRECT(\"G\"&$G$2),GDate,\"<=\"&C$5,GDate,\">=\"&DATE(YEAR(C$5),MONTH(C$5),1),GCampaign,$A10,GDevice,$K$2)=0,0,SUMIFS(INDIRECT(\"G\"&$F$2),GDate,\"<=\"&C$5,GDate,\">=\"&DATE(YEAR(C$5),MONTH(C$5),1),GCampaign,$A10,GDevice,$K$2)/SUMIFS(INDIRECT(\"G\"&$G$2),GDate,\"<=\"&C$5,GDate,\">=\"&DATE(YEAR(C$5),MONTH(C$5),1),GCampaign,$A10,GDevice,$K$2)))","v":1170.06},{"$f":"IF($G$2=\"None\",SUMIFS(INDIRECT(\"G\"&$F$2),GDate,\"<=\"&D$5,GDate,\">=\"&DATE(YEAR(D$5),MONTH(D$5),1),GCampaign,$A10,GDevice,$K$2),IF(SUMIFS(INDIRECT(\"G\"&$G$2),GDate,\"<=\"&D$5,GDate,\">=\"&DATE(YEAR(D$5),MONTH(D$5),1),GCampaign,$A10,GDevice,$K$2)=0,0,SUMIFS(INDIRECT(\"G\"&$F$2),GDate,\"<=\"&D$5,GDate,\">=\"&DATE(YEAR(D$5),MONTH(D$5),1),GCampaign,$A10,GDevice,$K$2)/SUMIFS(INDIRECT(\"G\"&$G$2),GDate,\"<=\"&D$5,GDate,\">=\"&DATE(YEAR(D$5),MONTH(D$5),1),GCampaign,$A10,GDevice,$K$2)))","v":1284.46},{"$f":"IF($G$2=\"None\",SUMIFS(INDIRECT(\"G\"&$F$2),GDate,\"<=\"&E$5,GDate,\">=\"&DATE(YEAR(E$5),MONTH(E$5),1),GCampaign,$A10,GDevice,$K$2),IF(SUMIFS(INDIRECT(\"G\"&$G$2),GDate,\"<=\"&E$5,GDate,\">=\"&DATE(YEAR(E$5),MONTH(E$5),1),GCampaign,$A10,GDevice,$K$2)=0,0,SUMIFS(INDIRECT(\"G\"&$F$2),GDate,\"<=\"&E$5,GDate,\">=\"&DATE(YEAR(E$5),MONTH(E$5),1),GCampaign,$A10,GDevice,$K$2)/SUMIFS(INDIRECT(\"G\"&$G$2),GDate,\"<=\"&E$5,GDate,\">=\"&DATE(YEAR(E$5),MONTH(E$5),1),GCampaign,$A10,GDevice,$K$2)))","v":1619.1},{"$f":"IF($G$2=\"None\",SUMIFS(INDIRECT(\"G\"&$F$2),GDate,\"<=\"&F$5,GDate,\">=\"&DATE(YEAR(F$5),MONTH(F$5),1),GCampaign,$A10,GDevice,$K$2),IF(SUMIFS(INDIRECT(\"G\"&$G$2),GDate,\"<=\"&F$5,GDate,\">=\"&DATE(YEAR(F$5),MONTH(F$5),1),GCampaign,$A10,GDevice,$K$2)=0,0,SUMIFS(INDIRECT(\"G\"&$F$2),GDate,\"<=\"&F$5,GDate,\">=\"&DATE(YEAR(F$5),MONTH(F$5),1),GCampaign,$A10,GDevice,$K$2)/SUMIFS(INDIRECT(\"G\"&$G$2),GDate,\"<=\"&F$5,GDate,\">=\"&DATE(YEAR(F$5),MONTH(F$5),1),GCampaign,$A10,GDevice,$K$2)))","v":1037.32},{"$f":"IF($G$2=\"None\",SUMIFS(INDIRECT(\"G\"&$F$2),GDate,\"<=\"&G$5,GDate,\">=\"&DATE(YEAR(G$5),MONTH(G$5),1),GCampaign,$A10,GDevice,$K$2),IF(SUMIFS(INDIRECT(\"G\"&$G$2),GDate,\"<=\"&G$5,GDate,\">=\"&DATE(YEAR(G$5),MONTH(G$5),1),GCampaign,$A10,GDevice,$K$2)=0,0,SUMIFS(INDIRECT(\"G\"&$F$2),GDate,\"<=\"&G$5,GDate,\">=\"&DATE(YEAR(G$5),MONTH(G$5),1),GCampaign,$A10,GDevice,$K$2)/SUMIFS(INDIRECT(\"G\"&$G$2),GDate,\"<=\"&G$5,GDate,\">=\"&DATE(YEAR(G$5),MONTH(G$5),1),GCampaign,$A10,GDevice,$K$2)))","v":1656.64},{"$f":"IF($G$2=\"None\",SUMIFS(INDIRECT(\"G\"&$F$2),GDate,\"<=\"&H$5,GDate,\">=\"&DATE(YEAR(H$5),MONTH(H$5),1),GCampaign,$A10,GDevice,$K$2),IF(SUMIFS(INDIRECT(\"G\"&$G$2),GDate,\"<=\"&H$5,GDate,\">=\"&DATE(YEAR(H$5),MONTH(H$5),1),GCampaign,$A10,GDevice,$K$2)=0,0,SUMIFS(INDIRECT(\"G\"&$F$2),GDate,\"<=\"&H$5,GDate,\">=\"&DATE(YEAR(H$5),MONTH(H$5),1),GCampaign,$A10,GDevice,$K$2)/SUMIFS(INDIRECT(\"G\"&$G$2),GDate,\"<=\"&H$5,GDate,\">=\"&DATE(YEAR(H$5),MONTH(H$5),1),GCampaign,$A10,GDevice,$K$2)))","v":2072.2399999999998},{"$f":"IF($G$2=\"None\",SUMIFS(INDIRECT(\"G\"&$F$2),GDate,\"<=\"&I$5,GDate,\">=\"&DATE(YEAR(I$5),MONTH(I$5),1),GCampaign,$A10,GDevice,$K$2),IF(SUMIFS(INDIRECT(\"G\"&$G$2),GDate,\"<=\"&I$5,GDate,\">=\"&DATE(YEAR(I$5),MONTH(I$5),1),GCampaign,$A10,GDevice,$K$2)=0,0,SUMIFS(INDIRECT(\"G\"&$F$2),GDate,\"<=\"&I$5,GDate,\">=\"&DATE(YEAR(I$5),MONTH(I$5),1),GCampaign,$A10,GDevice,$K$2)/SUMIFS(INDIRECT(\"G\"&$G$2),GDate,\"<=\"&I$5,GDate,\">=\"&DATE(YEAR(I$5),MONTH(I$5),1),GCampaign,$A10,GDevice,$K$2)))","v":1870.2200000000003},{"$f":"IF($G$2=\"None\",SUMIFS(INDIRECT(\"G\"&$F$2),GDate,\"<=\"&J$5,GDate,\">=\"&DATE(YEAR(J$5),MONTH(J$5),1),GCampaign,$A10,GDevice,$K$2),IF(SUMIFS(INDIRECT(\"G\"&$G$2),GDate,\"<=\"&J$5,GDate,\">=\"&DATE(YEAR(J$5),MONTH(J$5),1),GCampaign,$A10,GDevice,$K$2)=0,0,SUMIFS(INDIRECT(\"G\"&$F$2),GDate,\"<=\"&J$5,GDate,\">=\"&DATE(YEAR(J$5),MONTH(J$5),1),GCampaign,$A10,GDevice,$K$2)/SUMIFS(INDIRECT(\"G\"&$G$2),GDate,\"<=\"&J$5,GDate,\">=\"&DATE(YEAR(J$5),MONTH(J$5),1),GCampaign,$A10,GDevice,$K$2)))","v":1463.74},{"$f":"IF($G$2=\"None\",SUMIFS(INDIRECT(\"G\"&$F$2),GDate,\"<=\"&K$5,GDate,\">=\"&DATE(YEAR(K$5),MONTH(K$5),1),GCampaign,$A10,GDevice,$K$2),IF(SUMIFS(INDIRECT(\"G\"&$G$2),GDate,\"<=\"&K$5,GDate,\">=\"&DATE(YEAR(K$5),MONTH(K$5),1),GCampaign,$A10,GDevice,$K$2)=0,0,SUMIFS(INDIRECT(\"G\"&$F$2),GDate,\"<=\"&K$5,GDate,\">=\"&DATE(YEAR(K$5),MONTH(K$5),1),GCampaign,$A10,GDevice,$K$2)/SUMIFS(INDIRECT(\"G\"&$G$2),GDate,\"<=\"&K$5,GDate,\">=\"&DATE(YEAR(K$5),MONTH(K$5),1),GCampaign,$A10,GDevice,$K$2)))","v":1571.42},{"$f":"IF($G$2=\"None\",SUMIFS(INDIRECT(\"G\"&$F$2),GDate,\"<=\"&L$5,GDate,\">=\"&DATE(YEAR(L$5),MONTH(L$5),1),GCampaign,$A10,GDevice,$K$2),IF(SUMIFS(INDIRECT(\"G\"&$G$2),GDate,\"<=\"&L$5,GDate,\">=\"&DATE(YEAR(L$5),MONTH(L$5),1),GCampaign,$A10,GDevice,$K$2)=0,0,SUMIFS(INDIRECT(\"G\"&$F$2),GDate,\"<=\"&L$5,GDate,\">=\"&DATE(YEAR(L$5),MONTH(L$5),1),GCampaign,$A10,GDevice,$K$2)/SUMIFS(INDIRECT(\"G\"&$G$2),GDate,\"<=\"&L$5,GDate,\">=\"&DATE(YEAR(L$5),MONTH(L$5),1),GCampaign,$A10,GDevice,$K$2)))","v":1536.2},{"$f":"IF($G$2=\"None\",SUMIFS(INDIRECT(\"G\"&$F$2),GDate,\"<=\"&M$5,GDate,\">=\"&DATE(YEAR(M$5),MONTH(M$5),1),GCampaign,$A10,GDevice,$K$2),IF(SUMIFS(INDIRECT(\"G\"&$G$2),GDate,\"<=\"&M$5,GDate,\">=\"&DATE(YEAR(M$5),MONTH(M$5),1),GCampaign,$A10,GDevice,$K$2)=0,0,SUMIFS(INDIRECT(\"G\"&$F$2),GDate,\"<=\"&M$5,GDate,\">=\"&DATE(YEAR(M$5),MONTH(M$5),1),GCampaign,$A10,GDevice,$K$2)/SUMIFS(INDIRECT(\"G\"&$G$2),GDate,\"<=\"&M$5,GDate,\">=\"&DATE(YEAR(M$5),MONTH(M$5),1),GCampaign,$A10,GDevice,$K$2)))","v":745.06}]
["Campaign 5",{"$f":"IF($G$2=\"None\",SUMIFS(INDIRECT(\"G\"&$F$2),GDate,\"<=\"&B$5,GDate,\">=\"&DATE(YEAR(B$5),MONTH(B$5),1),GCampaign,$A11,GDevice,$K$2),IF(SUMIFS(INDIRECT(\"G\"&$G$2),GDate,\"<=\"&B$5,GDate,\">=\"&DATE(YEAR(B$5),MONTH(B$5),1),GCampaign,$A11,GDevice,$K$2)=0,0,SUMIFS(INDIRECT(\"G\"&$F$2),GDate,\"<=\"&B$5,GDate,\">=\"&DATE(YEAR(B$5),MONTH(B$5),1),GCampaign,$A11,GDevice,$K$2)/SUMIFS(INDIRECT(\"G\"&$G$2),GDate,\"<=\"&B$5,GDate,\">=\"&DATE(YEAR(B$5),MONTH(B$5),1),GCampaign,$A11,GDevice,$K$2)))","v":1597.81},{"$f":"IF($G$2=\"None\",SUMIFS(INDIRECT(\"G\"&$F$2),GDate,\"<=\"&C$5,GDate,\">=\"&DATE(YEAR(C$5),MONTH(C$5),1),GCampaign,$A11,GDevice,$K$2),IF(SUMIFS(INDIRECT(\"G\"&$G$2),GDate,\"<=\"&C$5,GDate,\">=\"&DATE(YEAR(C$5),MONTH(C$5),1),GCampaign,$A11,GDevice,$K$2)=0,0,SUMIFS(INDIRECT(\"G\"&$F$2),GDate,\"<=\"&C$5,GDate,\">=\"&DATE(YEAR(C$5),MONTH(C$5),1),GCampaign,$A11,GDevice,$K$2)/SUMIFS(INDIRECT(\"G\"&$G$2),GDate,\"<=\"&C$5,GDate,\">=\"&DATE(YEAR(C$5),MONTH(C$5),1),GCampaign,$A11,GDevice,$K$2)))","v":1899.14},{"$f":"IF($G$2=\"None\",SUMIFS(INDIRECT(\"G\"&$F$2),GDate,\"<=\"&D$5,GDate,\">=\"&DATE(YEAR(D$5),MONTH(D$5),1),GCampaign,$A11,GDevice,$K$2),IF(SUMIFS(INDIRECT(\"G\"&$G$2),GDate,\"<=\"&D$5,GDate,\">=\"&DATE(YEAR(D$5),MONTH(D$5),1),GCampaign,$A11,GDevice,$K$2)=0,0,SUMIFS(INDIRECT(\"G\"&$F$2),GDate,\"<=\"&D$5,GDate,\">=\"&DATE(YEAR(D$5),MONTH(D$5),1),GCampaign,$A11,GDevice,$K$2)/SUMIFS(INDIRECT(\"G\"&$G$2),GDate,\"<=\"&D$5,GDate,\">=\"&DATE(YEAR(D$5),MONTH(D$5),1),GCampaign,$A11,GDevice,$K$2)))","v":2510.58},{"$f":"IF($G$2=\"None\",SUMIFS(INDIRECT(\"G\"&$F$2),GDate,\"<=\"&E$5,GDate,\">=\"&DATE(YEAR(E$5),MONTH(E$5),1),GCampaign,$A11,GDevice,$K$2),IF(SUMIFS(INDIRECT(\"G\"&$G$2),GDate,\"<=\"&E$5,GDate,\">=\"&DATE(YEAR(E$5),MONTH(E$5),1),GCampaign,$A11,GDevice,$K$2)=0,0,SUMIFS(INDIRECT(\"G\"&$F$2),GDate,\"<=\"&E$5,GDate,\">=\"&DATE(YEAR(E$5),MONTH(E$5),1),GCampaign,$A11,GDevice,$K$2)/SUMIFS(INDIRECT(\"G\"&$G$2),GDate,\"<=\"&E$5,GDate,\">=\"&DATE(YEAR(E$5),MONTH(E$5),1),GCampaign,$A11,GDevice,$K$2)))","v":2418.58},{"$f":"IF($G$2=\"None\",SUMIFS(INDIRECT(\"G\"&$F$2),GDate,\"<=\"&F$5,GDate,\">=\"&DATE(YEAR(F$5),MONTH(F$5),1),GCampaign,$A11,GDevice,$K$2),IF(SUMIFS(INDIRECT(\"G\"&$G$2),GDate,\"<=\"&F$5,GDate,\">=\"&DATE(YEAR(F$5),MONTH(F$5),1),GCampaign,$A11,GDevice,$K$2)=0,0,SUMIFS(INDIRECT(\"G\"&$F$2),GDate,\"<=\"&F$5,GDate,\">=\"&DATE(YEAR(F$5),MONTH(F$5),1),GCampaign,$A11,GDevice,$K$2)/SUMIFS(INDIRECT(\"G\"&$G$2),GDate,\"<=\"&F$5,GDate,\">=\"&DATE(YEAR(F$5),MONTH(F$5),1),GCampaign,$A11,GDevice,$K$2)))","v":1583.21},{"$f":"IF($G$2=\"None\",SUMIFS(INDIRECT(\"G\"&$F$2),GDate,\"<=\"&G$5,GDate,\">=\"&DATE(YEAR(G$5),MONTH(G$5),1),GCampaign,$A11,GDevice,$K$2),IF(SUMIFS(INDIRECT(\"G\"&$G$2),GDate,\"<=\"&G$5,GDate,\">=\"&DATE(YEAR(G$5),MONTH(G$5),1),GCampaign,$A11,GDevice,$K$2)=0,0,SUMIFS(INDIRECT(\"G\"&$F$2),GDate,\"<=\"&G$5,GDate,\">=\"&DATE(YEAR(G$5),MONTH(G$5),1),GCampaign,$A11,GDevice,$K$2)/SUMIFS(INDIRECT(\"G\"&$G$2),GDate,\"<=\"&G$5,GDate,\">=\"&DATE(YEAR(G$5),MONTH(G$5),1),GCampaign,$A11,GDevice,$K$2)))","v":2834.15},{"$f":"IF($G$2=\"None\",SUMIFS(INDIRECT(\"G\"&$F$2),GDate,\"<=\"&H$5,GDate,\">=\"&DATE(YEAR(H$5),MONTH(H$5),1),GCampaign,$A11,GDevice,$K$2),IF(SUMIFS(INDIRECT(\"G\"&$G$2),GDate,\"<=\"&H$5,GDate,\">=\"&DATE(YEAR(H$5),MONTH(H$5),1),GCampaign,$A11,GDevice,$K$2)=0,0,SUMIFS(INDIRECT(\"G\"&$F$2),GDate,\"<=\"&H$5,GDate,\">=\"&DATE(YEAR(H$5),MONTH(H$5),1),GCampaign,$A11,GDevice,$K$2)/SUMIFS(INDIRECT(\"G\"&$G$2),GDate,\"<=\"&H$5,GDate,\">=\"&DATE(YEAR(H$5),MONTH(H$5),1),GCampaign,$A11,GDevice,$K$2)))","v":3364.5099999999998},{"$f":"IF($G$2=\"None\",SUMIFS(INDIRECT(\"G\"&$F$2),GDate,\"<=\"&I$5,GDate,\">=\"&DATE(YEAR(I$5),MONTH(I$5),1),GCampaign,$A11,GDevice,$K$2),IF(SUMIFS(INDIRECT(\"G\"&$G$2),GDate,\"<=\"&I$5,GDate,\">=\"&DATE(YEAR(I$5),MONTH(I$5),1),GCampaign,$A11,GDevice,$K$2)=0,0,SUMIFS(INDIRECT(\"G\"&$F$2),GDate,\"<=\"&I$5,GDate,\">=\"&DATE(YEAR(I$5),MONTH(I$5),1),GCampaign,$A11,GDevice,$K$2)/SUMIFS(INDIRECT(\"G\"&$G$2),GDate,\"<=\"&I$5,GDate,\">=\"&DATE(YEAR(I$5),MONTH(I$5),1),GCampaign,$A11,GDevice,$K$2)))","v":2926.1200000000003},{"$f":"IF($G$2=\"None\",SUMIFS(INDIRECT(\"G\"&$F$2),GDate,\"<=\"&J$5,GDate,\">=\"&DATE(YEAR(J$5),MONTH(J$5),1),GCampaign,$A11,GDevice,$K$2),IF(SUMIFS(INDIRECT(\"G\"&$G$2),GDate,\"<=\"&J$5,GDate,\">=\"&DATE(YEAR(J$5),MONTH(J$5),1),GCampaign,$A11,GDevice,$K$2)=0,0,SUMIFS(INDIRECT(\"G\"&$F$2),GDate,\"<=\"&J$5,GDate,\">=\"&DATE(YEAR(J$5),MONTH(J$5),1),GCampaign,$A11,GDevice,$K$2)/SUMIFS(INDIRECT(\"G\"&$G$2),GDate,\"<=\"&J$5,GDate,\">=\"&DATE(YEAR(J$5),MONTH(J$5),1),GCampaign,$A11,GDevice,$K$2)))","v":2602.7599999999998},{"$f":"IF($G$2=\"None\",SUMIFS(INDIRECT(\"G\"&$F$2),GDate,\"<=\"&K$5,GDate,\">=\"&DATE(YEAR(K$5),MONTH(K$5),1),GCampaign,$A11,GDevice,$K$2),IF(SUMIFS(INDIRECT(\"G\"&$G$2),GDate,\"<=\"&K$5,GDate,\">=\"&DATE(YEAR(K$5),MONTH(K$5),1),GCampaign,$A11,GDevice,$K$2)=0,0,SUMIFS(INDIRECT(\"G\"&$F$2),GDate,\"<=\"&K$5,GDate,\">=\"&DATE(YEAR(K$5),MONTH(K$5),1),GCampaign,$A11,GDevice,$K$2)/SUMIFS(INDIRECT(\"G\"&$G$2),GDate,\"<=\"&K$5,GDate,\">=\"&DATE(YEAR(K$5),MONTH(K$5),1),GCampaign,$A11,GDevice,$K$2)))","v":2681.9399999999996},{"$f":"IF($G$2=\"None\",SUMIFS(INDIRECT(\"G\"&$F$2),GDate,\"<=\"&L$5,GDate,\">=\"&DATE(YEAR(L$5),MONTH(L$5),1),GCampaign,$A11,GDevice,$K$2),IF(SUMIFS(INDIRECT(\"G\"&$G$2),GDate,\"<=\"&L$5,GDate,\">=\"&DATE(YEAR(L$5),MONTH(L$5),1),GCampaign,$A11,GDevice,$K$2)=0,0,SUMIFS(INDIRECT(\"G\"&$F$2),GDate,\"<=\"&L$5,GDate,\">=\"&DATE(YEAR(L$5),MONTH(L$5),1),GCampaign,$A11,GDevice,$K$2)/SUMIFS(INDIRECT(\"G\"&$G$2),GDate,\"<=\"&L$5,GDate,\">=\"&DATE(YEAR(L$5),MONTH(L$5),1),GCampaign,$A11,GDevice,$K$2)))","v":4702.3499999999995},{"$f":"IF($G$2=\"None\",SUMIFS(INDIRECT(\"G\"&$F$2),GDate,\"<=\"&M$5,GDate,\">=\"&DATE(YEAR(M$5),MONTH(M$5),1),GCampaign,$A11,GDevice,$K$2),IF(SUMIFS(INDIRECT(\"G\"&$G$2),GDate,\"<=\"&M$5,GDate,\">=\"&DATE(YEAR(M$5),MONTH(M$5),1),GCampaign,$A11,GDevice,$K$2)=0,0,SUMIFS(INDIRECT(\"G\"&$F$2),GDate,\"<=\"&M$5,GDate,\">=\"&DATE(YEAR(M$5),MONTH(M$5),1),GCampaign,$A11,GDevice,$K$2)/SUMIFS(INDIRECT(\"G\"&$G$2),GDate,\"<=\"&M$5,GDate,\">=\"&DATE(YEAR(M$5),MONTH(M$5),1),GCampaign,$A11,GDevice,$K$2)))","v":4113.8}]

{"sheet":"AdGroups","index":6,"n_rows":18,"n_cols":14,"rows_kept":18,"cut":false,"hidden":true,"merged":[[0,10,0,11],[1,10,1,11]]}
["Google Adwords - Monthly Statistics",null,null,null,null,null,null,null,"Device:",null,"Select values to display:"]
["Campaigns",{"$f":"IF(AND($K$2=\"Cost\",$J$2=\"*\"),IF(ROUND(SUM(OFFSET($C$6,1,0,AGCount,COLUMN($N$5)-2)),2)=ROUND(SUMIFS(GCost,GDate,\"<=\"&$C$5,GDate,\">=\"&DATE(YEAR($N$5),MONTH($N$5),1)),2),\"ok\",\"error!\"),\"ok\")","v":"ok"},{"$f":"IF(ISERROR(FIND(\"*\",$F$2)),\"error!\",MID($F$2,FIND(\"*\",$F$2)+1,LEN($F$2)-FIND(\"*\",$F$2)))","v":"N0"},{"$f":"IF(ISERROR(FIND(\"-\",$F$2)),\"error!\",MID($F$2,1,FIND(\"-\",$F$2)-1))","v":"Cost"},{"$f":"IF(ISERROR(FIND(\"-\",$F$2)),\"error!\",IF(ISERROR(FIND(\"*\",$F$2)),\"error!\",MID($F$2,FIND(\"-\",$F$2)+1,FIND(\"*\",$F$2)-1-FIND(\"-\",$F$2))))","v":"None"},{"$f":"IF(ISNA(MATCH($K$2,CTypeList,0)),\"Cost-None*N0\",OFFSET(CamCharts!$A$4,-1,MATCH($K$2,CTypeList,0),1,1))","v":"Cost-None*N0"},null,null,null,{"$f":"IF(ISBLANK($I$2),\"*\",$I$2)","v":"*"},"Cost"]
["© www.excel-skills.com"]
[null,{"$f":"IF(ISBLANK($K$2),\"Total Cost: \",\"Total \"&$K$2&\": \")","v":"Total Cost: "},{"$f":"IF($E$2=\"None\",SUMIFS(INDIRECT(\"G\"&$D$2),GDate,\"<=\"&C$5,GDate,\">=\"&DATE(YEAR(C$5),MONTH(C$5),1),GDevice,$J$2),IF(SUMIFS(INDIRECT(\"G\"&$E$2),GDate,\"<=\"&C$5,GDate,\">=\"&DATE(YEAR(C$5),MONTH(C$5),1),GDevice,$J$2)=0,0,SUMIFS(INDIRECT(\"G\"&$D$2),GDate,\"<=\"&C$5,GDate,\">=\"&DATE(YEAR(C$5),MONTH(C$5),1),GDevice,$J$2)/SUMIFS(INDIRECT(\"G\"&$E$2),GDate,\"<=\"&C$5,GDate,\">=\"&DATE(YEAR(C$5),MONTH(C$5),1),GDevice,$J$2)))","v":4545.26},{"$f":"IF($E$2=\"None\",SUMIFS(INDIRECT(\"G\"&$D$2),GDate,\"<=\"&D$5,GDate,\">=\"&DATE(YEAR(D$5),MONTH(D$5),1),GDevice,$J$2),IF(SUMIFS(INDIRECT(\"G\"&$E$2),GDate,\"<=\"&D$5,GDate,\">=\"&DATE(YEAR(D$5),MONTH(D$5),1),GDevice,$J$2)=0,0,SUMIFS(INDIRECT(\"G\"&$D$2),GDate,\"<=\"&D$5,GDate,\">=\"&DATE(YEAR(D$5),MONTH(D$5),1),GDevice,$J$2)/SUMIFS(INDIRECT(\"G\"&$E$2),GDate,\"<=\"&D$5,GDate,\">=\"&DATE(YEAR(D$5),MONTH(D$5),1),GDevice,$J$2)))","v":6045.9900000000016},{"$f":"IF($E$2=\"None\",SUMIFS(INDIRECT(\"G\"&$D$2),GDate,\"<=\"&E$5,GDate,\">=\"&DATE(YEAR(E$5),MONTH(E$5),1),GDevice,$J$2),IF(SUMIFS(INDIRECT(\"G\"&$E$2),GDate,\"<=\"&E$5,GDate,\">=\"&DATE(YEAR(E$5),MONTH(E$5),1),GDevice,$J$2)=0,0,SUMIFS(INDIRECT(\"G\"&$D$2),GDate,\"<=\"&E$5,GDate,\">=\"&DATE(YEAR(E$5),MONTH(E$5),1),GDevice,$J$2)/SUMIFS(INDIRECT(\"G\"&$E$2),GDate,\"<=\"&E$5,GDate,\">=\"&DATE(YEAR(E$5),MONTH(E$5),1),GDevice,$J$2)))","v":6306.6799999999994},{"$f":"IF($E$2=\"None\",SUMIFS(INDIRECT(\"G\"&$D$2),GDate,\"<=\"&F$5,GDate,\">=\"&DATE(YEAR(F$5),MONTH(F$5),1),GDevice,$J$2),IF(SUMIFS(INDIRECT(\"G\"&$E$2),GDate,\"<=\"&F$5,GDate,\">=\"&DATE(YEAR(F$5),MONTH(F$5),1),GDevice,$J$2)=0,0,SUMIFS(INDIRECT(\"G\"&$D$2),GDate,\"<=\"&F$5,GDate,\">=\"&DATE(YEAR(F$5),MONTH(F$5),1),GDevice,$J$2)/SUMIFS(INDIRECT(\"G\"&$E$2),GDate,\"<=\"&F$5,GDate,\">=\"&DATE(YEAR(F$5),MONTH(F$5),1),GDevice,$J$2)))","v":6638.18},{"$f":"IF($E$2=\"None\",SUMIFS(INDIRECT(\"G\"&$D$2),GDate,\"<=\"&G$5,GDate,\">=\"&DATE(YEAR(G$5),MONTH(G$5),1),GDevice,$J$2),IF(SUMIFS(INDIRECT(\"G\"&$E$2),GDate,\"<=\"&G$5,GDate,\">=\"&DATE(YEAR(G$5),MONTH(G$5),1),GDevice,$J$2)=0,0,SUMIFS(INDIRECT(\"G\"&$D$2),GDate,\"<=\"&G$5,GDate,\">=\"&DATE(YEAR(G$5),MONTH(G$5),1),GDevice,$J$2)/SUMIFS(INDIRECT(\"G\"&$E$2),GDate,\"<=\"&G$5,GDate,\">=\"&DATE(YEAR(G$5),MONTH(G$5),1),GDevice,$J$2)))","v":4116.46},{"$f":"IF($E$2=\"None\",SUMIFS(INDIRECT(\"G\"&$D$2),GDate,\"<=\"&H$5,GDate,\">=\"&DATE(YEAR(H$5),MONTH(H$5),1),GDevice,$J$2),IF(SUMIFS(INDIRECT(\"G\"&$E$2),GDate,\"<=\"&H$5,GDate,\">=\"&DATE(YEAR(H$5),MONTH(H$5),1),GDevice,$J$2)=0,0,SUMIFS(INDIRECT(\"G\"&$D$2),GDate,\"<=\"&H$5,GDate,\">=\"&DATE(YEAR(H$5),MONTH(H$5),1),GDevice,$J$2)/SUMIFS(INDIRECT(\"G\"&$E$2),GDate,\"<=\"&H$5,GDate,\">=\"&DATE(YEAR(H$5),MONTH(H$5),1),GDevice,$J$2)))","v":7953.91},{"$f":"IF($E$2=\"None\",SUMIFS(INDIRECT(\"G\"&$D$2),GDate,\"<=\"&I$5,GDate,\">=\"&DATE(YEAR(I$5),MONTH(I$5),1),GDevice,$J$2),IF(SUMIFS(INDIRECT(\"G\"&$E$2),GDate,\"<=\"&I$5,GDate,\">=\"&DATE(YEAR(I$5),MONTH(I$5),1),GDevice,$J$2)=0,0,SUMIFS(INDIRECT(\"G\"&$D$2),GDate,\"<=\"&I$5,GDate,\">=\"&DATE(YEAR(I$5),MONTH(I$5),1),GDevice,$J$2)/SUMIFS(INDIRECT(\"G\"&$E$2),GDate,\"<=\"&I$5,GDate,\">=\"&DATE(YEAR(I$5),MONTH(I$5),1),GDevice,$J$2)))","v":9987.4199999999964},{"$f":"IF($E$2=\"None\",SUMIFS(INDIRECT(\"G\"&$D$2),GDate,\"<=\"&J$5,GDate,\">=\"&DATE(YEAR(J$5),MONTH(J$5),1),GDevice,$J$2),IF(SUMIFS(INDIRECT(\"G\"&$E$2),GDate,\"<=\"&J$5,GDate,\">=\"&DATE(YEAR(J$5),MONTH(J$5),1),GDevice,$J$2)=0,0,SUMIFS(INDIRECT(\"G\"&$D$2),GDate,\"<=\"&J$5,GDate,\">=\"&DATE(YEAR(J$5),MONTH(J$5),1),GDevice,$J$2)/SUMIFS(INDIRECT(\"G\"&$E$2),GDate,\"<=\"&J$5,GDate,\">=\"&DATE(YEAR(J$5),MONTH(J$5),1),GDevice,$J$2)))","v":8527.4},{"$f":"IF($E$2=\"None\",SUMIFS(INDIRECT(\"G\"&$D$2),GDate,\"<=\"&K$5,GDate,\">=\"&DATE(YEAR(K$5),MONTH(K$5),1),GDevice,$J$2),IF(SUMIFS(INDIRECT(\"G\"&$E$2),GDate,\"<=\"&K$5,GDate,\">=\"&DATE(YEAR(K$5),MONTH(K$5),1),GDevice,$J$2)=0,0,SUMIFS(INDIRECT(\"G\"&$D$2),GDate,\"<=\"&K$5,GDate,\">=\"&DATE(YEAR(K$5),MONTH(K$5),1),GDevice,$J$2)/SUMIFS(INDIRECT(\"G\"&$E$2),GDate,\"<=\"&K$5,GDate,\">=\"&DATE(YEAR(K$5),MONTH(K$5),1),GDevice,$J$2)))","v":8309.0300000000007},{"$f":"IF($E$2=\"None\",SUMIFS(INDIRECT(\"G\"&$D$2),GDate,\"<=\"&L$5,GDate,\">=\"&DATE(YEAR(L$5),MONTH(L$5),1),GDevice,$J$2),IF(SUMIFS(INDIRECT(\"G\"&$E$2),GDate,\"<=\"&L$5,GDate,\">=\"&DATE(YEAR(L$5),MONTH(L$5),1),GDevice,$J$2)=0,0,SUMIFS(INDIRECT(\"G\"&$D$2),GDate,\"<=\"&L$5,GDate,\">=\"&DATE(YEAR(L$5),MONTH(L$5),1),GDevice,$J$2)/SUMIFS(INDIRECT(\"G\"&$E$2),GDate,\"<=\"&L$5,GDate,\">=\"&DATE(YEAR(L$5),MONTH(L$5),1),GDevice,$J$2)))","v":8025.6399999999994},{"$f":"IF($E$2=\"None\",SUMIFS(INDIRECT(\"G\"&$D$2),GDate,\"<=\"&M$5,GDate,\">=\"&DATE(YEAR(M$5),MONTH(M$5),1),GDevice,$J$2),IF(SUMIFS(INDIRECT(\"G\"&$E$2),GDate,\"<=\"&M$5,GDate,\">=\"&DATE(YEAR(M$5),MONTH(M$5),1),GDevice,$J$2)=0,0,SUMIFS(INDIRECT(\"G\"&$D$2),GDate,\"<=\"&M$5,GDate,\">=\"&DATE(YEAR(M$5),MONTH(M$5),1),GDevice,$J$2)/SUMIFS(INDIRECT(\"G\"&$E$2),GDate,\"<=\"&M$5,GDate,\">=\"&DATE(YEAR(M$5),MONTH(M$5),1),GDevice,$J$2)))","v":10720.079999999998},{"$f":"IF($E$2=\"None\",SUMIFS(INDIRECT(\"G\"&$D$2),GDate,\"<=\"&N$5,GDate,\">=\"&DATE(YEAR(N$5),MONTH(N$5),1),GDevice,$J$2),IF(SUMIFS(INDIRECT(\"G\"&$E$2),GDate,\"<=\"&N$5,GDate,\">=\"&DATE(YEAR(N$5),MONTH(N$5),1),GDevice,$J$2)=0,0,SUMIFS(INDIRECT(\"G\"&$D$2),GDate,\"<=\"&N$5,GDate,\">=\"&DATE(YEAR(N$5),MONTH(N$5),1),GDevice,$J$2)/SUMIFS(INDIRECT(\"G\"&$E$2),GDate,\"<=\"&N$5,GDate,\">=\"&DATE(YEAR(N$5),MONTH(N$5),1),GDevice,$J$2)))","v":8134.9600000000009}]
[null,"Month: ",{"$f":"DATE(YEAR(Setup!$B$4),MONTH(Setup!$B$4)+1,0)","v":"2021-04-30"},{"$f":"DATE(YEAR(C5),MONTH(C5),0)","v":"2021-03-31"},{"$f":"DATE(YEAR(D5),MONTH(D5),0)","v":"2021-02-28"},"2021-01-31","2020-12-31","2020-11-30","2020-10-31","2020-09-30","2020-08-31","2020-07-31","2020-06-30","2020-05-31"]
["Ad Group Name","Campaign Name","Period1","Period2","Period3","Period4","Period5","Period6","Period7","Period8","Period9","Period10","Period11","Period12"]
["Ad Group 1.1","Campaign 1",{"$f":"IF($E$2=\"None\",SUMIFS(INDIRECT(\"G\"&$D$2),GDate,\"<=\"&C$5,GDate,\">=\"&DATE(YEAR(C$5),MONTH(C$5),1),GCampaign,$B7,GAdgroup,$A7,GDevice,$J$2),IF(SUMIFS(INDIRECT(\"G\"&$E$2),GDate,\"<=\"&C$5,GDate,\">=\"&DATE(YEAR(C$5),MONTH(C$5),1),GCampaign,$B7,GAdgroup,$A7,GDevice,$J$2)=0,0,SUMIFS(INDIRECT(\"G\"&$D$2),GDate,\"<=\"&C$5,GDate,\">=\"&DATE(YEAR(C$5),MONTH(C$5),1),GCampaign,$B7,GAdgroup,$A7,GDevice,$J$2)/SUMIFS(INDIRECT(\"G\"&$E$2),GDate,\"<=\"&C$5,GDate,\">=\"&DATE(YEAR(C$5),MONTH(C$5),1),GCampaign,$B7,GAdgroup,$A7,GDevice,$J$2)))","v":126.32999999999998},{"$f":"IF($E$2=\"None\",SUMIFS(INDIRECT(\"G\"&$D$2),GDate,\"<=\"&D$5,GDate,\">=\"&DATE(YEAR(D$5),MONTH(D$5),1),GCampaign,$B7,GAdgroup,$A7,GDevice,$J$2),IF(SUMIFS(INDIRECT(\"G\"&$E$2),GDate,\"<=\"&D$5,GDate,\">=\"&DATE(YEAR(D$5),MONTH(D$5),1),GCampaign,$B7,GAdgroup,$A7,GDevice,$J$2)=0,0,SUMIFS(INDIRECT(\"G\"&$D$2),GDate,\"<=\"&D$5,GDate,\">=\"&DATE(YEAR(D$5),MONTH(D$5),1),GCampaign,$B7,GAdgroup,$A7,GDevice,$J$2)/SUMIFS(INDIRECT(\"G\"&$E$2),GDate,\"<=\"&D$5,GDate,\">=\"&DATE(YEAR(D$5),MONTH(D$5),1),GCampaign,$B7,GAdgroup,$A7,GDevice,$J$2)))","v":456.05999999999995},{"$f":"IF($E$2=\"None\",SUMIFS(INDIRECT(\"G\"&$D$2),GDate,\"<=\"&E$5,GDate,\">=\"&DATE(YEAR(E$5),MONTH(E$5),1),GCampaign,$B7,GAdgroup,$A7,GDevice,$J$2),IF(SUMIFS(INDIRECT(\"G\"&$E$2),GDate,\"<=\"&E$5,GDate,\">=\"&DATE(YEAR(E$5),MONTH(E$5),1),GCampaign,$B7,GAdgroup,$A7,GDevice,$J$2)=0,0,SUMIFS(INDIRECT(\"G\"&$D$2),GDate,\"<=\"&E$5,GDate,\">=\"&DATE(YEAR(E$5),MONTH(E$5),1),GCampaign,$B7,GAdgroup,$A7,GDevice,$J$2)/SUMIFS(INDIRECT(\"G\"&$E$2),GDate,\"<=\"&E$5,GDate,\">=\"&DATE(YEAR(E$5),MONTH(E$5),1),GCampaign,$B7,GAdgroup,$A7,GDevice,$J$2)))","v":305.74},{"$f":"IF($E$2=\"None\",SUMIFS(INDIRECT(\"G\"&$D$2),GDate,\"<=\"&F$5,GDate,\">=\"&DATE(YEAR(F$5),MONTH(F$5),1),GCampaign,$B7,GAdgroup,$A7,GDevice,$J$2),IF(SUMIFS(INDIRECT(\"G\"&$E$2),GDate,\"<=\"&F$5,GDate,\">=\"&DATE(YEAR(F$5),MONTH(F$5),1),GCampaign,$B7,GAdgroup,$A7,GDevice,$J$2)=0,0,SUMIFS(INDIRECT(\"G\"&$D$2),GDate,\"<=\"&F$5,GDate,\">=\"&DATE(YEAR(F$5),MONTH(F$5),1),GCampaign,$B7,GAdgroup,$A7,GDevice,$J$2)/SUMIFS(INDIRECT(\"G\"&$E$2),GDate,\"<=\"&F$5,GDate,\">=\"&DATE(YEAR(F$5),MONTH(F$5),1),GCampaign,$B7,GAdgroup,$A7,GDevice,$J$2)))","v":473.3},{"$f":"IF($E$2=\"None\",SUMIFS(INDIRECT(\"G\"&$D$2),GDate,\"<=\"&G$5,GDate,\">=\"&DATE(YEAR(G$5),MONTH(G$5),1),GCampaign,$B7,GAdgroup,$A7,GDevice,$J$2),IF(SUMIFS(INDIRECT(\"G\"&$E$2),GDate,\"<=\"&G$5,GDate,\">=\"&DATE(YEAR(G$5),MONTH(G$5),1),GCampaign,$B7,GAdgroup,$A7,GDevice,$J$2)=0,0,SUMIFS(INDIRECT(\"G\"&$D$2),GDate,\"<=\"&G$5,GDate,\">=\"&DATE(YEAR(G$5),MONTH(G$5),1),GCampaign,$B7,GAdgroup,$A7,GDevice,$J$2)/SUMIFS(INDIRECT(\"G\"&$E$2),GDate,\"<=\"&G$5,GDate,\">=\"&DATE(YEAR(G$5),MONTH(G$5),1),GCampaign,$B7,GAdgroup,$A7,GDevice,$J$2)))","v":206.7},{"$f":"IF($E$2=\"None\",SUMIFS(INDIRECT(\"G\"&$D$2),GDate,\"<=\"&H$5,GDate,\">=\"&DATE(YEAR(H$5),MONTH(H$5),1),GCampaign,$B7,GAdgroup,$A7,GDevice,$J$2),IF(SUMIFS(INDIRECT(\"G\"&$E$2),GDate,\"<=\"&H$5,GDate,\">=\"&DATE(YEAR(H$5),MONTH(H$5),1),GCampaign,$B7,GAdgroup,$A7,GDevice,$J$2)=0,0,SUMIFS(INDIRECT(\"G\"&$D$2),GDate,\"<=\"&H$5,GDate,\">=\"&DATE(YEAR(H$5),MONTH(H$5),1),GCampaign,$B7,GAdgroup,$A7,GDevice,$J$2)/SUMIFS(INDIRECT(\"G\"&$E$2),GDate,\"<=\"&H$5,GDate,\">=\"&DATE(YEAR(H$5),MONTH(H$5),1),GCampaign,$B7,GAdgroup,$A7,GDevice,$J$2)))","v":457.03999999999996},{"$f":"IF($E$2=\"None\",SUMIFS(INDIRECT(\"G\"&$D$2),GDate,\"<=\"&I$5,GDate,\">=\"&DATE(YEAR(I$5),MONTH(I$5),1),GCampaign,$B7,GAdgroup,$A7,GDevice,$J$2),IF(SUMIFS(INDIRECT(\"G\"&$E$2),GDate,\"<=\"&I$5,GDate,\">=\"&DATE(YEAR(I$5),MONTH(I$5),1),GCampaign,$B7,GAdgroup,$A7,GDevice,$J$2)=0,0,SUMIFS(INDIRECT(\"G\"&$D$2),GDate,\"<=\"&I$5,GDate,\">=\"&DATE(YEAR(I$5),MONTH(I$5),1),GCampaign,$B7,GAdgroup,$A7,GDevice,$J$2)/SUMIFS(INDIRECT(\"G\"&$E$2),GDate,\"<=\"&I$5,GDate,\">=\"&DATE(YEAR(I$5),MONTH(I$5),1),GCampaign,$B7,GAdgroup,$A7,GDevice,$J$2)))","v":820.59999999999991},{"$f":"IF($E$2=\"None\",SUMIFS(INDIRECT(\"G\"&$D$2),GDate,\"<=\"&J$5,GDate,\">=\"&DATE(YEAR(J$5),MONTH(J$5),1),GCampaign,$B7,GAdgroup,$A7,GDevice,$J$2),IF(SUMIFS(INDIRECT(\"G\"&$E$2),GDate,\"<=\"&J$5,GDate,\">=\"&DATE(YEAR(J$5),MONTH(J$5),1),GCampaign,$B7,GAdgroup,$A7,GDevice,$J$2)=0,0,SUMIFS(INDIRECT(\"G\"&$D$2),GDate,\"<=\"&J$5,GDate,\">=\"&DATE(YEAR(J$5),MONTH(J$5),1),GCampaign,$B7,GAdgroup,$A7,GDevice,$J$2)/SUMIFS(INDIRECT(\"G\"&$E$2),GDate,\"<=\"&J$5,GDate,\">=\"&DATE(YEAR(J$5),MONTH(J$5),1),GCampaign,$B7,GAdgroup,$A7,GDevice,$J$2)))","v":559.77},{"$f":"IF($E$2=\"None\",SUMIFS(INDIRECT(\"G\"&$D$2),GDate,\"<=\"&K$5,GDate,\">=\"&DATE(YEAR(K$5),MONTH(K$5),1),GCampaign,$B7,GAdgroup,$A7,GDevice,$J$2),IF(SUMIFS(INDIRECT(\"G\"&$E$2),GDate,\"<=\"&K$5,GDate,\">=\"&DATE(YEAR(K$5),MONTH(K$5),1),GCampaign,$B7,GAdgroup,$A7,GDevice,$J$2)=0,0,SUMIFS(INDIRECT(\"G\"&$D$2),GDate,\"<=\"&K$5,GDate,\">=\"&DATE(YEAR(K$5),MONTH(K$5),1),GCampaign,$B7,GAdgroup,$A7,GDevice,$J$2)/SUMIFS(INDIRECT(\"G\"&$E$2),GDate,\"<=\"&K$5,GDate,\">=\"&DATE(YEAR(K$5),MONTH(K$5),1),GCampaign,$B7,GAdgroup,$A7,GDevice,$J$2)))","v":710.82999999999993},{"$f":"IF($E$2=\"None\",SUMIFS(INDIRECT(\"G\"&$D$2),GDate,\"<=\"&L$5,GDate,\">=\"&DATE(YEAR(L$5),MONTH(L$5),1),GCampaign,$B7,GAdgroup,$A7,GDevice,$J$2),IF(SUMIFS(INDIRECT(\"G\"&$E$2),GDate,\"<=\"&L$5,GDate,\">=\"&DATE(YEAR(L$5),MONTH(L$5),1),GCampaign,$B7,GAdgroup,$A7,GDevice,$J$2)=0,0,SUMIFS(INDIRECT(\"G\"&$D$2),GDate,\"<=\"&L$5,GDate,\">=\"&DATE(YEAR(L$5),MONTH(L$5),1),GCampaign,$B7,GAdgroup,$A7,GDevice,$J$2)/SUMIFS(INDIRECT(\"G\"&$E$2),GDate,\"<=\"&L$5,GDate,\">=\"&DATE(YEAR(L$5),MONTH(L$5),1),GCampaign,$B7,GAdgroup,$A7,GDevice,$J$2)))","v":536.34},{"$f":"IF($E$2=\"None\",SUMIFS(INDIRECT(\"G\"&$D$2),GDate,\"<=\"&M$5,GDate,\">=\"&DATE(YEAR(M$5),MONTH(M$5),1),GCampaign,$B7,GAdgroup,$A7,GDevice,$J$2),IF(SUMIFS(INDIRECT(\"G\"&$E$2),GDate,\"<=\"&M$5,GDate,\">=\"&DATE(YEAR(M$5),MONTH(M$5),1),GCampaign,$B7,GAdgroup,$A7,GDevice,$J$2)=0,0,SUMIFS(INDIRECT(\"G\"&$D$2),GDate,\"<=\"&M$5,GDate,\">=\"&DATE(YEAR(M$5),MONTH(M$5),1),GCampaign,$B7,GAdgroup,$A7,GDevice,$J$2)/SUMIFS(INDIRECT(\"G\"&$E$2),GDate,\"<=\"&M$5,GDate,\">=\"&DATE(YEAR(M$5),MONTH(M$5),1),GCampaign,$B7,GAdgroup,$A7,GDevice,$J$2)))","v":955.22},{"$f":"IF($E$2=\"None\",SUMIFS(INDIRECT(\"G\"&$D$2),GDate,\"<=\"&N$5,GDate,\">=\"&DATE(YEAR(N$5),MONTH(N$5),1),GCampaign,$B7,GAdgroup,$A7,GDevice,$J$2),IF(SUMIFS(INDIRECT(\"G\"&$E$2),GDate,\"<=\"&N$5,GDate,\">=\"&DATE(YEAR(N$5),MONTH(N$5),1),GCampaign,$B7,GAdgroup,$A7,GDevice,$J$2)=0,0,SUMIFS(INDIRECT(\"G\"&$D$2),GDate,\"<=\"&N$5,GDate,\">=\"&DATE(YEAR(N$5),MONTH(N$5),1),GCampaign,$B7,GAdgroup,$A7,GDevice,$J$2)/SUMIFS(INDIRECT(\"G\"&$E$2),GDate,\"<=\"&N$5,GDate,\">=\"&DATE(YEAR(N$5),MONTH(N$5),1),GCampaign,$B7,GAdgroup,$A7,GDevice,$J$2)))","v":559.56999999999994}]
["Ad Group 1.2","Campaign 1",{"$f":"IF($E$2=\"None\",SUMIFS(INDIRECT(\"G\"&$D$2),GDate,\"<=\"&C$5,GDate,\">=\"&DATE(YEAR(C$5),MONTH(C$5),1),GCampaign,$B8,GAdgroup,$A8,GDevice,$J$2),IF(SUMIFS(INDIRECT(\"G\"&$E$2),GDate,\"<=\"&C$5,GDate,\">=\"&DATE(YEAR(C$5),MONTH(C$5),1),GCampaign,$B8,GAdgroup,$A8,GDevice,$J$2)=0,0,SUMIFS(INDIRECT(\"G\"&$D$2),GDate,\"<=\"&C$5,GDate,\">=\"&DATE(YEAR(C$5),MONTH(C$5),1),GCampaign,$B8,GAdgroup,$A8,GDevice,$J$2)/SUMIFS(INDIRECT(\"G\"&$E$2),GDate,\"<=\"&C$5,GDate,\">=\"&DATE(YEAR(C$5),MONTH(C$5),1),GCampaign,$B8,GAdgroup,$A8,GDevice,$J$2)))","v":191.53999999999996},{"$f":"IF($E$2=\"None\",SUMIFS(INDIRECT(\"G\"&$D$2),GDate,\"<=\"&D$5,GDate,\">=\"&DATE(YEAR(D$5),MONTH(D$5),1),GCampaign,$B8,GAdgroup,$A8,GDevice,$J$2),IF(SUMIFS(INDIRECT(\"G\"&$E$2),GDate,\"<=\"&D$5,GDate,\">=\"&DATE(YEAR(D$5),MONTH(D$5),1),GCampaign,$B8,GAdgroup,$A8,GDevice,$J$2)=0,0,SUMIFS(INDIRECT(\"G\"&$D$2),GDate,\"<=\"&D$5,GDate,\">=\"&DATE(YEAR(D$5),MONTH(D$5),1),GCampaign,$B8,GAdgroup,$A8,GDevice,$J$2)/SUMIFS(INDIRECT(\"G\"&$E$2),GDate,\"<=\"&D$5,GDate,\">=\"&DATE(YEAR(D$5),MONTH(D$5),1),GCampaign,$B8,GAdgroup,$A8,GDevice,$J$2)))","v":68.38},{"$f":"IF($E$2=\"None\",SUMIFS(INDIRECT(\"G\"&$D$2),GDate,\"<=\"&E$5,GDate,\">=\"&DATE(YEAR(E$5),MONTH(E$5),1),GCampaign,$B8,GAdgroup,$A8,GDevice,$J$2),IF(SUMIFS(INDIRECT(\"G\"&$E$2),GDate,\"<=\"&E$5,GDate,\">=\"&DATE(YEAR(E$5),MONTH(E$5),1),GCampaign,$B8,GAdgroup,$A8,GDevice,$J$2)=0,0,SUMIFS(INDIRECT(\"G\"&$D$2),GDate,\"<=\"&E$5,GDate,\">=\"&DATE(YEAR(E$5),MONTH(E$5),1),GCampaign,$B8,GAdgroup,$A8,GDevice,$J$2)/SUMIFS(INDIRECT(\"G\"&$E$2),GDate,\"<=\"&E$5,GDate,\">=\"&DATE(YEAR(E$5),MONTH(E$5),1),GCampaign,$B8,GAdgroup,$A8,GDevice,$J$2)))","v":136.54},{"$f":"IF($E$2=\"None\",SUMIFS(INDIRECT(\"G\"&$D$2),GDate,\"<=\"&F$5,GDate,\">=\"&DATE(YEAR(F$5),MONTH(F$5),1),GCampaign,$B8,GAdgroup,$A8,GDevice,$J$2),IF(SUMIFS(INDIRECT(\"G\"&$E$2),GDate,\"<=\"&F$5,GDate,\">=\"&DATE(YEAR(F$5),MONTH(F$5),1),GCampaign,$B8,GAdgroup,$A8,GDevice,$J$2)=0,0,SUMIFS(INDIRECT(\"G\"&$D$2),GDate,\"<=\"&F$5,GDate,\">=\"&DATE(YEAR(F$5),MONTH(F$5),1),GCampaign,$B8,GAdgroup,$A8,GDevice,$J$2)/SUMIFS(INDIRECT(\"G\"&$E$2),GDate,\"<=\"&F$5,GDate,\">=\"&DATE(YEAR(F$5),MONTH(F$5),1),GCampaign,$B8,GAdgroup,$A8,GDevice,$J$2)))","v":33.200000000000003},{"$f":"IF($E$2=\"None\",SUMIFS(INDIRECT(\"G\"&$D$2),GDate,\"<=\"&G$5,GDate,\">=\"&DATE(YEAR(G$5),MONTH(G$5),1),GCampaign,$B8,GAdgroup,$A8,GDevice,$J$2),IF(SUMIFS(INDIRECT(\"G\"&$E$2),GDate,\"<=\"&G$5,GDate,\">=\"&DATE(YEAR(G$5),MONTH(G$5),1),GCampaign,$B8,GAdgroup,$A8,GDevice,$J$2)=0,0,SUMIFS(INDIRECT(\"G\"&$D$2),GDate,\"<=\"&G$5,GDate,\">=\"&DATE(YEAR(G$5),MONTH(G$5),1),GCampaign,$B8,GAdgroup,$A8,GDevice,$J$2)/SUMIFS(INDIRECT(\"G\"&$E$2),GDate,\"<=\"&G$5,GDate,\">=\"&DATE(YEAR(G$5),MONTH(G$5),1),GCampaign,$B8,GAdgroup,$A8,GDevice,$J$2)))","v":40.620000000000005},{"$f":"IF($E$2=\"None\",SUMIFS(INDIRECT(\"G\"&$D$2),GDate,\"<=\"&H$5,GDate,\">=\"&DATE(YEAR(H$5),MONTH(H$5),1),GCampaign,$B8,GAdgroup,$A8,GDevice,$J$2),IF(SUMIFS(INDIRECT(\"G\"&$E$2),GDate,\"<=\"&H$5,GDate,\">=\"&DATE(YEAR(H$5),MONTH(H$5),1),GCampaign,$B8,GAdgroup,$A8,GDevice,$J$2)=0,0,SUMIFS(INDIRECT(\"G\"&$D$2),GDate,\"<=\"&H$5,GDate,\">=\"&DATE(YEAR(H$5),MONTH(H$5),1),GCampaign,$B8,GAdgroup,$A8,GDevice,$J$2)/SUMIFS(INDIRECT(\"G\"&$E$2),GDate,\"<=\"&H$5,GDate,\">=\"&DATE(YEAR(H$5),MONTH(H$5),1),GCampaign,$B8,GAdgroup,$A8,GDevice,$J$2)))","v":48.55},{"$f":"IF($E$2=\"None\",SUMIFS(INDIRECT(\"G\"&$D$2),GDate,\"<=\"&I$5,GDate,\">=\"&DATE(YEAR(I$5),MONTH(I$5),1),GCampaign,$B8,GAdgroup,$A8,GDevice,$J$2),IF(SUMIFS(INDIRECT(\"G\"&$E$2),GDate,\"<=\"&I$5,GDate,\">=\"&DATE(YEAR(I$5),MONTH(I$5),1),GCampaign,$B8,GAdgroup,$A8,GDevice,$J$2)=0,0,SUMIFS(INDIRECT(\"G\"&$D$2),GDate,\"<=\"&I$5,GDate,\">=\"&DATE(YEAR(I$5),MONTH(I$5),1),GCampaign,$B8,GAdgroup,$A8,GDevice,$J$2)/SUMIFS(INDIRECT(\"G\"&$E$2),GDate,\"<=\"&I$5,GDate,\">=\"&DATE(YEAR(I$5),MONTH(I$5),1),GCampaign,$B8,GAdgroup,$A8,GDevice,$J$2)))","v":52.64},{"$f":"IF($E$2=\"None\",SUMIFS(INDIRECT(\"G\"&$D$2),GDate,\"<=\"&J$5,GDate,\">=\"&DATE(YEAR(J$5),MONTH(J$5),1),GCampaign,$B8,GAdgroup,$A8,GDevice,$J$2),IF(SUMIFS(INDIRECT(\"G\"&$E$2),GDate,\"<=\"&J$5,GDate,\">=\"&DATE(YEAR(J$5),MONTH(J$5),1),GCampaign,$B8,GAdgroup,$A8,GDevice,$J$2)=0,0,SUMIFS(INDIRECT(\"G\"&$D$2),GDate,\"<=\"&J$5,GDate,\">=\"&DATE(YEAR(J$5),MONTH(J$5),1),GCampaign,$B8,GAdgroup,$A8,GDevice,$J$2)/SUMIFS(INDIRECT(\"G\"&$E$2),GDate,\"<=\"&J$5,GDate,\">=\"&DATE(YEAR(J$5),MONTH(J$5),1),GCampaign,$B8,GAdgroup,$A8,GDevice,$J$2)))","v":39.119999999999997},{"$f":"IF($E$2=\"None\",SUMIFS(INDIRECT(\"G\"&$D$2),GDate,\"<=\"&K$5,GDate,\">=\"&DATE(YEAR(K$5),MONTH(K$5),1),GCampaign,$B8,GAdgroup,$A8,GDevice,$J$2),IF(SUMIFS(INDIRECT(\"G\"&$E$2),GDate,\"<=\"&K$5,GDate,\">=\"&DATE(YEAR(K$5),MONTH(K$5),1),GCampaign,$B8,GAdgroup,$A8,GDevice,$J$2)=0,0,SUMIFS(INDIRECT(\"G\"&$D$2),GDate,\"<=\"&K$5,GDate,\">=\"&DATE(YEAR(K$5),MONTH(K$5),1),GCampaign,$B8,GAdgroup,$A8,GDevice,$J$2)/SUMIFS(INDIRECT(\"G\"&$E$2),GDate,\"<=\"&K$5,GDate,\">=\"&DATE(YEAR(K$5),MONTH(K$5),1),GCampaign,$B8,GAdgroup,$A8,GDevice,$J$2)))","v":99.88},{"$f":"IF($E$2=\"None\",SUMIFS(INDIRECT(\"G\"&$D$2),GDate,\"<=\"&L$5,GDate,\">=\"&DATE(YEAR(L$5),MONTH(L$5),1),GCampaign,$B8,GAdgroup,$A8,GDevice,$J$2),IF(SUMIFS(INDIRECT(\"G\"&$E$2),GDate,\"<=\"&L$5,GDate,\">=\"&DATE(YEAR(L$5),MONTH(L$5),1),GCampaign,$B8,GAdgroup,$A8,GDevice,$J$2)=0,0,SUMIFS(INDIRECT(\"G\"&$D$2),GDate,\"<=\"&L$5,GDate,\">=\"&DATE(YEAR(L$5),MONTH(L$5),1),GCampaign,$B8,GAdgroup,$A8,GDevice,$J$2)/SUMIFS(INDIRECT(\"G\"&$E$2),GDate,\"<=\"&L$5,GDate,\">=\"&DATE(YEAR(L$5),MONTH(L$5),1),GCampaign,$B8,GAdgroup,$A8,GDevice,$J$2)))","v":57.72},{"$f":"IF($E$2=\"None\",SUMIFS(INDIRECT(\"G\"&$D$2),GDate,\"<=\"&M$5,GDate,\">=\"&DATE(YEAR(M$5),MONTH(M$5),1),GCampaign,$B8,GAdgroup,$A8,GDevice,$J$2),IF(SUMIFS(INDIRECT(\"G\"&$E$2),GDate,\"<=\"&M$5,GDate,\">=\"&DATE(YEAR(M$5),MONTH(M$5),1),GCampaign,$B8,GAdgroup,$A8,GDevice,$J$2)=0,0,SUMIFS(INDIRECT(\"G\"&$D$2),GDate,\"<=\"&M$5,GDate,\">=\"&DATE(YEAR(M$5),MONTH(M$5),1),GCampaign,$B8,GAdgroup,$A8,GDevice,$J$2)/SUMIFS(INDIRECT(\"G\"&$E$2),GDate,\"<=\"&M$5,GDate,\">=\"&DATE(YEAR(M$5),MONTH(M$5),1),GCampaign,$B8,GAdgroup,$A8,GDevice,$J$2)))","v":85.16},{"$f":"IF($E$2=\"None\",SUMIFS(INDIRECT(\"G\"&$D$2),GDate,\"<=\"&N$5,GDate,\">=\"&DATE(YEAR(N$5),MONTH(N$5),1),GCampaign,$B8,GAdgroup,$A8,GDevice,$J$2),IF(SUMIFS(INDIRECT(\"G\"&$E$2),GDate,\"<=\"&N$5,GDate,\">=\"&DATE(YEAR(N$5),MONTH(N$5),1),GCampaign,$B8,GAdgroup,$A8,GDevice,$J$2)=0,0,SUMIFS(INDIRECT(\"G\"&$D$2),GDate,\"<=\"&N$5,GDate,\">=\"&DATE(YEAR(N$5),MONTH(N$5),1),GCampaign,$B8,GAdgroup,$A8,GDevice,$J$2)/SUMIFS(INDIRECT(\"G\"&$E$2),GDate,\"<=\"&N$5,GDate,\">=\"&DATE(YEAR(N$5),MONTH(N$5),1),GCampaign,$B8,GAdgroup,$A8,GDevice,$J$2)))","v":119.57}]
["Ad Group 1.3","Campaign 1",{"$f":"IF($E$2=\"None\",SUMIFS(INDIRECT(\"G\"&$D$2),GDate,\"<=\"&C$5,GDate,\">=\"&DATE(YEAR(C$5),MONTH(C$5),1),GCampaign,$B9,GAdgroup,$A9,GDevice,$J$2),IF(SUMIFS(INDIRECT(\"G\"&$E$2),GDate,\"<=\"&C$5,GDate,\">=\"&DATE(YEAR(C$5),MONTH(C$5),1),GCampaign,$B9,GAdgroup,$A9,GDevice,$J$2)=0,0,SUMIFS(INDIRECT(\"G\"&$D$2),GDate,\"<=\"&C$5,GDate,\">=\"&DATE(YEAR(C$5),MONTH(C$5),1),GCampaign,$B9,GAdgroup,$A9,GDevice,$J$2)/SUMIFS(INDIRECT(\"G\"&$E$2),GDate,\"<=\"&C$5,GDate,\">=\"&DATE(YEAR(C$5),MONTH(C$5),1),GCampaign,$B9,GAdgroup,$A9,GDevice,$J$2)))","v":470.07000000000005},{"$f":"IF($E$2=\"None\",SUMIFS(INDIRECT(\"G\"&$D$2),GDate,\"<=\"&D$5,GDate,\">=\"&DATE(YEAR(D$5),MONTH(D$5),1),GCampaign,$B9,GAdgroup,$A9,GDevice,$J$2),IF(SUMIFS(INDIRECT(\"G\"&$E$2),GDate,\"<=\"&D$5,GDate,\">=\"&DATE(YEAR(D$5),MONTH(D$5),1),GCampaign,$B9,GAdgroup,$A9,GDevice,$J$2)=0,0,SUMIFS(INDIRECT(\"G\"&$D$2),GDate,\"<=\"&D$5,GDate,\">=\"&DATE(YEAR(D$5),MONTH(D$5),1),GCampaign,$B9,GAdgroup,$A9,GDevice,$J$2)/SUMIFS(INDIRECT(\"G\"&$E$2),GDate,\"<=\"&D$5,GDate,\">=\"&DATE(YEAR(D$5),MONTH(D$5),1),GCampaign,$B9,GAdgroup,$A9,GDevice,$J$2)))","v":570.15},{"$f":"IF($E$2=\"None\",SUMIFS(INDIRECT(\"G\"&$D$2),GDate,\"<=\"&E$5,GDate,\">=\"&DATE(YEAR(E$5),MONTH(E$5),1),GCampaign,$B9,GAdgroup,$A9,GDevice,$J$2),IF(SUMIFS(INDIRECT(\"G\"&$E$2),GDate,\"<=\"&E$5,GDate,\">=\"&DATE(YEAR(E$5),MONTH(E$5),1),GCampaign,$B9,GAdgroup,$A9,GDevice,$J$2)=0,0,SUMIFS(INDIRECT(\"G\"&$D$2),GDate,\"<=\"&E$5,GDate,\">=\"&DATE(YEAR(E$5),MONTH(E$5),1),GCampaign,$B9,GAdgroup,$A9,GDevice,$J$2)/SUMIFS(INDIRECT(\"G\"&$E$2),GDate,\"<=\"&E$5,GDate,\">=\"&DATE(YEAR(E$5),MONTH(E$5),1),GCampaign,$B9,GAdgroup,$A9,GDevice,$J$2)))","v":503.02},{"$f":"IF($E$2=\"None\",SUMIFS(INDIRECT(\"G\"&$D$2),GDate,\"<=\"&F$5,GDate,\">=\"&DATE(YEAR(F$5),MONTH(F$5),1),GCampaign,$B9,GAdgroup,$A9,GDevice,$J$2),IF(SUMIFS(INDIRECT(\"G\"&$E$2),GDate,\"<=\"&F$5,GDate,\">=\"&DATE(YEAR(F$5),MONTH(F$5),1),GCampaign,$B9,GAdgroup,$A9,GDevice,$J$2)=0,0,SUMIFS(INDIRECT(\"G\"&$D$2),GDate,\"<=\"&F$5,GDate,\">=\"&DATE(YEAR(F$5),MONTH(F$5),1),GCampaign,$B9,GAdgroup,$A9,GDevice,$J$2)/SUMIFS(INDIRECT(\"G\"&$E$2),GDate,\"<=\"&F$5,GDate,\">=\"&DATE(YEAR(F$5),MONTH(F$5),1),GCampaign,$B9,GAdgroup,$A9,GDevice,$J$2)))","v":670.12},{"$f":"IF($E$2=\"None\",SUMIFS(INDIRECT(\"G\"&$D$2),GDate,\"<=\"&G$5,GDate,\">=\"&DATE(YEAR(G$5),MONTH(G$5),1),GCampaign,$B9,GAdgroup,$A9,GDevice,$J$2),IF(SUMIFS(INDIRECT(\"G\"&$E$2),GDate,\"<=\"&G$5,GDate,\">=\"&DATE(YEAR(G$5),MONTH(G$5),1),GCampaign,$B9,GAdgroup,$A9,GDevice,$J$2)=0,0,SUMIFS(INDIRECT(\"G\"&$D$2),GDate,\"<=\"&G$5,GDate,\">=\"&DATE(YEAR(G$5),MONTH(G$5),1),GCampaign,$B9,GAdgroup,$A9,GDevice,$J$2)/SUMIFS(INDIRECT(\"G\"&$E$2),GDate,\"<=\"&G$5,GDate,\">=\"&DATE(YEAR(G$5),MONTH(G$5),1),GCampaign,$B9,GAdgroup,$A9,GDevice,$J$2)))","v":334.93},{"$f":"IF($E$2=\"None\",SUMIFS(INDIRECT(\"G\"&$D$2),GDate,\"<=\"&H$5,GDate,\">=\"&DATE(YEAR(H$5),MONTH(H$5),1),GCampaign,$B9,GAdgroup,$A9,GDevice,$J$2),IF(SUMIFS(INDIRECT(\"G\"&$E$2),GDate,\"<=\"&H$5,GDate,\">=\"&DATE(YEAR(H$5),MONTH(H$5),1),GCampaign,$B9,GAdgroup,$A9,GDevice,$J$2)=0,0,SUMIFS(INDIRECT(\"G\"&$D$2),GDate,\"<=\"&H$5,GDate,\">=\"&DATE(YEAR(H$5),MONTH(H$5),1),GCampaign,$B9,GAdgroup,$A9,GDevice,$J$2)/SUMIFS(INDIRECT(\"G\"&$E$2),GDate,\"<=\"&H$5,GDate,\">=\"&DATE(YEAR(H$5),MONTH(H$5),1),GCampaign,$B9,GAdgroup,$A9,GDevice,$J$2)))","v":937.38000000000011},{"$f":"IF($E$2=\"None\",SUMIFS(INDIRECT(\"G\"&$D$2),GDate,\"<=\"&I$5,GDate,\">=\"&DATE(YEAR(I$5),MONTH(I$5),1),GCampaign,$B9,GAdgroup,$A9,GDevice,$J$2),IF(SUMIFS(INDIRECT(\"G\"&$E$2),GDate,\"<=\"&I$5,GDate,\">=\"&DATE(YEAR(I$5),MONTH(I$5),1),GCampaign,$B9,GAdgroup,$A9,GDevice,$J$2)=0,0,SUMIFS(INDIRECT(\"G\"&$D$2),GDate,\"<=\"&I$5,GDate,\">=\"&DATE(YEAR(I$5),MONTH(I$5),1),GCampaign,$B9,GAdgroup,$A9,GDevice,$J$2)/SUMIFS(INDIRECT(\"G\"&$E$2),GDate,\"<=\"&I$5,GDate,\">=\"&DATE(YEAR(I$5),MONTH(I$5),1),GCampaign,$B9,GAdgroup,$A9,GDevice,$J$2)))","v":1684.94},{"$f":"IF($E$2=\"None\",SUMIFS(INDIRECT(\"G\"&$D$2),GDate,\"<=\"&J$5,GDate,\">=\"&DATE(YEAR(J$5),MONTH(J$5),1),GCampaign,$B9,GAdgroup,$A9,GDevice,$J$2),IF(SUMIFS(INDIRECT(\"G\"&$E$2),GDate,\"<=\"&J$5,GDate,\">=\"&DATE(YEAR(J$5),MONTH(J$5),1),GCampaign,$B9,GAdgroup,$A9,GDevice,$J$2)=0,0,SUMIFS(INDIRECT(\"G\"&$D$2),GDate,\"<=\"&J$5,GDate,\">=\"&DATE(YEAR(J$5),MONTH(J$5),1),GCampaign,$B9,GAdgroup,$A9,GDevice,$J$2)/SUMIFS(INDIRECT(\"G\"&$E$2),GDate,\"<=\"&J$5,GDate,\">=\"&DATE(YEAR(J$5),MONTH(J$5),1),GCampaign,$B9,GAdgroup,$A9,GDevice,$J$2)))","v":1317.26},{"$f":"IF($E$2=\"None\",SUMIFS(INDIRECT(\"G\"&$D$2),GDate,\"<=\"&K$5,GDate,\">=\"&DATE(YEAR(K$5),MONTH(K$5),1),GCampaign,$B9,GAdgroup,$A9,GDevice,$J$2),IF(SUMIFS(INDIRECT(\"G\"&$E$2),GDate,\"<=\"&K$5,GDate,\">=\"&DATE(YEAR(K$5),MONTH(K$5),1),GCampaign,$B9,GAdgroup,$A9,GDevice,$J$2)=0,0,SUMIFS(INDIRECT(\"G\"&$D$2),GDate,\"<=\"&K$5,GDate,\">=\"&DATE(YEAR(K$5),MONTH(K$5),1),GCampaign,$B9,GAdgroup,$A9,GDevice,$J$2)/SUMIFS(INDIRECT(\"G\"&$E$2),GDate,\"<=\"&K$5,GDate,\">=\"&DATE(YEAR(K$5),MONTH(K$5),1),GCampaign,$B9,GAdgroup,$A9,GDevice,$J$2)))","v":1057.6199999999999},{"$f":"IF($E$2=\"None\",SUMIFS(INDIRECT(\"G\"&$D$2),GDate,\"<=\"&L$5,GDate,\">=\"&DATE(YEAR(L$5),MONTH(L$5),1),GCampaign,$B9,GAdgroup,$A9,GDevice,$J$2),IF(SUMIFS(INDIRECT(\"G\"&$E$2),GDate,\"<=\"&L$5,GDate,\">=\"&DATE(YEAR(L$5),MONTH(L$5),1),GCampaign,$B9,GAdgroup,$A9,GDevice,$J$2)=0,0,SUMIFS(INDIRECT(\"G\"&$D$2),GDate,\"<=\"&L$5,GDate,\">=\"&DATE(YEAR(L$5),MONTH(L$5),1),GCampaign,$B9,GAdgroup,$A9,GDevice,$J$2)/SUMIFS(INDIRECT(\"G\"&$E$2),GDate,\"<=\"&L$5,GDate,\">=\"&DATE(YEAR(L$5),MONTH(L$5),1),GCampaign,$B9,GAdgroup,$A9,GDevice,$J$2)))","v":1279.5},{"$f":"IF($E$2=\"None\",SUMIFS(INDIRECT(\"G\"&$D$2),GDate,\"<=\"&M$5,GDate,\">=\"&DATE(YEAR(M$5),MONTH(M$5),1),GCampaign,$B9,GAdgroup,$A9,GDevice,$J$2),IF(SUMIFS(INDIRECT(\"G\"&$E$2),GDate,\"<=\"&M$5,GDate,\">=\"&DATE(YEAR(M$5),MONTH(M$5),1),GCampaign,$B9,GAdgroup,$A9,GDevice,$J$2)=0,0,SUMIFS(INDIRECT(\"G\"&$D$2),GDate,\"<=\"&M$5,GDate,\">=\"&DATE(YEAR(M$5),MONTH(M$5),1),GCampaign,$B9,GAdgroup,$A9,GDevice,$J$2)/SUMIFS(INDIRECT(\"G\"&$E$2),GDate,\"<=\"&M$5,GDate,\">=\"&DATE(YEAR(M$5),MONTH(M$5),1),GCampaign,$B9,GAdgroup,$A9,GDevice,$J$2)))","v":729.05},{"$f":"IF($E$2=\"None\",SUMIFS(INDIRECT(\"G\"&$D$2),GDate,\"<=\"&N$5,GDate,\">=\"&DATE(YEAR(N$5),MONTH(N$5),1),GCampaign,$B9,GAdgroup,$A9,GDevice,$J$2),IF(SUMIFS(INDIRECT(\"G\"&$E$2),GDate,\"<=\"&N$5,GDate,\">=\"&DATE(YEAR(N$5),MONTH(N$5),1),GCampaign,$B9,GAdgroup,$A9,GDevice,$J$2)=0,0,SUMIFS(INDIRECT(\"G\"&$D$2),GDate,\"<=\"&N$5,GDate,\">=\"&DATE(YEAR(N$5),MONTH(N$5),1),GCampaign,$B9,GAdgroup,$A9,GDevice,$J$2)/SUMIFS(INDIRECT(\"G\"&$E$2),GDate,\"<=\"&N$5,GDate,\">=\"&DATE(YEAR(N$5),MONTH(N$5),1),GCampaign,$B9,GAdgroup,$A9,GDevice,$J$2)))","v":465.59}]
["Ad Group 2.1","Campaign 2",{"$f":"IF($E$2=\"None\",SUMIFS(INDIRECT(\"G\"&$D$2),GDate,\"<=\"&C$5,GDate,\">=\"&DATE(YEAR(C$5),MONTH(C$5),1),GCampaign,$B10,GAdgroup,$A10,GDevice,$J$2),IF(SUMIFS(INDIRECT(\"G\"&$E$2),GDate,\"<=\"&C$5,GDate,\">=\"&DATE(YEAR(C$5),MONTH(C$5),1),GCampaign,$B10,GAdgroup,$A10,GDevice,$J$2)=0,0,SUMIFS(INDIRECT(\"G\"&$D$2),GDate,\"<=\"&C$5,GDate,\">=\"&DATE(YEAR(C$5),MONTH(C$5),1),GCampaign,$B10,GAdgroup,$A10,GDevice,$J$2)/SUMIFS(INDIRECT(\"G\"&$E$2),GDate,\"<=\"&C$5,GDate,\">=\"&DATE(YEAR(C$5),MONTH(C$5),1),GCampaign,$B10,GAdgroup,$A10,GDevice,$J$2)))","v":719.95999999999992},{"$f":"IF($E$2=\"None\",SUMIFS(INDIRECT(\"G\"&$D$2),GDate,\"<=\"&D$5,GDate,\">=\"&DATE(YEAR(D$5),MONTH(D$5),1),GCampaign,$B10,GAdgroup,$A10,GDevice,$J$2),IF(SUMIFS(INDIRECT(\"G\"&$E$2),GDate,\"<=\"&D$5,GDate,\">=\"&DATE(YEAR(D$5),MONTH(D$5),1),GCampaign,$B10,GAdgroup,$A10,GDevice,$J$2)=0,0,SUMIFS(INDIRECT(\"G\"&$D$2),GDate,\"<=\"&D$5,GDate,\">=\"&DATE(YEAR(D$5),MONTH(D$5),1),GCampaign,$B10,GAdgroup,$A10,GDevice,$J$2)/SUMIFS(INDIRECT(\"G\"&$E$2),GDate,\"<=\"&D$5,GDate,\">=\"&DATE(YEAR(D$5),MONTH(D$5),1),GCampaign,$B10,GAdgroup,$A10,GDevice,$J$2)))","v":618.67999999999995},{"$f":"IF($E$2=\"None\",SUMIFS(INDIRECT(\"G\"&$D$2),GDate,\"<=\"&E$5,GDate,\">=\"&DATE(YEAR(E$5),MONTH(E$5),1),GCampaign,$B10,GAdgroup,$A10,GDevice,$J$2),IF(SUMIFS(INDIRECT(\"G\"&$E$2),GDate,\"<=\"&E$5,GDate,\">=\"&DATE(YEAR(E$5),MONTH(E$5),1),GCampaign,$B10,GAdgroup,$A10,GDevice,$J$2)=0,0,SUMIFS(INDIRECT(\"G\"&$D$2),GDate,\"<=\"&E$5,GDate,\">=\"&DATE(YEAR(E$5),MONTH(E$5),1),GCampaign,$B10,GAdgroup,$A10,GDevice,$J$2)/SUMIFS(INDIRECT(\"G\"&$E$2),GDate,\"<=\"&E$5,GDate,\">=\"&DATE(YEAR(E$5),MONTH(E$5),1),GCampaign,$B10,GAdgroup,$A10,GDevice,$J$2)))","v":831.27},{"$f":"IF($E$2=\"None\",SUMIFS(INDIRECT(\"G\"&$D$2),GDate,\"<=\"&F$5,GDate,\">=\"&DATE(YEAR(F$5),MONTH(F$5),1),GCampaign,$B10,GAdgroup,$A10,GDevice,$J$2),IF(SUMIFS(INDIRECT(\"G\"&$E$2),GDate,\"<=\"&F$5,GDate,\">=\"&DATE(YEAR(F$5),MONTH(F$5),1),GCampaign,$B10,GAdgroup,$A10,GDevice,$J$2)=0,0,SUMIFS(INDIRECT(\"G\"&$D$2),GDate,\"<=\"&F$5,GDate,\">=\"&DATE(YEAR(F$5),MONTH(F$5),1),GCampaign,$B10,GAdgroup,$A10,GDevice,$J$2)/SUMIFS(INDIRECT(\"G\"&$E$2),GDate,\"<=\"&F$5,GDate,\">=\"&DATE(YEAR(F$5),MONTH(F$5),1),GCampaign,$B10,GAdgroup,$A10,GDevice,$J$2)))","v":685.11},{"$f":"IF($E$2=\"None\",SUMIFS(INDIRECT(\"G\"&$D$2),GDate,\"<=\"&G$5,GDate,\">=\"&DATE(YEAR(G$5),MONTH(G$5),1),GCampaign,$B10,GAdgroup,$A10,GDevice,$J$2),IF(SUMIFS(INDIRECT(\"G\"&$E$2),GDate,\"<=\"&G$5,GDate,\">=\"&DATE(YEAR(G$5),MONTH(G$5),1),GCampaign,$B10,GAdgroup,$A10,GDevice,$J$2)=0,0,SUMIFS(INDIRECT(\"G\"&$D$2),GDate,\"<=\"&G$5,GDate,\">=\"&DATE(YEAR(G$5),MONTH(G$5),1),GCampaign,$B10,GAdgroup,$A10,GDevice,$J$2)/SUMIFS(INDIRECT(\"G\"&$E$2),GDate,\"<=\"&G$5,GDate,\">=\"&DATE(YEAR(G$5),MONTH(G$5),1),GCampaign,$B10,GAdgroup,$A10,GDevice,$J$2)))","v":395.26},{"$f":"IF($E$2=\"None\",SUMIFS(INDIRECT(\"G\"&$D$2),GDate,\"<=\"&H$5,GDate,\">=\"&DATE(YEAR(H$5),MONTH(H$5),1),GCampaign,$B10,GAdgroup,$A10,GDevice,$J$2),IF(SUMIFS(INDIRECT(\"G\"&$E$2),GDate,\"<=\"&H$5,GDate,\">=\"&DATE(YEAR(H$5),MONTH(H$5),1),GCampaign,$B10,GAdgroup,$A10,GDevice,$J$2)=0,0,SUMIFS(INDIRECT(\"G\"&$D$2),GDate,\"<=\"&H$5,GDate,\">=\"&DATE(YEAR(H$5),MONTH(H$5),1),GCampaign,$B10,GAdgroup,$A10,GDevice,$J$2)/SUMIFS(INDIRECT(\"G\"&$E$2),GDate,\"<=\"&H$5,GDate,\">=\"&DATE(YEAR(H$5),MONTH(H$5),1),GCampaign,$B10,GAdgroup,$A10,GDevice,$J$2)))","v":942.55},{"$f":"IF($E$2=\"None\",SUMIFS(INDIRECT(\"G\"&$D$2),GDate,\"<=\"&I$5,GDate,\">=\"&DATE(YEAR(I$5),MONTH(I$5),1),GCampaign,$B10,GAdgroup,$A10,GDevice,$J$2),IF(SUMIFS(INDIRECT(\"G\"&$E$2),GDate,\"<=\"&I$5,GDate,\">=\"&DATE(YEAR(I$5),MONTH(I$5),1),GCampaign,$B10,GAdgroup,$A10,GDevice,$J$2)=0,0,SUMIFS(INDIRECT(\"G\"&$D$2),GDate,\"<=\"&I$5,GDate,\">=\"&DATE(YEAR(I$5),MONTH(I$5),1),GCampaign,$B10,GAdgroup,$A10,GDevice,$J$2)/SUMIFS(INDIRECT(\"G\"&$E$2),GDate,\"<=\"&I$5,GDate,\">=\"&DATE(YEAR(I$5),MONTH(I$5),1),GCampaign,$B10,GAdgroup,$A10,GDevice,$J$2)))","v":978.54},{"$f":"IF($E$2=\"None\",SUMIFS(INDIRECT(\"G\"&$D$2),GDate,\"<=\"&J$5,GDate,\">=\"&DATE(YEAR(J$5),MONTH(J$5),1),GCampaign,$B10,GAdgroup,$A10,GDevice,$J$2),IF(SUMIFS(INDIRECT(\"G\"&$E$2),GDate,\"<=\"&J$5,GDate,\">=\"&DATE(YEAR(J$5),MONTH(J$5),1),GCampaign,$B10,GAdgroup,$A10,GDevice,$J$2)=0,0,SUMIFS(INDIRECT(\"G\"&$D$2),GDate,\"<=\"&J$5,GDate,\">=\"&DATE(YEAR(J$5),MONTH(J$5),1),GCampaign,$B10,GAdgroup,$A10,GDevice,$J$2)/SUMIFS(INDIRECT(\"G\"&$E$2),GDate,\"<=\"&J$5,GDate,\">=\"&DATE(YEAR(J$5),MONTH(J$5),1),GCampaign,$B10,GAdgroup,$A10,GDevice,$J$2)))","v":643.94000000000005},{"$f":"IF($E$2=\"None\",SUMIFS(INDIRECT(\"G\"&$D$2),GDate,\"<=\"&K$5,GDate,\">=\"&DATE(YEAR(K$5),MONTH(K$5),1),GCampaign,$B10,GAdgroup,$A10,GDevice,$J$2),IF(SUMIFS(INDIRECT(\"G\"&$E$2),GDate,\"<=\"&K$5,GDate,\">=\"&DATE(YEAR(K$5),MONTH(K$5),1),GCampaign,$B10,GAdgroup,$A10,GDevice,$J$2)=0,0,SUMIFS(INDIRECT(\"G\"&$D$2),GDate,\"<=\"&K$5,GDate,\">=\"&DATE(YEAR(K$5),MONTH(K$5),1),GCampaign,$B10,GAdgroup,$A10,GDevice,$J$2)/SUMIFS(INDIRECT(\"G\"&$E$2),GDate,\"<=\"&K$5,GDate,\">=\"&DATE(YEAR(K$5),MONTH(K$5),1),GCampaign,$B10,GAdgroup,$A10,GDevice,$J$2)))","v":727.34999999999991},{"$f":"IF($E$2=\"None\",SUMIFS(INDIRECT(\"G\"&$D$2),GDate,\"<=\"&L$5,GDate,\">=\"&DATE(YEAR(L$5),MONTH(L$5),1),GCampaign,$B10,GAdgroup,$A10,GDevice,$J$2),IF(SUMIFS(INDIRECT(\"G\"&$E$2),GDate,\"<=\"&L$5,GDate,\">=\"&DATE(YEAR(L$5),MONTH(L$5),1),GCampaign,$B10,GAdgroup,$A10,GDevice,$J$2)=0,0,SUMIFS(INDIRECT(\"G\"&$D$2),GDate,\"<=\"&L$5,GDate,\">=\"&DATE(YEAR(L$5),MONTH(L$5),1),GCampaign,$B10,GAdgroup,$A10,GDevice,$J$2)/SUMIFS(INDIRECT(\"G\"&$E$2),GDate,\"<=\"&L$5,GDate,\">=\"&DATE(YEAR(L$5),MONTH(L$5),1),GCampaign,$B10,GAdgroup,$A10,GDevice,$J$2)))","v":453.14},{"$f":"IF($E$2=\"None\",SUMIFS(INDIRECT(\"G\"&$D$2),GDate,\"<=\"&M$5,GDate,\">=\"&DATE(YEAR(M$5),MONTH(M$5),1),GCampaign,$B10,GAdgroup,$A10,GDevice,$J$2),IF(SUMIFS(INDIRECT(\"G\"&$E$2),GDate,\"<=\"&M$5,GDate,\">=\"&DATE(YEAR(M$5),MONTH(M$5),1),GCampaign,$B10,GAdgroup,$A10,GDevice,$J$2)=0,0,SUMIFS(INDIRECT(\"G\"&$D$2),GDate,\"<=\"&M$5,GDate,\">=\"&DATE(YEAR(M$5),MONTH(M$5),1),GCampaign,$B10,GAdgroup,$A10,GDevice,$J$2)/SUMIFS(INDIRECT(\"G\"&$E$2),GDate,\"<=\"&M$5,GDate,\">=\"&DATE(YEAR(M$5),MONTH(M$5),1),GCampaign,$B10,GAdgroup,$A10,GDevice,$J$2)))","v":716.09},{"$f":"IF($E$2=\"None\",SUMIFS(INDIRECT(\"G\"&$D$2),GDate,\"<=\"&N$5,GDate,\">=\"&DATE(YEAR(N$5),MONTH(N$5),1),GCampaign,$B10,GAdgroup,$A10,GDevice,$J$2),IF(SUMIFS(INDIRECT(\"G\"&$E$2),GDate,\"<=\"&N$5,GDate,\">=\"&DATE(YEAR(N$5),MONTH(N$5),1),GCampaign,$B10,GAdgroup,$A10,GDevice,$J$2)=0,0,SUMIFS(INDIRECT(\"G\"&$D$2),GDate,\"<=\"&N$5,GDate,\">=\"&DATE(YEAR(N$5),MONTH(N$5),1),GCampaign,$B10,GAdgroup,$A10,GDevice,$J$2)/SUMIFS(INDIRECT(\"G\"&$E$2),GDate,\"<=\"&N$5,GDate,\">=\"&DATE(YEAR(N$5),MONTH(N$5),1),GCampaign,$B10,GAdgroup,$A10,GDevice,$J$2)))","v":600.34}]
["Ad Group 2.2","Campaign 2",{"$f":"IF($E$2=\"None\",SUMIFS(INDIRECT(\"G\"&$D$2),GDate,\"<=\"&C$5,GDate,\">=\"&DATE(YEAR(C$5),MONTH(C$5),1),GCampaign,$B11,GAdgroup,$A11,GDevice,$J$2),IF(SUMIFS(INDIRECT(\"G\"&$E$2),GDate,\"<=\"&C$5,GDate,\">=\"&DATE(YEAR(C$5),MONTH(C$5),1),GCampaign,$B11,GAdgroup,$A11,GDevice,$J$2)=0,0,SUMIFS(INDIRECT(\"G\"&$D$2),GDate,\"<=\"&C$5,GDate,\">=\"&DATE(YEAR(C$5),MONTH(C$5),1),GCampaign,$B11,GAdgroup,$A11,GDevice,$J$2)/SUMIFS(INDIRECT(\"G\"&$E$2),GDate,\"<=\"&C$5,GDate,\">=\"&DATE(YEAR(C$5),MONTH(C$5),1),GCampaign,$B11,GAdgroup,$A11,GDevice,$J$2)))","v":801.66},{"$f":"IF($E$2=\"None\",SUMIFS(INDIRECT(\"G\"&$D$2),GDate,\"<=\"&D$5,GDate,\">=\"&DATE(YEAR(D$5),MONTH(D$5),1),GCampaign,$B11,GAdgroup,$A11,GDevice,$J$2),IF(SUMIFS(INDIRECT(\"G\"&$E$2),GDate,\"<=\"&D$5,GDate,\">=\"&DATE(YEAR(D$5),MONTH(D$5),1),GCampaign,$B11,GAdgroup,$A11,GDevice,$J$2)=0,0,SUMIFS(INDIRECT(\"G\"&$D$2),GDate,\"<=\"&D$5,GDate,\">=\"&DATE(YEAR(D$5),MONTH(D$5),1),GCampaign,$B11,GAdgroup,$A11,GDevice,$J$2)/SUMIFS(INDIRECT(\"G\"&$E$2),GDate,\"<=\"&D$5,GDate,\">=\"&DATE(YEAR(D$5),MONTH(D$5),1),GCampaign,$B11,GAdgroup,$A11,GDevice,$J$2)))","v":1031.1400000000001},{"$f":"IF($E$2=\"None\",SUMIFS(INDIRECT(\"G\"&$D$2),GDate,\"<=\"&E$5,GDate,\">=\"&DATE(YEAR(E$5),MONTH(E$5),1),GCampaign,$B11,GAdgroup,$A11,GDevice,$J$2),IF(SUMIFS(INDIRECT(\"G\"&$E$2),GDate,\"<=\"&E$5,GDate,\">=\"&DATE(YEAR(E$5),MONTH(E$5),1),GCampaign,$B11,GAdgroup,$A11,GDevice,$J$2)=0,0,SUMIFS(INDIRECT(\"G\"&$D$2),GDate,\"<=\"&E$5,GDate,\">=\"&DATE(YEAR(E$5),MONTH(E$5),1),GCampaign,$B11,GAdgroup,$A11,GDevice,$J$2)/SUMIFS(INDIRECT(\"G\"&$E$2),GDate,\"<=\"&E$5,GDate,\">=\"&DATE(YEAR(E$5),MONTH(E$5),1),GCampaign,$B11,GAdgroup,$A11,GDevice,$J$2)))","v":625.41999999999996},{"$f":"IF($E$2=\"None\",SUMIFS(INDIRECT(\"G\"&$D$2),GDate,\"<=\"&F$5,GDate,\">=\"&DATE(YEAR(F$5),MONTH(F$5),1),GCampaign,$B11,GAdgroup,$A11,GDevice,$J$2),IF(SUMIFS(INDIRECT(\"G\"&$E$2),GDate,\"<=\"&F$5,GDate,\">=\"&DATE(YEAR(F$5),MONTH(F$5),1),GCampaign,$B11,GAdgroup,$A11,GDevice,$J$2)=0,0,SUMIFS(INDIRECT(\"G\"&$D$2),GDate,\"<=\"&F$5,GDate,\">=\"&DATE(YEAR(F$5),MONTH(F$5),1),GCampaign,$B11,GAdgroup,$A11,GDevice,$J$2)/SUMIFS(INDIRECT(\"G\"&$E$2),GDate,\"<=\"&F$5,GDate,\">=\"&DATE(YEAR(F$5),MONTH(F$5),1),GCampaign,$B11,GAdgroup,$A11,GDevice,$J$2)))","v":429.89},{"$f":"IF($E$2=\"None\",SUMIFS(INDIRECT(\"G\"&$D$2),GDate,\"<=\"&G$5,GDate,\">=\"&DATE(YEAR(G$5),MONTH(G$5),1),GCampaign,$B11,GAdgroup,$A11,GDevice,$J$2),IF(SUMIFS(INDIRECT(\"G\"&$E$2),GDate,\"<=\"&G$5,GDate,\">=\"&DATE(YEAR(G$5),MONTH(G$5),1),GCampaign,$B11,GAdgroup,$A11,GDevice,$J$2)=0,0,SUMIFS(INDIRECT(\"G\"&$D$2),GDate,\"<=\"&G$5,GDate,\">=\"&DATE(YEAR(G$5),MONTH(G$5),1),GCampaign,$B11,GAdgroup,$A11,GDevice,$J$2)/SUMIFS(INDIRECT(\"G\"&$E$2),GDate,\"<=\"&G$5,GDate,\">=\"&DATE(YEAR(G$5),MONTH(G$5),1),GCampaign,$B11,GAdgroup,$A11,GDevice,$J$2)))","v":255.72999999999996},{"$f":"IF($E$2=\"None\",SUMIFS(INDIRECT(\"G\"&$D$2),GDate,\"<=\"&H$5,GDate,\">=\"&DATE(YEAR(H$5),MONTH(H$5),1),GCampaign,$B11,GAdgroup,$A11,GDevice,$J$2),IF(SUMIFS(INDIRECT(\"G\"&$E$2),GDate,\"<=\"&H$5,GDate,\">=\"&DATE(YEAR(H$5),MONTH(H$5),1),GCampaign,$B11,GAdgroup,$A11,GDevice,$J$2)=0,0,SUMIFS(INDIRECT(\"G\"&$D$2),GDate,\"<=\"&H$5,GDate,\">=\"&DATE(YEAR(H$5),MONTH(H$5),1),GCampaign,$B11,GAdgroup,$A11,GDevice,$J$2)/SUMIFS(INDIRECT(\"G\"&$E$2),GDate,\"<=\"&H$5,GDate,\">=\"&DATE(YEAR(H$5),MONTH(H$5),1),GCampaign,$B11,GAdgroup,$A11,GDevice,$J$2)))","v":657.43000000000006},{"$f":"IF($E$2=\"None\",SUMIFS(INDIRECT(\"G\"&$D$2),GDate,\"<=\"&I$5,GDate,\">=\"&DATE(YEAR(I$5),MONTH(I$5),1),GCampaign,$B11,GAdgroup,$A11,GDevice,$J$2),IF(SUMIFS(INDIRECT(\"G\"&$E$2),GDate,\"<=\"&I$5,GDate,\">=\"&DATE(YEAR(I$5),MONTH(I$5),1),GCampaign,$B11,GAdgroup,$A11,GDevice,$J$2)=0,0,SUMIFS(INDIRECT(\"G\"&$D$2),GDate,\"<=\"&I$5,GDate,\">=\"&DATE(YEAR(I$5),MONTH(I$5),1),GCampaign,$B11,GAdgroup,$A11,GDevice,$J$2)/SUMIFS(INDIRECT(\"G\"&$E$2),GDate,\"<=\"&I$5,GDate,\">=\"&DATE(YEAR(I$5),MONTH(I$5),1),GCampaign,$B11,GAdgroup,$A11,GDevice,$J$2)))","v":741.6},{"$f":"IF($E$2=\"None\",SUMIFS(INDIRECT(\"G\"&$D$2),GDate,\"<=\"&J$5,GDate,\">=\"&DATE(YEAR(J$5),MONTH(J$5),1),GCampaign,$B11,GAdgroup,$A11,GDevice,$J$2),IF(SUMIFS(INDIRECT(\"G\"&$E$2),GDate,\"<=\"&J$5,GDate,\">=\"&DATE(YEAR(J$5),MONTH(J$5),1),GCampaign,$B11,GAdgroup,$A11,GDevice,$J$2)=0,0,SUMIFS(INDIRECT(\"G\"&$D$2),GDate,\"<=\"&J$5,GDate,\">=\"&DATE(YEAR(J$5),MONTH(J$5),1),GCampaign,$B11,GAdgroup,$A11,GDevice,$J$2)/SUMIFS(INDIRECT(\"G\"&$E$2),GDate,\"<=\"&J$5,GDate,\">=\"&DATE(YEAR(J$5),MONTH(J$5),1),GCampaign,$B11,GAdgroup,$A11,GDevice,$J$2)))","v":764.59},{"$f":"IF($E$2=\"None\",SUMIFS(INDIRECT(\"G\"&$D$2),GDate,\"<=\"&K$5,GDate,\">=\"&DATE(YEAR(K$5),MONTH(K$5),1),GCampaign,$B11,GAdgroup,$A11,GDevice,$J$2),IF(SUMIFS(INDIRECT(\"G\"&$E$2),GDate,\"<=\"&K$5,GDate,\">=\"&DATE(YEAR(K$5),MONTH(K$5),1),GCampaign,$B11,GAdgroup,$A11,GDevice,$J$2)=0,0,SUMIFS(INDIRECT(\"G\"&$D$2),GDate,\"<=\"&K$5,GDate,\">=\"&DATE(YEAR(K$5),MONTH(K$5),1),GCampaign,$B11,GAdgroup,$A11,GDevice,$J$2)/SUMIFS(INDIRECT(\"G\"&$E$2),GDate,\"<=\"&K$5,GDate,\">=\"&DATE(YEAR(K$5),MONTH(K$5),1),GCampaign,$B11,GAdgroup,$A11,GDevice,$J$2)))","v":1231.6000000000001},{"$f":"IF($E$2=\"None\",SUMIFS(INDIRECT(\"G\"&$D$2),GDate,\"<=\"&L$5,GDate,\">=\"&DATE(YEAR(L$5),MONTH(L$5),1),GCampaign,$B11,GAdgroup,$A11,GDevice,$J$2),IF(SUMIFS(INDIRECT(\"G\"&$E$2),GDate,\"<=\"&L$5,GDate,\">=\"&DATE(YEAR(L$5),MONTH(L$5),1),GCampaign,$B11,GAdgroup,$A11,GDevice,$J$2)=0,0,SUMIFS(INDIRECT(\"G\"&$D$2),GDate,\"<=\"&L$5,GDate,\">=\"&DATE(YEAR(L$5),MONTH(L$5),1),GCampaign,$B11,GAdgroup,$A11,GDevice,$J$2)/SUMIFS(INDIRECT(\"G\"&$E$2),GDate,\"<=\"&L$5,GDate,\">=\"&DATE(YEAR(L$5),MONTH(L$5),1),GCampaign,$B11,GAdgroup,$A11,GDevice,$J$2)))","v":967.54000000000008},{"$f":"IF($E$2=\"None\",SUMIFS(INDIRECT(\"G\"&$D$2),GDate,\"<=\"&M$5,GDate,\">=\"&DATE(YEAR(M$5),MONTH(M$5),1),GCampaign,$B11,GAdgroup,$A11,GDevice,$J$2),IF(SUMIFS(INDIRECT(\"G\"&$E$2),GDate,\"<=\"&M$5,GDate,\">=\"&DATE(YEAR(M$5),MONTH(M$5),1),GCampaign,$B11,GAdgroup,$A11,GDevice,$J$2)=0,0,SUMIFS(INDIRECT(\"G\"&$D$2),GDate,\"<=\"&M$5,GDate,\">=\"&DATE(YEAR(M$5),MONTH(M$5),1),GCampaign,$B11,GAdgroup,$A11,GDevice,$J$2)/SUMIFS(INDIRECT(\"G\"&$E$2),GDate,\"<=\"&M$5,GDate,\">=\"&DATE(YEAR(M$5),MONTH(M$5),1),GCampaign,$B11,GAdgroup,$A11,GDevice,$J$2)))","v":1551.69},{"$f":"IF($E$2=\"None\",SUMIFS(INDIRECT(\"G\"&$D$2),GDate,\"<=\"&N$5,GDate,\">=\"&DATE(YEAR(N$5),MONTH(N$5),1),GCampaign,$B11,GAdgroup,$A11,GDevice,$J$2),IF(SUMIFS(INDIRECT(\"G\"&$E$2),GDate,\"<=\"&N$5,GDate,\">=\"&DATE(YEAR(N$5),MONTH(N$5),1),GCampaign,$B11,GAdgroup,$A11,GDevice,$J$2)=0,0,SUMIFS(INDIRECT(\"G\"&$D$2),GDate,\"<=\"&N$5,GDate,\">=\"&DATE(YEAR(N$5),MONTH(N$5),1),GCampaign,$B11,GAdgroup,$A11,GDevice,$J$2)/SUMIFS(INDIRECT(\"G\"&$E$2),GDate,\"<=\"&N$5,GDate,\">=\"&DATE(YEAR(N$5),MONTH(N$5),1),GCampaign,$B11,GAdgroup,$A11,GDevice,$J$2)))","v":1220.3800000000001}]
["Ad Group 3.1","Campaign 3",{"$f":"IF($E$2=\"None\",SUMIFS(INDIRECT(\"G\"&$D$2),GDate,\"<=\"&C$5,GDate,\">=\"&DATE(YEAR(C$5),MONTH(C$5),1),GCampaign,$B12,GAdgroup,$A12,GDevice,$J$2),IF(SUMIFS(INDIRECT(\"G\"&$E$2),GDate,\"<=\"&C$5,GDate,\">=\"&DATE(YEAR(C$5),MONTH(C$5),1),GCampaign,$B12,GAdgroup,$A12,GDevice,$J$2)=0,0,SUMIFS(INDIRECT(\"G\"&$D$2),GDate,\"<=\"&C$5,GDate,\">=\"&DATE(YEAR(C$5),MONTH(C$5),1),GCampaign,$B12,GAdgroup,$A12,GDevice,$J$2)/SUMIFS(INDIRECT(\"G\"&$E$2),GDate,\"<=\"&C$5,GDate,\">=\"&DATE(YEAR(C$5),MONTH(C$5),1),GCampaign,$B12,GAdgroup,$A12,GDevice,$J$2)))","v":210.08999999999997},{"$f":"IF($E$2=\"None\",SUMIFS(INDIRECT(\"G\"&$D$2),GDate,\"<=\"&D$5,GDate,\">=\"&DATE(YEAR(D$5),MONTH(D$5),1),GCampaign,$B12,GAdgroup,$A12,GDevice,$J$2),IF(SUMIFS(INDIRECT(\"G\"&$E$2),GDate,\"<=\"&D$5,GDate,\">=\"&DATE(YEAR(D$5),MONTH(D$5),1),GCampaign,$B12,GAdgroup,$A12,GDevice,$J$2)=0,0,SUMIFS(INDIRECT(\"G\"&$D$2),GDate,\"<=\"&D$5,GDate,\">=\"&DATE(YEAR(D$5),MONTH(D$5),1),GCampaign,$B12,GAdgroup,$A12,GDevice,$J$2)/SUMIFS(INDIRECT(\"G\"&$E$2),GDate,\"<=\"&D$5,GDate,\">=\"&DATE(YEAR(D$5),MONTH(D$5),1),GCampaign,$B12,GAdgroup,$A12,GDevice,$J$2)))","v":232.38},{"$f":"IF($E$2=\"None\",SUMIFS(INDIRECT(\"G\"&$D$2),GDate,\"<=\"&E$5,GDate,\">=\"&DATE(YEAR(E$5),MONTH(E$5),1),GCampaign,$B12,GAdgroup,$A12,GDevice,$J$2),IF(SUMIFS(INDIRECT(\"G\"&$E$2),GDate,\"<=\"&E$5,GDate,\">=\"&DATE(YEAR(E$5),MONTH(E$5),1),GCampaign,$B12,GAdgroup,$A12,GDevice,$J$2)=0,0,SUMIFS(INDIRECT(\"G\"&$D$2),GDate,\"<=\"&E$5,GDate,\">=\"&DATE(YEAR(E$5),MONTH(E$5),1),GCampaign,$B12,GAdgroup,$A12,GDevice,$J$2)/SUMIFS(INDIRECT(\"G\"&$E$2),GDate,\"<=\"&E$5,GDate,\">=\"&DATE(YEAR(E$5),MONTH(E$5),1),GCampaign,$B12,GAdgroup,$A12,GDevice,$J$2)))","v":109.64999999999999},{"$f":"IF($E$2=\"None\",SUMIFS(INDIRECT(\"G\"&$D$2),GDate,\"<=\"&F$5,GDate,\">=\"&DATE(YEAR(F$5),MONTH(F$5),1),GCampaign,$B12,GAdgroup,$A12,GDevice,$J$2),IF(SUMIFS(INDIRECT(\"G\"&$E$2),GDate,\"<=\"&F$5,GDate,\">=\"&DATE(YEAR(F$5),MONTH(F$5),1),GCampaign,$B12,GAdgroup,$A12,GDevice,$J$2)=0,0,SUMIFS(INDIRECT(\"G\"&$D$2),GDate,\"<=\"&F$5,GDate,\">=\"&DATE(YEAR(F$5),MONTH(F$5),1),GCampaign,$B12,GAdgroup,$A12,GDevice,$J$2)/SUMIFS(INDIRECT(\"G\"&$E$2),GDate,\"<=\"&F$5,GDate,\">=\"&DATE(YEAR(F$5),MONTH(F$5),1),GCampaign,$B12,GAdgroup,$A12,GDevice,$J$2)))","v":308.88},{"$f":"IF($E$2=\"None\",SUMIFS(INDIRECT(\"G\"&$D$2),GDate,\"<=\"&G$5,GDate,\">=\"&DATE(YEAR(G$5),MONTH(G$5),1),GCampaign,$B12,GAdgroup,$A12,GDevice,$J$2),IF(SUMIFS(INDIRECT(\"G\"&$E$2),GDate,\"<=\"&G$5,GDate,\">=\"&DATE(YEAR(G$5),MONTH(G$5),1),GCampaign,$B12,GAdgroup,$A12,GDevice,$J$2)=0,0,SUMIFS(INDIRECT(\"G\"&$D$2),GDate,\"<=\"&G$5,GDate,\">=\"&DATE(YEAR(G$5),MONTH(G$5),1),GCampaign,$B12,GAdgroup,$A12,GDevice,$J$2)/SUMIFS(INDIRECT(\"G\"&$E$2),GDate,\"<=\"&G$5,GDate,\">=\"&DATE(YEAR(G$5),MONTH(G$5),1),GCampaign,$B12,GAdgroup,$A12,GDevice,$J$2)))","v":262.69},{"$f":"IF($E$2=\"None\",SUMIFS(INDIRECT(\"G\"&$D$2),GDate,\"<=\"&H$5,GDate,\">=\"&DATE(YEAR(H$5),MONTH(H$5),1),GCampaign,$B12,GAdgroup,$A12,GDevice,$J$2),IF(SUMIFS(INDIRECT(\"G\"&$E$2),GDate,\"<=\"&H$5,GDate,\">=\"&DATE(YEAR(H$5),MONTH(H$5),1),GCampaign,$B12,GAdgroup,$A12,GDevice,$J$2)=0,0,SUMIFS(INDIRECT(\"G\"&$D$2),GDate,\"<=\"&H$5,GDate,\">=\"&DATE(YEAR(H$5),MONTH(H$5),1),GCampaign,$B12,GAdgroup,$A12,GDevice,$J$2)/SUMIFS(INDIRECT(\"G\"&$E$2),GDate,\"<=\"&H$5,GDate,\">=\"&DATE(YEAR(H$5),MONTH(H$5),1),GCampaign,$B12,GAdgroup,$A12,GDevice,$J$2)))","v":420.16999999999996},{"$f":"IF($E$2=\"None\",SUMIFS(INDIRECT(\"G\"&$D$2),GDate,\"<=\"&I$5,GDate,\">=\"&DATE(YEAR(I$5),MONTH(I$5),1),GCampaign,$B12,GAdgroup,$A12,GDevice,$J$2),IF(SUMIFS(INDIRECT(\"G\"&$E$2),GDate,\"<=\"&I$5,GDate,\">=\"&DATE(YEAR(I$5),MONTH(I$5),1),GCampaign,$B12,GAdgroup,$A12,GDevice,$J$2)=0,0,SUMIFS(INDIRECT(\"G\"&$D$2),GDate,\"<=\"&I$5,GDate,\">=\"&DATE(YEAR(I$5),MONTH(I$5),1),GCampaign,$B12,GAdgroup,$A12,GDevice,$J$2)/SUMIFS(INDIRECT(\"G\"&$E$2),GDate,\"<=\"&I$5,GDate,\">=\"&DATE(YEAR(I$5),MONTH(I$5),1),GCampaign,$B12,GAdgroup,$A12,GDevice,$J$2)))","v":272.35000000000002},{"$f":"IF($E$2=\"None\",SUMIFS(INDIRECT(\"G\"&$D$2),GDate,\"<=\"&J$5,GDate,\">=\"&DATE(YEAR(J$5),MONTH(J$5),1),GCampaign,$B12,GAdgroup,$A12,GDevice,$J$2),IF(SUMIFS(INDIRECT(\"G\"&$E$2),GDate,\"<=\"&J$5,GDate,\">=\"&DATE(YEAR(J$5),MONTH(J$5),1),GCampaign,$B12,GAdgroup,$A12,GDevice,$J$2)=0,0,SUMIFS(INDIRECT(\"G\"&$D$2),GDate,\"<=\"&J$5,GDate,\">=\"&DATE(YEAR(J$5),MONTH(J$5),1),GCampaign,$B12,GAdgroup,$A12,GDevice,$J$2)/SUMIFS(INDIRECT(\"G\"&$E$2),GDate,\"<=\"&J$5,GDate,\">=\"&DATE(YEAR(J$5),MONTH(J$5),1),GCampaign,$B12,GAdgroup,$A12,GDevice,$J$2)))","v":406.38},{"$f":"IF($E$2=\"None\",SUMIFS(INDIRECT(\"G\"&$D$2),GDate,\"<=\"&K$5,GDate,\">=\"&DATE(YEAR(K$5),MONTH(K$5),1),GCampaign,$B12,GAdgroup,$A12,GDevice,$J$2),IF(SUMIFS(INDIRECT(\"G\"&$E$2),GDate,\"<=\"&K$5,GDate,\">=\"&DATE(YEAR(K$5),MONTH(K$5),1),GCampaign,$B12,GAdgroup,$A12,GDevice,$J$2)=0,0,SUMIFS(INDIRECT(\"G\"&$D$2),GDate,\"<=\"&K$5,GDate,\">=\"&DATE(YEAR(K$5),MONTH(K$5),1),GCampaign,$B12,GAdgroup,$A12,GDevice,$J$2)/SUMIFS(INDIRECT(\"G\"&$E$2),GDate,\"<=\"&K$5,GDate,\">=\"&DATE(YEAR(K$5),MONTH(K$5),1),GCampaign,$B12,GAdgroup,$A12,GDevice,$J$2)))","v":415.25000000000006},{"$f":"IF($E$2=\"None\",SUMIFS(INDIRECT(\"G\"&$D$2),GDate,\"<=\"&L$5,GDate,\">=\"&DATE(YEAR(L$5),MONTH(L$5),1),GCampaign,$B12,GAdgroup,$A12,GDevice,$J$2),IF(SUMIFS(INDIRECT(\"G\"&$E$2),GDate,\"<=\"&L$5,GDate,\">=\"&DATE(YEAR(L$5),MONTH(L$5),1),GCampaign,$B12,GAdgroup,$A12,GDevice,$J$2)=0,0,SUMIFS(INDIRECT(\"G\"&$D$2),GDate,\"<=\"&L$5,GDate,\">=\"&DATE(YEAR(L$5),MONTH(L$5),1),GCampaign,$B12,GAdgroup,$A12,GDevice,$J$2)/SUMIFS(INDIRECT(\"G\"&$E$2),GDate,\"<=\"&L$5,GDate,\">=\"&DATE(YEAR(L$5),MONTH(L$5),1),GCampaign,$B12,GAdgroup,$A12,GDevice,$J$2)))","v":478.04},{"$f":"IF($E$2=\"None\",SUMIFS(INDIRECT(\"G\"&$D$2),GDate,\"<=\"&M$5,GDate,\">=\"&DATE(YEAR(M$5),MONTH(M$5),1),GCampaign,$B12,GAdgroup,$A12,GDevice,$J$2),IF(SUMIFS(INDIRECT(\"G\"&$E$2),GDate,\"<=\"&M$5,GDate,\">=\"&DATE(YEAR(M$5),MONTH(M$5),1),GCampaign,$B12,GAdgroup,$A12,GDevice,$J$2)=0,0,SUMIFS(INDIRECT(\"G\"&$D$2),GDate,\"<=\"&M$5,GDate,\">=\"&DATE(YEAR(M$5),MONTH(M$5),1),GCampaign,$B12,GAdgroup,$A12,GDevice,$J$2)/SUMIFS(INDIRECT(\"G\"&$E$2),GDate,\"<=\"&M$5,GDate,\">=\"&DATE(YEAR(M$5),MONTH(M$5),1),GCampaign,$B12,GAdgroup,$A12,GDevice,$J$2)))","v":444.32},{"$f":"IF($E$2=\"None\",SUMIFS(INDIRECT(\"G\"&$D$2),GDate,\"<=\"&N$5,GDate,\">=\"&DATE(YEAR(N$5),MONTH(N$5),1),GCampaign,$B12,GAdgroup,$A12,GDevice,$J$2),IF(SUMIFS(INDIRECT(\"G\"&$E$2),GDate,\"<=\"&N$5,GDate,\">=\"&DATE(YEAR(N$5),MONTH(N$5),1),GCampaign,$B12,GAdgroup,$A12,GDevice,$J$2)=0,0,SUMIFS(INDIRECT(\"G\"&$D$2),GDate,\"<=\"&N$5,GDate,\">=\"&DATE(YEAR(N$5),MONTH(N$5),1),GCampaign,$B12,GAdgroup,$A12,GDevice,$J$2)/SUMIFS(INDIRECT(\"G\"&$E$2),GDate,\"<=\"&N$5,GDate,\">=\"&DATE(YEAR(N$5),MONTH(N$5),1),GCampaign,$B12,GAdgroup,$A12,GDevice,$J$2)))","v":310.64999999999998}]
["Ad Group 4.1","Campaign 4",{"$f":"IF($E$2=\"None\",SUMIFS(INDIRECT(\"G\"&$D$2),GDate,\"<=\"&C$5,GDate,\">=\"&DATE(YEAR(C$5),MONTH(C$5),1),GCampaign,$B13,GAdgroup,$A13,GDevice,$J$2),IF(SUMIFS(INDIRECT(\"G\"&$E$2),GDate,\"<=\"&C$5,GDate,\">=\"&DATE(YEAR(C$5),MONTH(C$5),1),GCampaign,$B13,GAdgroup,$A13,GDevice,$J$2)=0,0,SUMIFS(INDIRECT(\"G\"&$D$2),GDate,\"<=\"&C$5,GDate,\">=\"&DATE(YEAR(C$5),MONTH(C$5),1),GCampaign,$B13,GAdgroup,$A13,GDevice,$J$2)/SUMIFS(INDIRECT(\"G\"&$E$2),GDate,\"<=\"&C$5,GDate,\">=\"&DATE(YEAR(C$5),MONTH(C$5),1),GCampaign,$B13,GAdgroup,$A13,GDevice,$J$2)))","v":95.05},{"$f":"IF($E$2=\"None\",SUMIFS(INDIRECT(\"G\"&$D$2),GDate,\"<=\"&D$5,GDate,\">=\"&DATE(YEAR(D$5),MONTH(D$5),1),GCampaign,$B13,GAdgroup,$A13,GDevice,$J$2),IF(SUMIFS(INDIRECT(\"G\"&$E$2),GDate,\"<=\"&D$5,GDate,\">=\"&DATE(YEAR(D$5),MONTH(D$5),1),GCampaign,$B13,GAdgroup,$A13,GDevice,$J$2)=0,0,SUMIFS(INDIRECT(\"G\"&$D$2),GDate,\"<=\"&D$5,GDate,\">=\"&DATE(YEAR(D$5),MONTH(D$5),1),GCampaign,$B13,GAdgroup,$A13,GDevice,$J$2)/SUMIFS(INDIRECT(\"G\"&$E$2),GDate,\"<=\"&D$5,GDate,\">=\"&DATE(YEAR(D$5),MONTH(D$5),1),GCampaign,$B13,GAdgroup,$A13,GDevice,$J$2)))","v":507.3},{"$f":"IF($E$2=\"None\",SUMIFS(INDIRECT(\"G\"&$D$2),GDate,\"<=\"&E$5,GDate,\">=\"&DATE(YEAR(E$5),MONTH(E$5),1),GCampaign,$B13,GAdgroup,$A13,GDevice,$J$2),IF(SUMIFS(INDIRECT(\"G\"&$E$2),GDate,\"<=\"&E$5,GDate,\">=\"&DATE(YEAR(E$5),MONTH(E$5),1),GCampaign,$B13,GAdgroup,$A13,GDevice,$J$2)=0,0,SUMIFS(INDIRECT(\"G\"&$D$2),GDate,\"<=\"&E$5,GDate,\">=\"&DATE(YEAR(E$5),MONTH(E$5),1),GCampaign,$B13,GAdgroup,$A13,GDevice,$J$2)/SUMIFS(INDIRECT(\"G\"&$E$2),GDate,\"<=\"&E$5,GDate,\">=\"&DATE(YEAR(E$5),MONTH(E$5),1),GCampaign,$B13,GAdgroup,$A13,GDevice,$J$2)))","v":540.38},{"$f":"IF($E$2=\"None\",SUMIFS(INDIRECT(\"G\"&$D$2),GDate,\"<=\"&F$5,GDate,\">=\"&DATE(YEAR(F$5),MONTH(F$5),1),GCampaign,$B13,GAdgroup,$A13,GDevice,$J$2),IF(SUMIFS(INDIRECT(\"G\"&$E$2),GDate,\"<=\"&F$5,GDate,\">=\"&DATE(YEAR(F$5),MONTH(F$5),1),GCampaign,$B13,GAdgroup,$A13,GDevice,$J$2)=0,0,SUMIFS(INDIRECT(\"G\"&$D$2),GDate,\"<=\"&F$5,GDate,\">=\"&DATE(YEAR(F$5),MONTH(F$5),1),GCampaign,$B13,GAdgroup,$A13,GDevice,$J$2)/SUMIFS(INDIRECT(\"G\"&$E$2),GDate,\"<=\"&F$5,GDate,\">=\"&DATE(YEAR(F$5),MONTH(F$5),1),GCampaign,$B13,GAdgroup,$A13,GDevice,$J$2)))","v":801.94},{"$f":"IF($E$2=\"None\",SUMIFS(INDIRECT(\"G\"&$D$2),GDate,\"<=\"&G$5,GDate,\">=\"&DATE(YEAR(G$5),MONTH(G$5),1),GCampaign,$B13,GAdgroup,$A13,GDevice,$J$2),IF(SUMIFS(INDIRECT(\"G\"&$E$2),GDate,\"<=\"&G$5,GDate,\">=\"&DATE(YEAR(G$5),MONTH(G$5),1),GCampaign,$B13,GAdgroup,$A13,GDevice,$J$2)=0,0,SUMIFS(INDIRECT(\"G\"&$D$2),GDate,\"<=\"&G$5,GDate,\">=\"&DATE(YEAR(G$5),MONTH(G$5),1),GCampaign,$B13,GAdgroup,$A13,GDevice,$J$2)/SUMIFS(INDIRECT(\"G\"&$E$2),GDate,\"<=\"&G$5,GDate,\">=\"&DATE(YEAR(G$5),MONTH(G$5),1),GCampaign,$B13,GAdgroup,$A13,GDevice,$J$2)))","v":488.26},{"$f":"IF($E$2=\"None\",SUMIFS(INDIRECT(\"G\"&$D$2),GDate,\"<=\"&H$5,GDate,\">=\"&DATE(YEAR(H$5),MONTH(H$5),1),GCampaign,$B13,GAdgroup,$A13,GDevice,$J$2),IF(SUMIFS(INDIRECT(\"G\"&$E$2),GDate,\"<=\"&H$5,GDate,\">=\"&DATE(YEAR(H$5),MONTH(H$5),1),GCampaign,$B13,GAdgroup,$A13,GDevice,$J$2)=0,0,SUMIFS(INDIRECT(\"G\"&$D$2),GDate,\"<=\"&H$5,GDate,\">=\"&DATE(YEAR(H$5),MONTH(H$5),1),GCampaign,$B13,GAdgroup,$A13,GDevice,$J$2)/SUMIFS(INDIRECT(\"G\"&$E$2),GDate,\"<=\"&H$5,GDate,\">=\"&DATE(YEAR(H$5),MONTH(H$5),1),GCampaign,$B13,GAdgroup,$A13,GDevice,$J$2)))","v":582.36},{"$f":"IF($E$2=\"None\",SUMIFS(INDIRECT(\"G\"&$D$2),GDate,\"<=\"&I$5,GDate,\">=\"&DATE(YEAR(I$5),MONTH(I$5),1),GCampaign,$B13,GAdgroup,$A13,GDevice,$J$2),IF(SUMIFS(INDIRECT(\"G\"&$E$2),GDate,\"<=\"&I$5,GDate,\">=\"&DATE(YEAR(I$5),MONTH(I$5),1),GCampaign,$B13,GAdgroup,$A13,GDevice,$J$2)=0,0,SUMIFS(INDIRECT(\"G\"&$D$2),GDate,\"<=\"&I$5,GDate,\">=\"&DATE(YEAR(I$5),MONTH(I$5),1),GCampaign,$B13,GAdgroup,$A13,GDevice,$J$2)/SUMIFS(INDIRECT(\"G\"&$E$2),GDate,\"<=\"&I$5,GDate,\">=\"&DATE(YEAR(I$5),MONTH(I$5),1),GCampaign,$B13,GAdgroup,$A13,GDevice,$J$2)))","v":877.36},{"$f":"IF($E$2=\"None\",SUMIFS(INDIRECT(\"G\"&$D$2),GDate,\"<=\"&J$5,GDate,\">=\"&DATE(YEAR(J$5),MONTH(J$5),1),GCampaign,$B13,GAdgroup,$A13,GDevice,$J$2),IF(SUMIFS(INDIRECT(\"G\"&$E$2),GDate,\"<=\"&J$5,GDate,\">=\"&DATE(YEAR(J$5),MONTH(J$5),1),GCampaign,$B13,GAdgroup,$A13,GDevice,$J$2)=0,0,SUMIFS(INDIRECT(\"G\"&$D$2),GDate,\"<=\"&J$5,GDate,\">=\"&DATE(YEAR(J$5),MONTH(J$5),1),GCampaign,$B13,GAdgroup,$A13,GDevice,$J$2)/SUMIFS(INDIRECT(\"G\"&$E$2),GDate,\"<=\"&J$5,GDate,\">=\"&DATE(YEAR(J$5),MONTH(J$5),1),GCampaign,$B13,GAdgroup,$A13,GDevice,$J$2)))","v":798.12},{"$f":"IF($E$2=\"None\",SUMIFS(INDIRECT(\"G\"&$D$2),GDate,\"<=\"&K$5,GDate,\">=\"&DATE(YEAR(K$5),MONTH(K$5),1),GCampaign,$B13,GAdgroup,$A13,GDevice,$J$2),IF(SUMIFS(INDIRECT(\"G\"&$E$2),GDate,\"<=\"&K$5,GDate,\">=\"&DATE(YEAR(K$5),MONTH(K$5),1),GCampaign,$B13,GAdgroup,$A13,GDevice,$J$2)=0,0,SUMIFS(INDIRECT(\"G\"&$D$2),GDate,\"<=\"&K$5,GDate,\">=\"&DATE(YEAR(K$5),MONTH(K$5),1),GCampaign,$B13,GAdgroup,$A13,GDevice,$J$2)/SUMIFS(INDIRECT(\"G\"&$E$2),GDate,\"<=\"&K$5,GDate,\">=\"&DATE(YEAR(K$5),MONTH(K$5),1),GCampaign,$B13,GAdgroup,$A13,GDevice,$J$2)))","v":578.88},{"$f":"IF($E$2=\"None\",SUMIFS(INDIRECT(\"G\"&$D$2),GDate,\"<=\"&L$5,GDate,\">=\"&DATE(YEAR(L$5),MONTH(L$5),1),GCampaign,$B13,GAdgroup,$A13,GDevice,$J$2),IF(SUMIFS(INDIRECT(\"G\"&$E$2),GDate,\"<=\"&L$5,GDate,\">=\"&DATE(YEAR(L$5),MONTH(L$5),1),GCampaign,$B13,GAdgroup,$A13,GDevice,$J$2)=0,0,SUMIFS(INDIRECT(\"G\"&$D$2),GDate,\"<=\"&L$5,GDate,\">=\"&DATE(YEAR(L$5),MONTH(L$5),1),GCampaign,$B13,GAdgroup,$A13,GDevice,$J$2)/SUMIFS(INDIRECT(\"G\"&$E$2),GDate,\"<=\"&L$5,GDate,\">=\"&DATE(YEAR(L$5),MONTH(L$5),1),GCampaign,$B13,GAdgroup,$A13,GDevice,$J$2)))","v":579.81999999999994},{"$f":"IF($E$2=\"None\",SUMIFS(INDIRECT(\"G\"&$D$2),GDate,\"<=\"&M$5,GDate,\">=\"&DATE(YEAR(M$5),MONTH(M$5),1),GCampaign,$B13,GAdgroup,$A13,GDevice,$J$2),IF(SUMIFS(INDIRECT(\"G\"&$E$2),GDate,\"<=\"&M$5,GDate,\">=\"&DATE(YEAR(M$5),MONTH(M$5),1),GCampaign,$B13,GAdgroup,$A13,GDevice,$J$2)=0,0,SUMIFS(INDIRECT(\"G\"&$D$2),GDate,\"<=\"&M$5,GDate,\">=\"&DATE(YEAR(M$5),MONTH(M$5),1),GCampaign,$B13,GAdgroup,$A13,GDevice,$J$2)/SUMIFS(INDIRECT(\"G\"&$E$2),GDate,\"<=\"&M$5,GDate,\">=\"&DATE(YEAR(M$5),MONTH(M$5),1),GCampaign,$B13,GAdgroup,$A13,GDevice,$J$2)))","v":315.16000000000003},{"$f":"IF($E$2=\"None\",SUMIFS(INDIRECT(\"G\"&$D$2),GDate,\"<=\"&N$5,GDate,\">=\"&DATE(YEAR(N$5),MONTH(N$5),1),GCampaign,$B13,GAdgroup,$A13,GDevice,$J$2),IF(SUMIFS(INDIRECT(\"G\"&$E$2),GDate,\"<=\"&N$5,GDate,\">=\"&DATE(YEAR(N$5),MONTH(N$5),1),GCampaign,$B13,GAdgroup,$A13,GDevice,$J$2)=0,0,SUMIFS(INDIRECT(\"G\"&$D$2),GDate,\"<=\"&N$5,GDate,\">=\"&DATE(YEAR(N$5),MONTH(N$5),1),GCampaign,$B13,GAdgroup,$A13,GDevice,$J$2)/SUMIFS(INDIRECT(\"G\"&$E$2),GDate,\"<=\"&N$5,GDate,\">=\"&DATE(YEAR(N$5),MONTH(N$5),1),GCampaign,$B13,GAdgroup,$A13,GDevice,$J$2)))","v":164.46}]
["Ad Group 4.2","Campaign 4",{"$f":"IF($E$2=\"None\",SUMIFS(INDIRECT(\"G\"&$D$2),GDate,\"<=\"&C$5,GDate,\">=\"&DATE(YEAR(C$5),MONTH(C$5),1),GCampaign,$B14,GAdgroup,$A14,GDevice,$J$2),IF(SUMIFS(INDIRECT(\"G\"&$E$2),GDate,\"<=\"&C$5,GDate,\">=\"&DATE(YEAR(C$5),MONTH(C$5),1),GCampaign,$B14,GAdgroup,$A14,GDevice,$J$2)=0,0,SUMIFS(INDIRECT(\"G\"&$D$2),GDate,\"<=\"&C$5,GDate,\">=\"&DATE(YEAR(C$5),MONTH(C$5),1),GCampaign,$B14,GAdgroup,$A14,GDevice,$J$2)/SUMIFS(INDIRECT(\"G\"&$E$2),GDate,\"<=\"&C$5,GDate,\">=\"&DATE(YEAR(C$5),MONTH(C$5),1),GCampaign,$B14,GAdgroup,$A14,GDevice,$J$2)))","v":289.14999999999998},{"$f":"IF($E$2=\"None\",SUMIFS(INDIRECT(\"G\"&$D$2),GDate,\"<=\"&D$5,GDate,\">=\"&DATE(YEAR(D$5),MONTH(D$5),1),GCampaign,$B14,GAdgroup,$A14,GDevice,$J$2),IF(SUMIFS(INDIRECT(\"G\"&$E$2),GDate,\"<=\"&D$5,GDate,\">=\"&DATE(YEAR(D$5),MONTH(D$5),1),GCampaign,$B14,GAdgroup,$A14,GDevice,$J$2)=0,0,SUMIFS(INDIRECT(\"G\"&$D$2),GDate,\"<=\"&D$5,GDate,\">=\"&DATE(YEAR(D$5),MONTH(D$5),1),GCampaign,$B14,GAdgroup,$A14,GDevice,$J$2)/SUMIFS(INDIRECT(\"G\"&$E$2),GDate,\"<=\"&D$5,GDate,\">=\"&DATE(YEAR(D$5),MONTH(D$5),1),GCampaign,$B14,GAdgroup,$A14,GDevice,$J$2)))","v":337.76},{"$f":"IF($E$2=\"None\",SUMIFS(INDIRECT(\"G\"&$D$2),GDate,\"<=\"&E$5,GDate,\">=\"&DATE(YEAR(E$5),MONTH(E$5),1),GCampaign,$B14,GAdgroup,$A14,GDevice,$J$2),IF(SUMIFS(INDIRECT(\"G\"&$E$2),GDate,\"<=\"&E$5,GDate,\">=\"&DATE(YEAR(E$5),MONTH(E$5),1),GCampaign,$B14,GAdgroup,$A14,GDevice,$J$2)=0,0,SUMIFS(INDIRECT(\"G\"&$D$2),GDate,\"<=\"&E$5,GDate,\">=\"&DATE(YEAR(E$5),MONTH(E$5),1),GCampaign,$B14,GAdgroup,$A14,GDevice,$J$2)/SUMIFS(INDIRECT(\"G\"&$E$2),GDate,\"<=\"&E$5,GDate,\">=\"&DATE(YEAR(E$5),MONTH(E$5),1),GCampaign,$B14,GAdgroup,$A14,GDevice,$J$2)))","v":250.68},{"$f":"IF($E$2=\"None\",SUMIFS(INDIRECT(\"G\"&$D$2),GDate,\"<=\"&F$5,GDate,\">=\"&DATE(YEAR(F$5),MONTH(F$5),1),GCampaign,$B14,GAdgroup,$A14,GDevice,$J$2),IF(SUMIFS(INDIRECT(\"G\"&$E$2),GDate,\"<=\"&F$5,GDate,\">=\"&DATE(YEAR(F$5),MONTH(F$5),1),GCampaign,$B14,GAdgroup,$A14,GDevice,$J$2)=0,0,SUMIFS(INDIRECT(\"G\"&$D$2),GDate,\"<=\"&F$5,GDate,\">=\"&DATE(YEAR(F$5),MONTH(F$5),1),GCampaign,$B14,GAdgroup,$A14,GDevice,$J$2)/SUMIFS(INDIRECT(\"G\"&$E$2),GDate,\"<=\"&F$5,GDate,\">=\"&DATE(YEAR(F$5),MONTH(F$5),1),GCampaign,$B14,GAdgroup,$A14,GDevice,$J$2)))","v":162.92000000000002},{"$f":"IF($E$2=\"None\",SUMIFS(INDIRECT(\"G\"&$D$2),GDate,\"<=\"&G$5,GDate,\">=\"&DATE(YEAR(G$5),MONTH(G$5),1),GCampaign,$B14,GAdgroup,$A14,GDevice,$J$2),IF(SUMIFS(INDIRECT(\"G\"&$E$2),GDate,\"<=\"&G$5,GDate,\">=\"&DATE(YEAR(G$5),MONTH(G$5),1),GCampaign,$B14,GAdgroup,$A14,GDevice,$J$2)=0,0,SUMIFS(INDIRECT(\"G\"&$D$2),GDate,\"<=\"&G$5,GDate,\">=\"&DATE(YEAR(G$5),MONTH(G$5),1),GCampaign,$B14,GAdgroup,$A14,GDevice,$J$2)/SUMIFS(INDIRECT(\"G\"&$E$2),GDate,\"<=\"&G$5,GDate,\">=\"&DATE(YEAR(G$5),MONTH(G$5),1),GCampaign,$B14,GAdgroup,$A14,GDevice,$J$2)))","v":66.94},{"$f":"IF($E$2=\"None\",SUMIFS(INDIRECT(\"G\"&$D$2),GDate,\"<=\"&H$5,GDate,\">=\"&DATE(YEAR(H$5),MONTH(H$5),1),GCampaign,$B14,GAdgroup,$A14,GDevice,$J$2),IF(SUMIFS(INDIRECT(\"G\"&$E$2),GDate,\"<=\"&H$5,GDate,\">=\"&DATE(YEAR(H$5),MONTH(H$5),1),GCampaign,$B14,GAdgroup,$A14,GDevice,$J$2)=0,0,SUMIFS(INDIRECT(\"G\"&$D$2),GDate,\"<=\"&H$5,GDate,\">=\"&DATE(YEAR(H$5),MONTH(H$5),1),GCampaign,$B14,GAdgroup,$A14,GDevice,$J$2)/SUMIFS(INDIRECT(\"G\"&$E$2),GDate,\"<=\"&H$5,GDate,\">=\"&DATE(YEAR(H$5),MONTH(H$5),1),GCampaign,$B14,GAdgroup,$A14,GDevice,$J$2)))","v":417.92},{"$f":"IF($E$2=\"None\",SUMIFS(INDIRECT(\"G\"&$D$2),GDate,\"<=\"&I$5,GDate,\">=\"&DATE(YEAR(I$5),MONTH(I$5),1),GCampaign,$B14,GAdgroup,$A14,GDevice,$J$2),IF(SUMIFS(INDIRECT(\"G\"&$E$2),GDate,\"<=\"&I$5,GDate,\">=\"&DATE(YEAR(I$5),MONTH(I$5),1),GCampaign,$B14,GAdgroup,$A14,GDevice,$J$2)=0,0,SUMIFS(INDIRECT(\"G\"&$D$2),GDate,\"<=\"&I$5,GDate,\">=\"&DATE(YEAR(I$5),MONTH(I$5),1),GCampaign,$B14,GAdgroup,$A14,GDevice,$J$2)/SUMIFS(INDIRECT(\"G\"&$E$2),GDate,\"<=\"&I$5,GDate,\">=\"&DATE(YEAR(I$5),MONTH(I$5),1),GCampaign,$B14,GAdgroup,$A14,GDevice,$J$2)))","v":495.74},{"$f":"IF($E$2=\"None\",SUMIFS(INDIRECT(\"G\"&$D$2),GDate,\"<=\"&J$5,GDate,\">=\"&DATE(YEAR(J$5),MONTH(J$5),1),GCampaign,$B14,GAdgroup,$A14,GDevice,$J$2),IF(SUMIFS(INDIRECT(\"G\"&$E$2),GDate,\"<=\"&J$5,GDate,\">=\"&DATE(YEAR(J$5),MONTH(J$5),1),GCampaign,$B14,GAdgroup,$A14,GDevice,$J$2)=0,0,SUMIFS(INDIRECT(\"G\"&$D$2),GDate,\"<=\"&J$5,GDate,\">=\"&DATE(YEAR(J$5),MONTH(J$5),1),GCampaign,$B14,GAdgroup,$A14,GDevice,$J$2)/SUMIFS(INDIRECT(\"G\"&$E$2),GDate,\"<=\"&J$5,GDate,\">=\"&DATE(YEAR(J$5),MONTH(J$5),1),GCampaign,$B14,GAdgroup,$A14,GDevice,$J$2)))","v":448.98},{"$f":"IF($E$2=\"None\",SUMIFS(INDIRECT(\"G\"&$D$2),GDate,\"<=\"&K$5,GDate,\">=\"&DATE(YEAR(K$5),MONTH(K$5),1),GCampaign,$B14,GAdgroup,$A14,GDevice,$J$2),IF(SUMIFS(INDIRECT(\"G\"&$E$2),GDate,\"<=\"&K$5,GDate,\">=\"&DATE(YEAR(K$5),MONTH(K$5),1),GCampaign,$B14,GAdgroup,$A14,GDevice,$J$2)=0,0,SUMIFS(INDIRECT(\"G\"&$D$2),GDate,\"<=\"&K$5,GDate,\">=\"&DATE(YEAR(K$5),MONTH(K$5),1),GCampaign,$B14,GAdgroup,$A14,GDevice,$J$2)/SUMIFS(INDIRECT(\"G\"&$E$2),GDate,\"<=\"&K$5,GDate,\">=\"&DATE(YEAR(K$5),MONTH(K$5),1),GCampaign,$B14,GAdgroup,$A14,GDevice,$J$2)))","v":136.36000000000001},{"$f":"IF($E$2=\"None\",SUMIFS(INDIRECT(\"G\"&$D$2),GDate,\"<=\"&L$5,GDate,\">=\"&DATE(YEAR(L$5),MONTH(L$5),1),GCampaign,$B14,GAdgroup,$A14,GDevice,$J$2),IF(SUMIFS(INDIRECT(\"G\"&$E$2),GDate,\"<=\"&L$5,GDate,\">=\"&DATE(YEAR(L$5),MONTH(L$5),1),GCampaign,$B14,GAdgroup,$A14,GDevice,$J$2)=0,0,SUMIFS(INDIRECT(\"G\"&$D$2),GDate,\"<=\"&L$5,GDate,\">=\"&DATE(YEAR(L$5),MONTH(L$5),1),GCampaign,$B14,GAdgroup,$A14,GDevice,$J$2)/SUMIFS(INDIRECT(\"G\"&$E$2),GDate,\"<=\"&L$5,GDate,\">=\"&DATE(YEAR(L$5),MONTH(L$5),1),GCampaign,$B14,GAdgroup,$A14,GDevice,$J$2)))","v":287.98},{"$f":"IF($E$2=\"None\",SUMIFS(INDIRECT(\"G\"&$D$2),GDate,\"<=\"&M$5,GDate,\">=\"&DATE(YEAR(M$5),MONTH(M$5),1),GCampaign,$B14,GAdgroup,$A14,GDevice,$J$2),IF(SUMIFS(INDIRECT(\"G\"&$E$2),GDate,\"<=\"&M$5,GDate,\">=\"&DATE(YEAR(M$5),MONTH(M$5),1),GCampaign,$B14,GAdgroup,$A14,GDevice,$J$2)=0,0,SUMIFS(INDIRECT(\"G\"&$D$2),GDate,\"<=\"&M$5,GDate,\">=\"&DATE(YEAR(M$5),MONTH(M$5),1),GCampaign,$B14,GAdgroup,$A14,GDevice,$J$2)/SUMIFS(INDIRECT(\"G\"&$E$2),GDate,\"<=\"&M$5,GDate,\">=\"&DATE(YEAR(M$5),MONTH(M$5),1),GCampaign,$B14,GAdgroup,$A14,GDevice,$J$2)))","v":271.3},{"$f":"IF($E$2=\"None\",SUMIFS(INDIRECT(\"G\"&$D$2),GDate,\"<=\"&N$5,GDate,\">=\"&DATE(YEAR(N$5),MONTH(N$5),1),GCampaign,$B14,GAdgroup,$A14,GDevice,$J$2),IF(SUMIFS(INDIRECT(\"G\"&$E$2),GDate,\"<=\"&N$5,GDate,\">=\"&DATE(YEAR(N$5),MONTH(N$5),1),GCampaign,$B14,GAdgroup,$A14,GDevice,$J$2)=0,0,SUMIFS(INDIRECT(\"G\"&$D$2),GDate,\"<=\"&N$5,GDate,\">=\"&DATE(YEAR(N$5),MONTH(N$5),1),GCampaign,$B14,GAdgroup,$A14,GDevice,$J$2)/SUMIFS(INDIRECT(\"G\"&$E$2),GDate,\"<=\"&N$5,GDate,\">=\"&DATE(YEAR(N$5),MONTH(N$5),1),GCampaign,$B14,GAdgroup,$A14,GDevice,$J$2)))","v":229.84}]
["Ad Group 4.3","Campaign 4",{"$f":"IF($E$2=\"None\",SUMIFS(INDIRECT(\"G\"&$D$2),GDate,\"<=\"&C$5,GDate,\">=\"&DATE(YEAR(C$5),MONTH(C$5),1),GCampaign,$B15,GAdgroup,$A15,GDevice,$J$2),IF(SUMIFS(INDIRECT(\"G\"&$E$2),GDate,\"<=\"&C$5,GDate,\">=\"&DATE(YEAR(C$5),MONTH(C$5),1),GCampaign,$B15,GAdgroup,$A15,GDevice,$J$2)=0,0,SUMIFS(INDIRECT(\"G\"&$D$2),GDate,\"<=\"&C$5,GDate,\">=\"&DATE(YEAR(C$5),MONTH(C$5),1),GCampaign,$B15,GAdgroup,$A15,GDevice,$J$2)/SUMIFS(INDIRECT(\"G\"&$E$2),GDate,\"<=\"&C$5,GDate,\">=\"&DATE(YEAR(C$5),MONTH(C$5),1),GCampaign,$B15,GAdgroup,$A15,GDevice,$J$2)))","v":43.6},{"$f":"IF($E$2=\"None\",SUMIFS(INDIRECT(\"G\"&$D$2),GDate,\"<=\"&D$5,GDate,\">=\"&DATE(YEAR(D$5),MONTH(D$5),1),GCampaign,$B15,GAdgroup,$A15,GDevice,$J$2),IF(SUMIFS(INDIRECT(\"G\"&$E$2),GDate,\"<=\"&D$5,GDate,\">=\"&DATE(YEAR(D$5),MONTH(D$5),1),GCampaign,$B15,GAdgroup,$A15,GDevice,$J$2)=0,0,SUMIFS(INDIRECT(\"G\"&$D$2),GDate,\"<=\"&D$5,GDate,\">=\"&DATE(YEAR(D$5),MONTH(D$5),1),GCampaign,$B15,GAdgroup,$A15,GDevice,$J$2)/SUMIFS(INDIRECT(\"G\"&$E$2),GDate,\"<=\"&D$5,GDate,\">=\"&DATE(YEAR(D$5),MONTH(D$5),1),GCampaign,$B15,GAdgroup,$A15,GDevice,$J$2)))","v":325},{"$f":"IF($E$2=\"None\",SUMIFS(INDIRECT(\"G\"&$D$2),GDate,\"<=\"&E$5,GDate,\">=\"&DATE(YEAR(E$5),MONTH(E$5),1),GCampaign,$B15,GAdgroup,$A15,GDevice,$J$2),IF(SUMIFS(INDIRECT(\"G\"&$E$2),GDate,\"<=\"&E$5,GDate,\">=\"&DATE(YEAR(E$5),MONTH(E$5),1),GCampaign,$B15,GAdgroup,$A15,GDevice,$J$2)=0,0,SUMIFS(INDIRECT(\"G\"&$D$2),GDate,\"<=\"&E$5,GDate,\">=\"&DATE(YEAR(E$5),MONTH(E$5),1),GCampaign,$B15,GAdgroup,$A15,GDevice,$J$2)/SUMIFS(INDIRECT(\"G\"&$E$2),GDate,\"<=\"&E$5,GDate,\">=\"&DATE(YEAR(E$5),MONTH(E$5),1),GCampaign,$B15,GAdgroup,$A15,GDevice,$J$2)))","v":493.4},{"$f":"IF($E$2=\"None\",SUMIFS(INDIRECT(\"G\"&$D$2),GDate,\"<=\"&F$5,GDate,\">=\"&DATE(YEAR(F$5),MONTH(F$5),1),GCampaign,$B15,GAdgroup,$A15,GDevice,$J$2),IF(SUMIFS(INDIRECT(\"G\"&$E$2),GDate,\"<=\"&F$5,GDate,\">=\"&DATE(YEAR(F$5),MONTH(F$5),1),GCampaign,$B15,GAdgroup,$A15,GDevice,$J$2)=0,0,SUMIFS(INDIRECT(\"G\"&$D$2),GDate,\"<=\"&F$5,GDate,\">=\"&DATE(YEAR(F$5),MONTH(F$5),1),GCampaign,$B15,GAdgroup,$A15,GDevice,$J$2)/SUMIFS(INDIRECT(\"G\"&$E$2),GDate,\"<=\"&F$5,GDate,\">=\"&DATE(YEAR(F$5),MONTH(F$5),1),GCampaign,$B15,GAdgroup,$A15,GDevice,$J$2)))","v":654.24},{"$f":"IF($E$2=\"None\",SUMIFS(INDIRECT(\"G\"&$D$2),GDate,\"<=\"&G$5,GDate,\">=\"&DATE(YEAR(G$5),MONTH(G$5),1),GCampaign,$B15,GAdgroup,$A15,GDevice,$J$2),IF(SUMIFS(INDIRECT(\"G\"&$E$2),GDate,\"<=\"&G$5,GDate,\">=\"&DATE(YEAR(G$5),MONTH(G$5),1),GCampaign,$B15,GAdgroup,$A15,GDevice,$J$2)=0,0,SUMIFS(INDIRECT(\"G\"&$D$2),GDate,\"<=\"&G$5,GDate,\">=\"&DATE(YEAR(G$5),MONTH(G$5),1),GCampaign,$B15,GAdgroup,$A15,GDevice,$J$2)/SUMIFS(INDIRECT(\"G\"&$E$2),GDate,\"<=\"&G$5,GDate,\">=\"&DATE(YEAR(G$5),MONTH(G$5),1),GCampaign,$B15,GAdgroup,$A15,GDevice,$J$2)))","v":482.12},{"$f":"IF($E$2=\"None\",SUMIFS(INDIRECT(\"G\"&$D$2),GDate,\"<=\"&H$5,GDate,\">=\"&DATE(YEAR(H$5),MONTH(H$5),1),GCampaign,$B15,GAdgroup,$A15,GDevice,$J$2),IF(SUMIFS(INDIRECT(\"G\"&$E$2),GDate,\"<=\"&H$5,GDate,\">=\"&DATE(YEAR(H$5),MONTH(H$5),1),GCampaign,$B15,GAdgroup,$A15,GDevice,$J$2)=0,0,SUMIFS(INDIRECT(\"G\"&$D$2),GDate,\"<=\"&H$5,GDate,\">=\"&DATE(YEAR(H$5),MONTH(H$5),1),GCampaign,$B15,GAdgroup,$A15,GDevice,$J$2)/SUMIFS(INDIRECT(\"G\"&$E$2),GDate,\"<=\"&H$5,GDate,\">=\"&DATE(YEAR(H$5),MONTH(H$5),1),GCampaign,$B15,GAdgroup,$A15,GDevice,$J$2)))","v":656.36},{"$f":"IF($E$2=\"None\",SUMIFS(INDIRECT(\"G\"&$D$2),GDate,\"<=\"&I$5,GDate,\">=\"&DATE(YEAR(I$5),MONTH(I$5),1),GCampaign,$B15,GAdgroup,$A15,GDevice,$J$2),IF(SUMIFS(INDIRECT(\"G\"&$E$2),GDate,\"<=\"&I$5,GDate,\">=\"&DATE(YEAR(I$5),MONTH(I$5),1),GCampaign,$B15,GAdgroup,$A15,GDevice,$J$2)=0,0,SUMIFS(INDIRECT(\"G\"&$D$2),GDate,\"<=\"&I$5,GDate,\">=\"&DATE(YEAR(I$5),MONTH(I$5),1),GCampaign,$B15,GAdgroup,$A15,GDevice,$J$2)/SUMIFS(INDIRECT(\"G\"&$E$2),GDate,\"<=\"&I$5,GDate,\">=\"&DATE(YEAR(I$5),MONTH(I$5),1),GCampaign,$B15,GAdgroup,$A15,GDevice,$J$2)))","v":699.14},{"$f":"IF($E$2=\"None\",SUMIFS(INDIRECT(\"G\"&$D$2),GDate,\"<=\"&J$5,GDate,\">=\"&DATE(YEAR(J$5),MONTH(J$5),1),GCampaign,$B15,GAdgroup,$A15,GDevice,$J$2),IF(SUMIFS(INDIRECT(\"G\"&$E$2),GDate,\"<=\"&J$5,GDate,\">=\"&DATE(YEAR(J$5),MONTH(J$5),1),GCampaign,$B15,GAdgroup,$A15,GDevice,$J$2)=0,0,SUMIFS(INDIRECT(\"G\"&$D$2),GDate,\"<=\"&J$5,GDate,\">=\"&DATE(YEAR(J$5),MONTH(J$5),1),GCampaign,$B15,GAdgroup,$A15,GDevice,$J$2)/SUMIFS(INDIRECT(\"G\"&$E$2),GDate,\"<=\"&J$5,GDate,\">=\"&DATE(YEAR(J$5),MONTH(J$5),1),GCampaign,$B15,GAdgroup,$A15,GDevice,$J$2)))","v":623.12},{"$f":"IF($E$2=\"None\",SUMIFS(INDIRECT(\"G\"&$D$2),GDate,\"<=\"&K$5,GDate,\">=\"&DATE(YEAR(K$5),MONTH(K$5),1),GCampaign,$B15,GAdgroup,$A15,GDevice,$J$2),IF(SUMIFS(INDIRECT(\"G\"&$E$2),GDate,\"<=\"&K$5,GDate,\">=\"&DATE(YEAR(K$5),MONTH(K$5),1),GCampaign,$B15,GAdgroup,$A15,GDevice,$J$2)=0,0,SUMIFS(INDIRECT(\"G\"&$D$2),GDate,\"<=\"&K$5,GDate,\">=\"&DATE(YEAR(K$5),MONTH(K$5),1),GCampaign,$B15,GAdgroup,$A15,GDevice,$J$2)/SUMIFS(INDIRECT(\"G\"&$E$2),GDate,\"<=\"&K$5,GDate,\">=\"&DATE(YEAR(K$5),MONTH(K$5),1),GCampaign,$B15,GAdgroup,$A15,GDevice,$J$2)))","v":748.5},{"$f":"IF($E$2=\"None\",SUMIFS(INDIRECT(\"G\"&$D$2),GDate,\"<=\"&L$5,GDate,\">=\"&DATE(YEAR(L$5),MONTH(L$5),1),GCampaign,$B15,GAdgroup,$A15,GDevice,$J$2),IF(SUMIFS(INDIRECT(\"G\"&$E$2),GDate,\"<=\"&L$5,GDate,\">=\"&DATE(YEAR(L$5),MONTH(L$5),1),GCampaign,$B15,GAdgroup,$A15,GDevice,$J$2)=0,0,SUMIFS(INDIRECT(\"G\"&$D$2),GDate,\"<=\"&L$5,GDate,\">=\"&DATE(YEAR(L$5),MONTH(L$5),1),GCampaign,$B15,GAdgroup,$A15,GDevice,$J$2)/SUMIFS(INDIRECT(\"G\"&$E$2),GDate,\"<=\"&L$5,GDate,\">=\"&DATE(YEAR(L$5),MONTH(L$5),1),GCampaign,$B15,GAdgroup,$A15,GDevice,$J$2)))","v":703.62},{"$f":"IF($E$2=\"None\",SUMIFS(INDIRECT(\"G\"&$D$2),GDate,\"<=\"&M$5,GDate,\">=\"&DATE(YEAR(M$5),MONTH(M$5),1),GCampaign,$B15,GAdgroup,$A15,GDevice,$J$2),IF(SUMIFS(INDIRECT(\"G\"&$E$2),GDate,\"<=\"&M$5,GDate,\">=\"&DATE(YEAR(M$5),MONTH(M$5),1),GCampaign,$B15,GAdgroup,$A15,GDevice,$J$2)=0,0,SUMIFS(INDIRECT(\"G\"&$D$2),GDate,\"<=\"&M$5,GDate,\">=\"&DATE(YEAR(M$5),MONTH(M$5),1),GCampaign,$B15,GAdgroup,$A15,GDevice,$J$2)/SUMIFS(INDIRECT(\"G\"&$E$2),GDate,\"<=\"&M$5,GDate,\">=\"&DATE(YEAR(M$5),MONTH(M$5),1),GCampaign,$B15,GAdgroup,$A15,GDevice,$J$2)))","v":949.74},{"$f":"IF($E$2=\"None\",SUMIFS(INDIRECT(\"G\"&$D$2),GDate,\"<=\"&N$5,GDate,\">=\"&DATE(YEAR(N$5),MONTH(N$5),1),GCampaign,$B15,GAdgroup,$A15,GDevice,$J$2),IF(SUMIFS(INDIRECT(\"G\"&$E$2),GDate,\"<=\"&N$5,GDate,\">=\"&DATE(YEAR(N$5),MONTH(N$5),1),GCampaign,$B15,GAdgroup,$A15,GDevice,$J$2)=0,0,SUMIFS(INDIRECT(\"G\"&$D$2),GDate,\"<=\"&N$5,GDate,\">=\"&DATE(YEAR(N$5),MONTH(N$5),1),GCampaign,$B15,GAdgroup,$A15,GDevice,$J$2)/SUMIFS(INDIRECT(\"G\"&$E$2),GDate,\"<=\"&N$5,GDate,\">=\"&DATE(YEAR(N$5),MONTH(N$5),1),GCampaign,$B15,GAdgroup,$A15,GDevice,$J$2)))","v":350.76}]
["Ad Group 5.1","Campaign 5",{"$f":"IF($E$2=\"None\",SUMIFS(INDIRECT(\"G\"&$D$2),GDate,\"<=\"&C$5,GDate,\">=\"&DATE(YEAR(C$5),MONTH(C$5),1),GCampaign,$B16,GAdgroup,$A16,GDevice,$J$2),IF(SUMIFS(INDIRECT(\"G\"&$E$2),GDate,\"<=\"&C$5,GDate,\">=\"&DATE(YEAR(C$5),MONTH(C$5),1),GCampaign,$B16,GAdgroup,$A16,GDevice,$J$2)=0,0,SUMIFS(INDIRECT(\"G\"&$D$2),GDate,\"<=\"&C$5,GDate,\">=\"&DATE(YEAR(C$5),MONTH(C$5),1),GCampaign,$B16,GAdgroup,$A16,GDevice,$J$2)/SUMIFS(INDIRECT(\"G\"&$E$2),GDate,\"<=\"&C$5,GDate,\">=\"&DATE(YEAR(C$5),MONTH(C$5),1),GCampaign,$B16,GAdgroup,$A16,GDevice,$J$2)))","v":192.07},{"$f":"IF($E$2=\"None\",SUMIFS(INDIRECT(\"G\"&$D$2),GDate,\"<=\"&D$5,GDate,\">=\"&DATE(YEAR(D$5),MONTH(D$5),1),GCampaign,$B16,GAdgroup,$A16,GDevice,$J$2),IF(SUMIFS(INDIRECT(\"G\"&$E$2),GDate,\"<=\"&D$5,GDate,\">=\"&DATE(YEAR(D$5),MONTH(D$5),1),GCampaign,$B16,GAdgroup,$A16,GDevice,$J$2)=0,0,SUMIFS(INDIRECT(\"G\"&$D$2),GDate,\"<=\"&D$5,GDate,\">=\"&DATE(YEAR(D$5),MONTH(D$5),1),GCampaign,$B16,GAdgroup,$A16,GDevice,$J$2)/SUMIFS(INDIRECT(\"G\"&$E$2),GDate,\"<=\"&D$5,GDate,\">=\"&DATE(YEAR(D$5),MONTH(D$5),1),GCampaign,$B16,GAdgroup,$A16,GDevice,$J$2)))","v":237.56},{"$f":"IF($E$2=\"None\",SUMIFS(INDIRECT(\"G\"&$D$2),GDate,\"<=\"&E$5,GDate,\">=\"&DATE(YEAR(E$5),MONTH(E$5),1),GCampaign,$B16,GAdgroup,$A16,GDevice,$J$2),IF(SUMIFS(INDIRECT(\"G\"&$E$2),GDate,\"<=\"&E$5,GDate,\">=\"&DATE(YEAR(E$5),MONTH(E$5),1),GCampaign,$B16,GAdgroup,$A16,GDevice,$J$2)=0,0,SUMIFS(INDIRECT(\"G\"&$D$2),GDate,\"<=\"&E$5,GDate,\">=\"&DATE(YEAR(E$5),MONTH(E$5),1),GCampaign,$B16,GAdgroup,$A16,GDevice,$J$2)/SUMIFS(INDIRECT(\"G\"&$E$2),GDate,\"<=\"&E$5,GDate,\">=\"&DATE(YEAR(E$5),MONTH(E$5),1),GCampaign,$B16,GAdgroup,$A16,GDevice,$J$2)))","v":569.58999999999992},{"$f":"IF($E$2=\"None\",SUMIFS(INDIRECT(\"G\"&$D$2),GDate,\"<=\"&F$5,GDate,\">=\"&DATE(YEAR(F$5),MONTH(F$5),1),GCampaign,$B16,GAdgroup,$A16,GDevice,$J$2),IF(SUMIFS(INDIRECT(\"G\"&$E$2),GDate,\"<=\"&F$5,GDate,\">=\"&DATE(YEAR(F$5),MONTH(F$5),1),GCampaign,$B16,GAdgroup,$A16,GDevice,$J$2)=0,0,SUMIFS(INDIRECT(\"G\"&$D$2),GDate,\"<=\"&F$5,GDate,\">=\"&DATE(YEAR(F$5),MONTH(F$5),1),GCampaign,$B16,GAdgroup,$A16,GDevice,$J$2)/SUMIFS(INDIRECT(\"G\"&$E$2),GDate,\"<=\"&F$5,GDate,\">=\"&DATE(YEAR(F$5),MONTH(F$5),1),GCampaign,$B16,GAdgroup,$A16,GDevice,$J$2)))","v":695.03},{"$f":"IF($E$2=\"None\",SUMIFS(INDIRECT(\"G\"&$D$2),GDate,\"<=\"&G$5,GDate,\">=\"&DATE(YEAR(G$5),MONTH(G$5),1),GCampaign,$B16,GAdgroup,$A16,GDevice,$J$2),IF(SUMIFS(INDIRECT(\"G\"&$E$2),GDate,\"<=\"&G$5,GDate,\">=\"&DATE(YEAR(G$5),MONTH(G$5),1),GCampaign,$B16,GAdgroup,$A16,GDevice,$J$2)=0,0,SUMIFS(INDIRECT(\"G\"&$D$2),GDate,\"<=\"&G$5,GDate,\">=\"&DATE(YEAR(G$5),MONTH(G$5),1),GCampaign,$B16,GAdgroup,$A16,GDevice,$J$2)/SUMIFS(INDIRECT(\"G\"&$E$2),GDate,\"<=\"&G$5,GDate,\">=\"&DATE(YEAR(G$5),MONTH(G$5),1),GCampaign,$B16,GAdgroup,$A16,GDevice,$J$2)))","v":147.57},{"$f":"IF($E$2=\"None\",SUMIFS(INDIRECT(\"G\"&$D$2),GDate,\"<=\"&H$5,GDate,\">=\"&DATE(YEAR(H$5),MONTH(H$5),1),GCampaign,$B16,GAdgroup,$A16,GDevice,$J$2),IF(SUMIFS(INDIRECT(\"G\"&$E$2),GDate,\"<=\"&H$5,GDate,\">=\"&DATE(YEAR(H$5),MONTH(H$5),1),GCampaign,$B16,GAdgroup,$A16,GDevice,$J$2)=0,0,SUMIFS(INDIRECT(\"G\"&$D$2),GDate,\"<=\"&H$5,GDate,\">=\"&DATE(YEAR(H$5),MONTH(H$5),1),GCampaign,$B16,GAdgroup,$A16,GDevice,$J$2)/SUMIFS(INDIRECT(\"G\"&$E$2),GDate,\"<=\"&H$5,GDate,\">=\"&DATE(YEAR(H$5),MONTH(H$5),1),GCampaign,$B16,GAdgroup,$A16,GDevice,$J$2)))","v":767.37},{"$f":"IF($E$2=\"None\",SUMIFS(INDIRECT(\"G\"&$D$2),GDate,\"<=\"&I$5,GDate,\">=\"&DATE(YEAR(I$5),MONTH(I$5),1),GCampaign,$B16,GAdgroup,$A16,GDevice,$J$2),IF(SUMIFS(INDIRECT(\"G\"&$E$2),GDate,\"<=\"&I$5,GDate,\">=\"&DATE(YEAR(I$5),MONTH(I$5),1),GCampaign,$B16,GAdgroup,$A16,GDevice,$J$2)=0,0,SUMIFS(INDIRECT(\"G\"&$D$2),GDate,\"<=\"&I$5,GDate,\">=\"&DATE(YEAR(I$5),MONTH(I$5),1),GCampaign,$B16,GAdgroup,$A16,GDevice,$J$2)/SUMIFS(INDIRECT(\"G\"&$E$2),GDate,\"<=\"&I$5,GDate,\">=\"&DATE(YEAR(I$5),MONTH(I$5),1),GCampaign,$B16,GAdgroup,$A16,GDevice,$J$2)))","v":573.05000000000007},{"$f":"IF($E$2=\"None\",SUMIFS(INDIRECT(\"G\"&$D$2),GDate,\"<=\"&J$5,GDate,\">=\"&DATE(YEAR(J$5),MONTH(J$5),1),GCampaign,$B16,GAdgroup,$A16,GDevice,$J$2),IF(SUMIFS(INDIRECT(\"G\"&$E$2),GDate,\"<=\"&J$5,GDate,\">=\"&DATE(YEAR(J$5),MONTH(J$5),1),GCampaign,$B16,GAdgroup,$A16,GDevice,$J$2)=0,0,SUMIFS(INDIRECT(\"G\"&$D$2),GDate,\"<=\"&J$5,GDate,\">=\"&DATE(YEAR(J$5),MONTH(J$5),1),GCampaign,$B16,GAdgroup,$A16,GDevice,$J$2)/SUMIFS(INDIRECT(\"G\"&$E$2),GDate,\"<=\"&J$5,GDate,\">=\"&DATE(YEAR(J$5),MONTH(J$5),1),GCampaign,$B16,GAdgroup,$A16,GDevice,$J$2)))","v":604.38},{"$f":"IF($E$2=\"None\",SUMIFS(INDIRECT(\"G\"&$D$2),GDate,\"<=\"&K$5,GDate,\">=\"&DATE(YEAR(K$5),MONTH(K$5),1),GCampaign,$B16,GAdgroup,$A16,GDevice,$J$2),IF(SUMIFS(INDIRECT(\"G\"&$E$2),GDate,\"<=\"&K$5,GDate,\">=\"&DATE(YEAR(K$5),MONTH(K$5),1),GCampaign,$B16,GAdgroup,$A16,GDevice,$J$2)=0,0,SUMIFS(INDIRECT(\"G\"&$D$2),GDate,\"<=\"&K$5,GDate,\">=\"&DATE(YEAR(K$5),MONTH(K$5),1),GCampaign,$B16,GAdgroup,$A16,GDevice,$J$2)/SUMIFS(INDIRECT(\"G\"&$E$2),GDate,\"<=\"&K$5,GDate,\">=\"&DATE(YEAR(K$5),MONTH(K$5),1),GCampaign,$B16,GAdgroup,$A16,GDevice,$J$2)))","v":1268.1999999999998},{"$f":"IF($E$2=\"None\",SUMIFS(INDIRECT(\"G\"&$D$2),GDate,\"<=\"&L$5,GDate,\">=\"&DATE(YEAR(L$5),MONTH(L$5),1),GCampaign,$B16,GAdgroup,$A16,GDevice,$J$2),IF(SUMIFS(INDIRECT(\"G\"&$E$2),GDate,\"<=\"&L$5,GDate,\">=\"&DATE(YEAR(L$5),MONTH(L$5),1),GCampaign,$B16,GAdgroup,$A16,GDevice,$J$2)=0,0,SUMIFS(INDIRECT(\"G\"&$D$2),GDate,\"<=\"&L$5,GDate,\">=\"&DATE(YEAR(L$5),MONTH(L$5),1),GCampaign,$B16,GAdgroup,$A16,GDevice,$J$2)/SUMIFS(INDIRECT(\"G\"&$E$2),GDate,\"<=\"&L$5,GDate,\">=\"&DATE(YEAR(L$5),MONTH(L$5),1),GCampaign,$B16,GAdgroup,$A16,GDevice,$J$2)))","v":983.6099999999999},{"$f":"IF($E$2=\"None\",SUMIFS(INDIRECT(\"G\"&$D$2),GDate,\"<=\"&M$5,GDate,\">=\"&DATE(YEAR(M$5),MONTH(M$5),1),GCampaign,$B16,GAdgroup,$A16,GDevice,$J$2),IF(SUMIFS(INDIRECT(\"G\"&$E$2),GDate,\"<=\"&M$5,GDate,\">=\"&DATE(YEAR(M$5),MONTH(M$5),1),GCampaign,$B16,GAdgroup,$A16,GDevice,$J$2)=0,0,SUMIFS(INDIRECT(\"G\"&$D$2),GDate,\"<=\"&M$5,GDate,\">=\"&DATE(YEAR(M$5),MONTH(M$5),1),GCampaign,$B16,GAdgroup,$A16,GDevice,$J$2)/SUMIFS(INDIRECT(\"G\"&$E$2),GDate,\"<=\"&M$5,GDate,\">=\"&DATE(YEAR(M$5),MONTH(M$5),1),GCampaign,$B16,GAdgroup,$A16,GDevice,$J$2)))","v":2622.7200000000003},{"$f":"IF($E$2=\"None\",SUMIFS(INDIRECT(\"G\"&$D$2),GDate,\"<=\"&N$5,GDate,\">=\"&DATE(YEAR(N$5),MONTH(N$5),1),GCampaign,$B16,GAdgroup,$A16,GDevice,$J$2),IF(SUMIFS(INDIRECT(\"G\"&$E$2),GDate,\"<=\"&N$5,GDate,\">=\"&DATE(YEAR(N$5),MONTH(N$5),1),GCampaign,$B16,GAdgroup,$A16,GDevice,$J$2)=0,0,SUMIFS(INDIRECT(\"G\"&$D$2),GDate,\"<=\"&N$5,GDate,\">=\"&DATE(YEAR(N$5),MONTH(N$5),1),GCampaign,$B16,GAdgroup,$A16,GDevice,$J$2)/SUMIFS(INDIRECT(\"G\"&$E$2),GDate,\"<=\"&N$5,GDate,\">=\"&DATE(YEAR(N$5),MONTH(N$5),1),GCampaign,$B16,GAdgroup,$A16,GDevice,$J$2)))","v":2088.77}]
["Ad Group 5.2","Campaign 5",{"$f":"IF($E$2=\"None\",SUMIFS(INDIRECT(\"G\"&$D$2),GDate,\"<=\"&C$5,GDate,\">=\"&DATE(YEAR(C$5),MONTH(C$5),1),GCampaign,$B17,GAdgroup,$A17,GDevice,$J$2),IF(SUMIFS(INDIRECT(\"G\"&$E$2),GDate,\"<=\"&C$5,GDate,\">=\"&DATE(YEAR(C$5),MONTH(C$5),1),GCampaign,$B17,GAdgroup,$A17,GDevice,$J$2)=0,0,SUMIFS(INDIRECT(\"G\"&$D$2),GDate,\"<=\"&C$5,GDate,\">=\"&DATE(YEAR(C$5),MONTH(C$5),1),GCampaign,$B17,GAdgroup,$A17,GDevice,$J$2)/SUMIFS(INDIRECT(\"G\"&$E$2),GDate,\"<=\"&C$5,GDate,\">=\"&DATE(YEAR(C$5),MONTH(C$5),1),GCampaign,$B17,GAdgroup,$A17,GDevice,$J$2)))","v":725.01},{"$f":"IF($E$2=\"None\",SUMIFS(INDIRECT(\"G\"&$D$2),GDate,\"<=\"&D$5,GDate,\">=\"&DATE(YEAR(D$5),MONTH(D$5),1),GCampaign,$B17,GAdgroup,$A17,GDevice,$J$2),IF(SUMIFS(INDIRECT(\"G\"&$E$2),GDate,\"<=\"&D$5,GDate,\">=\"&DATE(YEAR(D$5),MONTH(D$5),1),GCampaign,$B17,GAdgroup,$A17,GDevice,$J$2)=0,0,SUMIFS(INDIRECT(\"G\"&$D$2),GDate,\"<=\"&D$5,GDate,\">=\"&DATE(YEAR(D$5),MONTH(D$5),1),GCampaign,$B17,GAdgroup,$A17,GDevice,$J$2)/SUMIFS(INDIRECT(\"G\"&$E$2),GDate,\"<=\"&D$5,GDate,\">=\"&DATE(YEAR(D$5),MONTH(D$5),1),GCampaign,$B17,GAdgroup,$A17,GDevice,$J$2)))","v":432.73},{"$f":"IF($E$2=\"None\",SUMIFS(INDIRECT(\"G\"&$D$2),GDate,\"<=\"&E$5,GDate,\">=\"&DATE(YEAR(E$5),MONTH(E$5),1),GCampaign,$B17,GAdgroup,$A17,GDevice,$J$2),IF(SUMIFS(INDIRECT(\"G\"&$E$2),GDate,\"<=\"&E$5,GDate,\">=\"&DATE(YEAR(E$5),MONTH(E$5),1),GCampaign,$B17,GAdgroup,$A17,GDevice,$J$2)=0,0,SUMIFS(INDIRECT(\"G\"&$D$2),GDate,\"<=\"&E$5,GDate,\">=\"&DATE(YEAR(E$5),MONTH(E$5),1),GCampaign,$B17,GAdgroup,$A17,GDevice,$J$2)/SUMIFS(INDIRECT(\"G\"&$E$2),GDate,\"<=\"&E$5,GDate,\">=\"&DATE(YEAR(E$5),MONTH(E$5),1),GCampaign,$B17,GAdgroup,$A17,GDevice,$J$2)))","v":503.78},{"$f":"IF($E$2=\"None\",SUMIFS(INDIRECT(\"G\"&$D$2),GDate,\"<=\"&F$5,GDate,\">=\"&DATE(YEAR(F$5),MONTH(F$5),1),GCampaign,$B17,GAdgroup,$A17,GDevice,$J$2),IF(SUMIFS(INDIRECT(\"G\"&$E$2),GDate,\"<=\"&F$5,GDate,\">=\"&DATE(YEAR(F$5),MONTH(F$5),1),GCampaign,$B17,GAdgroup,$A17,GDevice,$J$2)=0,0,SUMIFS(INDIRECT(\"G\"&$D$2),GDate,\"<=\"&F$5,GDate,\">=\"&DATE(YEAR(F$5),MONTH(F$5),1),GCampaign,$B17,GAdgroup,$A17,GDevice,$J$2)/SUMIFS(INDIRECT(\"G\"&$E$2),GDate,\"<=\"&F$5,GDate,\">=\"&DATE(YEAR(F$5),MONTH(F$5),1),GCampaign,$B17,GAdgroup,$A17,GDevice,$J$2)))","v":431.07},{"$f":"IF($E$2=\"None\",SUMIFS(INDIRECT(\"G\"&$D$2),GDate,\"<=\"&G$5,GDate,\">=\"&DATE(YEAR(G$5),MONTH(G$5),1),GCampaign,$B17,GAdgroup,$A17,GDevice,$J$2),IF(SUMIFS(INDIRECT(\"G\"&$E$2),GDate,\"<=\"&G$5,GDate,\">=\"&DATE(YEAR(G$5),MONTH(G$5),1),GCampaign,$B17,GAdgroup,$A17,GDevice,$J$2)=0,0,SUMIFS(INDIRECT(\"G\"&$D$2),GDate,\"<=\"&G$5,GDate,\">=\"&DATE(YEAR(G$5),MONTH(G$5),1),GCampaign,$B17,GAdgroup,$A17,GDevice,$J$2)/SUMIFS(INDIRECT(\"G\"&$E$2),GDate,\"<=\"&G$5,GDate,\">=\"&DATE(YEAR(G$5),MONTH(G$5),1),GCampaign,$B17,GAdgroup,$A17,GDevice,$J$2)))","v":712.08999999999992},{"$f":"IF($E$2=\"None\",SUMIFS(INDIRECT(\"G\"&$D$2),GDate,\"<=\"&H$5,GDate,\">=\"&DATE(YEAR(H$5),MONTH(H$5),1),GCampaign,$B17,GAdgroup,$A17,GDevice,$J$2),IF(SUMIFS(INDIRECT(\"G\"&$E$2),GDate,\"<=\"&H$5,GDate,\">=\"&DATE(YEAR(H$5),MONTH(H$5),1),GCampaign,$B17,GAdgroup,$A17,GDevice,$J$2)=0,0,SUMIFS(INDIRECT(\"G\"&$D$2),GDate,\"<=\"&H$5,GDate,\">=\"&DATE(YEAR(H$5),MONTH(H$5),1),GCampaign,$B17,GAdgroup,$A17,GDevice,$J$2)/SUMIFS(INDIRECT(\"G\"&$E$2),GDate,\"<=\"&H$5,GDate,\">=\"&DATE(YEAR(H$5),MONTH(H$5),1),GCampaign,$B17,GAdgroup,$A17,GDevice,$J$2)))","v":1275.0999999999999},{"$f":"IF($E$2=\"None\",SUMIFS(INDIRECT(\"G\"&$D$2),GDate,\"<=\"&I$5,GDate,\">=\"&DATE(YEAR(I$5),MONTH(I$5),1),GCampaign,$B17,GAdgroup,$A17,GDevice,$J$2),IF(SUMIFS(INDIRECT(\"G\"&$E$2),GDate,\"<=\"&I$5,GDate,\">=\"&DATE(YEAR(I$5),MONTH(I$5),1),GCampaign,$B17,GAdgroup,$A17,GDevice,$J$2)=0,0,SUMIFS(INDIRECT(\"G\"&$D$2),GDate,\"<=\"&I$5,GDate,\">=\"&DATE(YEAR(I$5),MONTH(I$5),1),GCampaign,$B17,GAdgroup,$A17,GDevice,$J$2)/SUMIFS(INDIRECT(\"G\"&$E$2),GDate,\"<=\"&I$5,GDate,\">=\"&DATE(YEAR(I$5),MONTH(I$5),1),GCampaign,$B17,GAdgroup,$A17,GDevice,$J$2)))","v":1987.5700000000002},{"$f":"IF($E$2=\"None\",SUMIFS(INDIRECT(\"G\"&$D$2),GDate,\"<=\"&J$5,GDate,\">=\"&DATE(YEAR(J$5),MONTH(J$5),1),GCampaign,$B17,GAdgroup,$A17,GDevice,$J$2),IF(SUMIFS(INDIRECT(\"G\"&$E$2),GDate,\"<=\"&J$5,GDate,\">=\"&DATE(YEAR(J$5),MONTH(J$5),1),GCampaign,$B17,GAdgroup,$A17,GDevice,$J$2)=0,0,SUMIFS(INDIRECT(\"G\"&$D$2),GDate,\"<=\"&J$5,GDate,\">=\"&DATE(YEAR(J$5),MONTH(J$5),1),GCampaign,$B17,GAdgroup,$A17,GDevice,$J$2)/SUMIFS(INDIRECT(\"G\"&$E$2),GDate,\"<=\"&J$5,GDate,\">=\"&DATE(YEAR(J$5),MONTH(J$5),1),GCampaign,$B17,GAdgroup,$A17,GDevice,$J$2)))","v":1477.67},{"$f":"IF($E$2=\"None\",SUMIFS(INDIRECT(\"G\"&$D$2),GDate,\"<=\"&K$5,GDate,\">=\"&DATE(YEAR(K$5),MONTH(K$5),1),GCampaign,$B17,GAdgroup,$A17,GDevice,$J$2),IF(SUMIFS(INDIRECT(\"G\"&$E$2),GDate,\"<=\"&K$5,GDate,\">=\"&DATE(YEAR(K$5),MONTH(K$5),1),GCampaign,$B17,GAdgroup,$A17,GDevice,$J$2)=0,0,SUMIFS(INDIRECT(\"G\"&$D$2),GDate,\"<=\"&K$5,GDate,\">=\"&DATE(YEAR(K$5),MONTH(K$5),1),GCampaign,$B17,GAdgroup,$A17,GDevice,$J$2)/SUMIFS(INDIRECT(\"G\"&$E$2),GDate,\"<=\"&K$5,GDate,\">=\"&DATE(YEAR(K$5),MONTH(K$5),1),GCampaign,$B17,GAdgroup,$A17,GDevice,$J$2)))","v":766.23},{"$f":"IF($E$2=\"None\",SUMIFS(INDIRECT(\"G\"&$D$2),GDate,\"<=\"&L$5,GDate,\">=\"&DATE(YEAR(L$5),MONTH(L$5),1),GCampaign,$B17,GAdgroup,$A17,GDevice,$J$2),IF(SUMIFS(INDIRECT(\"G\"&$E$2),GDate,\"<=\"&L$5,GDate,\">=\"&DATE(YEAR(L$5),MONTH(L$5),1),GCampaign,$B17,GAdgroup,$A17,GDevice,$J$2)=0,0,SUMIFS(INDIRECT(\"G\"&$D$2),GDate,\"<=\"&L$5,GDate,\">=\"&DATE(YEAR(L$5),MONTH(L$5),1),GCampaign,$B17,GAdgroup,$A17,GDevice,$J$2)/SUMIFS(INDIRECT(\"G\"&$E$2),GDate,\"<=\"&L$5,GDate,\">=\"&DATE(YEAR(L$5),MONTH(L$5),1),GCampaign,$B17,GAdgroup,$A17,GDevice,$J$2)))","v":1140.92},{"$f":"IF($E$2=\"None\",SUMIFS(INDIRECT(\"G\"&$D$2),GDate,\"<=\"&M$5,GDate,\">=\"&DATE(YEAR(M$5),MONTH(M$5),1),GCampaign,$B17,GAdgroup,$A17,GDevice,$J$2),IF(SUMIFS(INDIRECT(\"G\"&$E$2),GDate,\"<=\"&M$5,GDate,\">=\"&DATE(YEAR(M$5),MONTH(M$5),1),GCampaign,$B17,GAdgroup,$A17,GDevice,$J$2)=0,0,SUMIFS(INDIRECT(\"G\"&$D$2),GDate,\"<=\"&M$5,GDate,\">=\"&DATE(YEAR(M$5),MONTH(M$5),1),GCampaign,$B17,GAdgroup,$A17,GDevice,$J$2)/SUMIFS(INDIRECT(\"G\"&$E$2),GDate,\"<=\"&M$5,GDate,\">=\"&DATE(YEAR(M$5),MONTH(M$5),1),GCampaign,$B17,GAdgroup,$A17,GDevice,$J$2)))","v":962.42},{"$f":"IF($E$2=\"None\",SUMIFS(INDIRECT(\"G\"&$D$2),GDate,\"<=\"&N$5,GDate,\">=\"&DATE(YEAR(N$5),MONTH(N$5),1),GCampaign,$B17,GAdgroup,$A17,GDevice,$J$2),IF(SUMIFS(INDIRECT(\"G\"&$E$2),GDate,\"<=\"&N$5,GDate,\">=\"&DATE(YEAR(N$5),MONTH(N$5),1),GCampaign,$B17,GAdgroup,$A17,GDevice,$J$2)=0,0,SUMIFS(INDIRECT(\"G\"&$D$2),GDate,\"<=\"&N$5,GDate,\">=\"&DATE(YEAR(N$5),MONTH(N$5),1),GCampaign,$B17,GAdgroup,$A17,GDevice,$J$2)/SUMIFS(INDIRECT(\"G\"&$E$2),GDate,\"<=\"&N$5,GDate,\">=\"&DATE(YEAR(N$5),MONTH(N$5),1),GCampaign,$B17,GAdgroup,$A17,GDevice,$J$2)))","v":1083.68}]
["Ad Group 5.3","Campaign 5",{"$f":"IF($E$2=\"None\",SUMIFS(INDIRECT(\"G\"&$D$2),GDate,\"<=\"&C$5,GDate,\">=\"&DATE(YEAR(C$5),MONTH(C$5),1),GCampaign,$B18,GAdgroup,$A18,GDevice,$J$2),IF(SUMIFS(INDIRECT(\"G\"&$E$2),GDate,\"<=\"&C$5,GDate,\">=\"&DATE(YEAR(C$5),MONTH(C$5),1),GCampaign,$B18,GAdgroup,$A18,GDevice,$J$2)=0,0,SUMIFS(INDIRECT(\"G\"&$D$2),GDate,\"<=\"&C$5,GDate,\">=\"&DATE(YEAR(C$5),MONTH(C$5),1),GCampaign,$B18,GAdgroup,$A18,GDevice,$J$2)/SUMIFS(INDIRECT(\"G\"&$E$2),GDate,\"<=\"&C$5,GDate,\">=\"&DATE(YEAR(C$5),MONTH(C$5),1),GCampaign,$B18,GAdgroup,$A18,GDevice,$J$2)))","v":680.73},{"$f":"IF($E$2=\"None\",SUMIFS(INDIRECT(\"G\"&$D$2),GDate,\"<=\"&D$5,GDate,\">=\"&DATE(YEAR(D$5),MONTH(D$5),1),GCampaign,$B18,GAdgroup,$A18,GDevice,$J$2),IF(SUMIFS(INDIRECT(\"G\"&$E$2),GDate,\"<=\"&D$5,GDate,\">=\"&DATE(YEAR(D$5),MONTH(D$5),1),GCampaign,$B18,GAdgroup,$A18,GDevice,$J$2)=0,0,SUMIFS(INDIRECT(\"G\"&$D$2),GDate,\"<=\"&D$5,GDate,\">=\"&DATE(YEAR(D$5),MONTH(D$5),1),GCampaign,$B18,GAdgroup,$A18,GDevice,$J$2)/SUMIFS(INDIRECT(\"G\"&$E$2),GDate,\"<=\"&D$5,GDate,\">=\"&DATE(YEAR(D$5),MONTH(D$5),1),GCampaign,$B18,GAdgroup,$A18,GDevice,$J$2)))","v":1228.8499999999999},{"$f":"IF($E$2=\"None\",SUMIFS(INDIRECT(\"G\"&$D$2),GDate,\"<=\"&E$5,GDate,\">=\"&DATE(YEAR(E$5),MONTH(E$5),1),GCampaign,$B18,GAdgroup,$A18,GDevice,$J$2),IF(SUMIFS(INDIRECT(\"G\"&$E$2),GDate,\"<=\"&E$5,GDate,\">=\"&DATE(YEAR(E$5),MONTH(E$5),1),GCampaign,$B18,GAdgroup,$A18,GDevice,$J$2)=0,0,SUMIFS(INDIRECT(\"G\"&$D$2),GDate,\"<=\"&E$5,GDate,\">=\"&DATE(YEAR(E$5),MONTH(E$5),1),GCampaign,$B18,GAdgroup,$A18,GDevice,$J$2)/SUMIFS(INDIRECT(\"G\"&$E$2),GDate,\"<=\"&E$5,GDate,\">=\"&DATE(YEAR(E$5),MONTH(E$5),1),GCampaign,$B18,GAdgroup,$A18,GDevice,$J$2)))","v":1437.21},{"$f":"IF($E$2=\"None\",SUMIFS(INDIRECT(\"G\"&$D$2),GDate,\"<=\"&F$5,GDate,\">=\"&DATE(YEAR(F$5),MONTH(F$5),1),GCampaign,$B18,GAdgroup,$A18,GDevice,$J$2),IF(SUMIFS(INDIRECT(\"G\"&$E$2),GDate,\"<=\"&F$5,GDate,\">=\"&DATE(YEAR(F$5),MONTH(F$5),1),GCampaign,$B18,GAdgroup,$A18,GDevice,$J$2)=0,0,SUMIFS(INDIRECT(\"G\"&$D$2),GDate,\"<=\"&F$5,GDate,\">=\"&DATE(YEAR(F$5),MONTH(F$5),1),GCampaign,$B18,GAdgroup,$A18,GDevice,$J$2)/SUMIFS(INDIRECT(\"G\"&$E$2),GDate,\"<=\"&F$5,GDate,\">=\"&DATE(YEAR(F$5),MONTH(F$5),1),GCampaign,$B18,GAdgroup,$A18,GDevice,$J$2)))","v":1292.48},{"$f":"IF($E$2=\"None\",SUMIFS(INDIRECT(\"G\"&$D$2),GDate,\"<=\"&G$5,GDate,\">=\"&DATE(YEAR(G$5),MONTH(G$5),1),GCampaign,$B18,GAdgroup,$A18,GDevice,$J$2),IF(SUMIFS(INDIRECT(\"G\"&$E$2),GDate,\"<=\"&G$5,GDate,\">=\"&DATE(YEAR(G$5),MONTH(G$5),1),GCampaign,$B18,GAdgroup,$A18,GDevice,$J$2)=0,0,SUMIFS(INDIRECT(\"G\"&$D$2),GDate,\"<=\"&G$5,GDate,\">=\"&DATE(YEAR(G$5),MONTH(G$5),1),GCampaign,$B18,GAdgroup,$A18,GDevice,$J$2)/SUMIFS(INDIRECT(\"G\"&$E$2),GDate,\"<=\"&G$5,GDate,\">=\"&DATE(YEAR(G$5),MONTH(G$5),1),GCampaign,$B18,GAdgroup,$A18,GDevice,$J$2)))","v":723.55000000000007},{"$f":"IF($E$2=\"None\",SUMIFS(INDIRECT(\"G\"&$D$2),GDate,\"<=\"&H$5,GDate,\">=\"&DATE(YEAR(H$5),MONTH(H$5),1),GCampaign,$B18,GAdgroup,$A18,GDevice,$J$2),IF(SUMIFS(INDIRECT(\"G\"&$E$2),GDate,\"<=\"&H$5,GDate,\">=\"&DATE(YEAR(H$5),MONTH(H$5),1),GCampaign,$B18,GAdgroup,$A18,GDevice,$J$2)=0,0,SUMIFS(INDIRECT(\"G\"&$D$2),GDate,\"<=\"&H$5,GDate,\">=\"&DATE(YEAR(H$5),MONTH(H$5),1),GCampaign,$B18,GAdgroup,$A18,GDevice,$J$2)/SUMIFS(INDIRECT(\"G\"&$E$2),GDate,\"<=\"&H$5,GDate,\">=\"&DATE(YEAR(H$5),MONTH(H$5),1),GCampaign,$B18,GAdgroup,$A18,GDevice,$J$2)))","v":791.68000000000006},{"$f":"IF($E$2=\"None\",SUMIFS(INDIRECT(\"G\"&$D$2),GDate,\"<=\"&I$5,GDate,\">=\"&DATE(YEAR(I$5),MONTH(I$5),1),GCampaign,$B18,GAdgroup,$A18,GDevice,$J$2),IF(SUMIFS(INDIRECT(\"G\"&$E$2),GDate,\"<=\"&I$5,GDate,\">=\"&DATE(YEAR(I$5),MONTH(I$5),1),GCampaign,$B18,GAdgroup,$A18,GDevice,$J$2)=0,0,SUMIFS(INDIRECT(\"G\"&$D$2),GDate,\"<=\"&I$5,GDate,\">=\"&DATE(YEAR(I$5),MONTH(I$5),1),GCampaign,$B18,GAdgroup,$A18,GDevice,$J$2)/SUMIFS(INDIRECT(\"G\"&$E$2),GDate,\"<=\"&I$5,GDate,\">=\"&DATE(YEAR(I$5),MONTH(I$5),1),GCampaign,$B18,GAdgroup,$A18,GDevice,$J$2)))","v":803.8900000000001},{"$f":"IF($E$2=\"None\",SUMIFS(INDIRECT(\"G\"&$D$2),GDate,\"<=\"&J$5,GDate,\">=\"&DATE(YEAR(J$5),MONTH(J$5),1),GCampaign,$B18,GAdgroup,$A18,GDevice,$J$2),IF(SUMIFS(INDIRECT(\"G\"&$E$2),GDate,\"<=\"&J$5,GDate,\">=\"&DATE(YEAR(J$5),MONTH(J$5),1),GCampaign,$B18,GAdgroup,$A18,GDevice,$J$2)=0,0,SUMIFS(INDIRECT(\"G\"&$D$2),GDate,\"<=\"&J$5,GDate,\">=\"&DATE(YEAR(J$5),MONTH(J$5),1),GCampaign,$B18,GAdgroup,$A18,GDevice,$J$2)/SUMIFS(INDIRECT(\"G\"&$E$2),GDate,\"<=\"&J$5,GDate,\">=\"&DATE(YEAR(J$5),MONTH(J$5),1),GCampaign,$B18,GAdgroup,$A18,GDevice,$J$2)))","v":844.07},{"$f":"IF($E$2=\"None\",SUMIFS(INDIRECT(\"G\"&$D$2),GDate,\"<=\"&K$5,GDate,\">=\"&DATE(YEAR(K$5),MONTH(K$5),1),GCampaign,$B18,GAdgroup,$A18,GDevice,$J$2),IF(SUMIFS(INDIRECT(\"G\"&$E$2),GDate,\"<=\"&K$5,GDate,\">=\"&DATE(YEAR(K$5),MONTH(K$5),1),GCampaign,$B18,GAdgroup,$A18,GDevice,$J$2)=0,0,SUMIFS(INDIRECT(\"G\"&$D$2),GDate,\"<=\"&K$5,GDate,\">=\"&DATE(YEAR(K$5),MONTH(K$5),1),GCampaign,$B18,GAdgroup,$A18,GDevice,$J$2)/SUMIFS(INDIRECT(\"G\"&$E$2),GDate,\"<=\"&K$5,GDate,\">=\"&DATE(YEAR(K$5),MONTH(K$5),1),GCampaign,$B18,GAdgroup,$A18,GDevice,$J$2)))","v":568.32999999999993},{"$f":"IF($E$2=\"None\",SUMIFS(INDIRECT(\"G\"&$D$2),GDate,\"<=\"&L$5,GDate,\">=\"&DATE(YEAR(L$5),MONTH(L$5),1),GCampaign,$B18,GAdgroup,$A18,GDevice,$J$2),IF(SUMIFS(INDIRECT(\"G\"&$E$2),GDate,\"<=\"&L$5,GDate,\">=\"&DATE(YEAR(L$5),MONTH(L$5),1),GCampaign,$B18,GAdgroup,$A18,GDevice,$J$2)=0,0,SUMIFS(INDIRECT(\"G\"&$D$2),GDate,\"<=\"&L$5,GDate,\">=\"&DATE(YEAR(L$5),MONTH(L$5),1),GCampaign,$B18,GAdgroup,$A18,GDevice,$J$2)/SUMIFS(INDIRECT(\"G\"&$E$2),GDate,\"<=\"&L$5,GDate,\">=\"&DATE(YEAR(L$5),MONTH(L$5),1),GCampaign,$B18,GAdgroup,$A18,GDevice,$J$2)))","v":557.41000000000008},{"$f":"IF($E$2=\"None\",SUMIFS(INDIRECT(\"G\"&$D$2),GDate,\"<=\"&M$5,GDate,\">=\"&DATE(YEAR(M$5),MONTH(M$5),1),GCampaign,$B18,GAdgroup,$A18,GDevice,$J$2),IF(SUMIFS(INDIRECT(\"G\"&$E$2),GDate,\"<=\"&M$5,GDate,\">=\"&DATE(YEAR(M$5),MONTH(M$5),1),GCampaign,$B18,GAdgroup,$A18,GDevice,$J$2)=0,0,SUMIFS(INDIRECT(\"G\"&$D$2),GDate,\"<=\"&M$5,GDate,\">=\"&DATE(YEAR(M$5),MONTH(M$5),1),GCampaign,$B18,GAdgroup,$A18,GDevice,$J$2)/SUMIFS(INDIRECT(\"G\"&$E$2),GDate,\"<=\"&M$5,GDate,\">=\"&DATE(YEAR(M$5),MONTH(M$5),1),GCampaign,$B18,GAdgroup,$A18,GDevice,$J$2)))","v":1117.21},{"$f":"IF($E$2=\"None\",SUMIFS(INDIRECT(\"G\"&$D$2),GDate,\"<=\"&N$5,GDate,\">=\"&DATE(YEAR(N$5),MONTH(N$5),1),GCampaign,$B18,GAdgroup,$A18,GDevice,$J$2),IF(SUMIFS(INDIRECT(\"G\"&$E$2),GDate,\"<=\"&N$5,GDate,\">=\"&DATE(YEAR(N$5),MONTH(N$5),1),GCampaign,$B18,GAdgroup,$A18,GDevice,$J$2)=0,0,SUMIFS(INDIRECT(\"G\"&$D$2),GDate,\"<=\"&N$5,GDate,\">=\"&DATE(YEAR(N$5),MONTH(N$5),1),GCampaign,$B18,GAdgroup,$A18,GDevice,$J$2)/SUMIFS(INDIRECT(\"G\"&$E$2),GDate,\"<=\"&N$5,GDate,\">=\"&DATE(YEAR(N$5),MONTH(N$5),1),GCampaign,$B18,GAdgroup,$A18,GDevice,$J$2)))","v":941.34999999999991}]

{"sheet":"CamCharts","index":7,"n_rows":19,"n_cols":12,"rows_kept":19,"cut":false,"hidden":true,"merged":[[1,9,1,10],[0,9,0,10]]}
["Google Adwords - Monthly Statistics",null,null,null,null,null,null,"Device:",null,"Select a campaign:"]
["Campaign Summary",null,null,null,null,null,null,null,{"$f":"IF(ISBLANK($H$2),\"*\",$H$2)","v":"*"},null,null,{"$f":"IF(ISBLANK($J$2),\"*\",$J$2)","v":"*"}]
["© www.excel-skills.com",{"$f":"B4&\"-None\"&\"*N0\"","v":"Impressions-None*N0"},{"$f":"C4&\"-None\"&\"*N0\"","v":"Clicks-None*N0"},{"$f":"$C$4&\"-\"&$B$4&\"*P1\"","v":"Clicks-Impressions*P1"},{"$f":"E4&\"-None\"&\"*N0\"","v":"Cost-None*N0"},{"$f":"$E$4&\"-\"&$C$4&\"*N2\"","v":"Cost-Clicks*N2"},{"$f":"G4&\"-None\"&\"*N0\"","v":"Conversions-None*N0"},{"$f":"H4&\"-None\"&\"*N0\"","v":"Revenue-None*N0"},{"$f":"$E$4&\"-\"&$G$4&\"*N2\"","v":"Cost-Conversions*N2"},{"$f":"$G$4&\"-\"&$C$4&\"*P1\"","v":"Conversions-Clicks*P1"},{"$f":"$H$4&\"-\"&$E$4&\"*N2\"","v":"Revenue-Cost*N2"}]
["Month","Impressions","Clicks","CTR","Cost","CPC","Conversions","Revenue","Cost / Conv","Conv Rate","ROI"]
[{"$f":"DATE(YEAR(Setup!$B$4),MONTH(Setup!$B$4)+1,0)","v":"2021-04-30"},{"$f":"SUMIFS(GImpressions,GDate,\"<=\"&$A5,GDate,\">=\"&DATE(YEAR($A5),MONTH($A5),1),GCampaign,$L$2,GDevice,$I$2)","v":29144},{"$f":"SUMIFS(GClicks,GDate,\"<=\"&$A5,GDate,\">=\"&DATE(YEAR($A5),MONTH($A5),1),GCampaign,$L$2,GDevice,$I$2)","v":2695},{"$f":"IF(B5=0,0,C5/B5)","v":9.2471863848476527E-2},{"$f":"SUMIFS(GCost,GDate,\"<=\"&$A5,GDate,\">=\"&DATE(YEAR($A5),MONTH($A5),1),GCampaign,$L$2,GDevice,$I$2)","v":4545.26},{"$f":"IF(C5=0,0,E5/C5)","v":1.6865528756957329},{"$f":"SUMIFS(GConversions,GDate,\"<=\"&$A5,GDate,\">=\"&DATE(YEAR($A5),MONTH($A5),1),GCampaign,$L$2,GDevice,$I$2)","v":285},{"$f":"SUMIFS(GRevenue,GDate,\"<=\"&$A5,GDate,\">=\"&DATE(YEAR($A5),MONTH($A5),1),GCampaign,$L$2,GDevice,$I$2)","v":10211},{"$f":"IF(G5=0,0,E5/G5)","v":15.948280701754387},{"$f":"IF(C5=0,0,G5/C5)","v":0.10575139146567718},{"$f":"IF(E5=0,0,H5/E5)","v":2.2465161508912579}]
[{"$f":"DATE(YEAR(A5),MONTH(A5),0)","v":"2021-03-31"},65942,4153,{"$f":"IF(B6=0,0,C6/B6)","v":6.2979588122895877E-2},6045.9900000000016,{"$f":"IF(C6=0,0,E6/C6)","v":1.4558126655429813},480,17445,12.595812500000003,0.11557909944618348,2.8853835352026707]
[{"$f":"DATE(YEAR(A6),MONTH(A6),0)","v":"2021-02-28"},75921,3502,4.612689506197231E-2,6306.6799999999994,1.8008794974300397,431,15750,14.632668213457075,0.12307252998286693,2.4973520140549388]
["2021-01-31",126491,4187,3.3101169253148446E-2,6638.18,1.5854263195605447,503,18233,13.197176938369783,0.12013374731311201,2.7466865918067902]
["2020-12-31",90999,2729,2.9989340542203761E-2,4116.46,1.5084133382191278,335,12032,12.287940298507463,0.12275558812751924,2.9228997731060185]
["2020-11-30",170267,5170,3.0364075246524576E-2,7953.91,1.5384738878143134,624,22734,12.74665064102564,0.1206963249516441,2.8582169021273813]
["2020-10-31",226854,6746,2.9737187794793125E-2,9987.4199999999964,1.4804951082122735,805,29071,12.406732919254654,0.1193299733175215,2.9107617382667406]
["2020-09-30",191212,5701,2.9815074367717506E-2,8527.4,1.495772671461147,698,25187,12.216905444126073,0.12243466058586212,2.953655275934048]
["2020-08-31",192091,6167,3.2104575435600836E-2,8309.0300000000007,1.3473374412193937,766,27853,10.84729765013055,0.12420950218907086,3.3521361699259717]
["2020-07-31",177311,5623,3.1712640501717321E-2,8025.6399999999994,1.4272879245954115,696,25331,11.531091954022987,0.12377734305530855,3.1562591892982992]
["2020-06-30",170065,5969,3.509834475053656E-2,10720.079999999998,1.7959591221310098,772,28658,13.886113989637304,0.12933489696766629,2.6733009455153325]
["2020-05-31",123750,3625,2.9292929292929294E-2,8134.9600000000009,2.2441268965517245,499,18796,16.302525050100201,0.1376551724137931,2.3105215022569254]
["2020-04-30",87532,2700,{"$f":"IF(B17=0,0,C17/B17)","v":3.0845862084723299E-2},4679.42,{"$f":"IF(C17=0,0,E17/C17)","v":1.7331185185185185},355,13266,13.181464788732395,0.13148148148148148,2.83496672664561]
["2020-03-31",76600,2063,2.6932114882506526E-2,3129.7499999999991,1.517086766844401,252,9063,12.419642857142854,0.1221522055259331,2.8957584471603171]
["Total",{"$f":"SUM(B5:B18)","v":1804179},{"$f":"SUM(C5:C18)","v":61030},3.3827020489652082E-2,97120.180000000008,1.5913514664918893,7501,273630,12.947630982535664,0.12290676716368999,2.8174371176000701]

{"sheet":"AgCharts","index":8,"n_rows":19,"n_cols":12,"rows_kept":19,"cut":false,"hidden":true,"merged":[[0,9,0,10],[1,9,1,10],[0,4,0,5],[1,4,1,5]]}
["Google Adwords - Monthly Statistics",null,null,null,"Campaign:",null,null,"Device:",null,"Select Ad Group:"]
["Campaign Summary",null,null,null,{"$f":"CamCharts!$L$2","v":"*"},null,null,null,{"$f":"IF(ISBLANK($H$2),\"*\",$H$2)","v":"*"},null,null,{"$f":"IF(ISBLANK($J$2),\"*\",$J$2)","v":"*"}]
["© www.excel-skills.com"]
["Month","Impressions","Clicks","CTR","Cost","CPC","Conversions","Revenue","Cost / Conv","Conv Rate","ROI"]
[{"$f":"DATE(YEAR(Setup!$B$4),MONTH(Setup!$B$4)+1,0)","v":"2021-04-30"},{"$f":"SUMIFS(GImpressions,GDate,\"<=\"&$A5,GDate,\">=\"&DATE(YEAR($A5),MONTH($A5),1),GCampaign,$E$2,GAdgroup,$L$2,GDevice,$I$2)","v":29144},{"$f":"SUMIFS(GClicks,GDate,\"<=\"&$A5,GDate,\">=\"&DATE(YEAR($A5),MONTH($A5),1),GCampaign,$E$2,GAdgroup,$L$2,GDevice,$I$2)","v":2695},{"$f":"IF(B5=0,0,C5/B5)","v":9.2471863848476527E-2},{"$f":"SUMIFS(GCost,GDate,\"<=\"&$A5,GDate,\">=\"&DATE(YEAR($A5),MONTH($A5),1),GCampaign,$E$2,GAdgroup,$L$2,GDevice,$I$2)","v":4545.26},{"$f":"IF(C5=0,0,E5/C5)","v":1.6865528756957329},{"$f":"SUMIFS(GConversions,GDate,\"<=\"&$A5,GDate,\">=\"&DATE(YEAR($A5),MONTH($A5),1),GCampaign,$E$2,GAdgroup,$L$2,GDevice,$I$2)","v":285},{"$f":"SUMIFS(GRevenue,GDate,\"<=\"&$A5,GDate,\">=\"&DATE(YEAR($A5),MONTH($A5),1),GCampaign,$E$2,GAdgroup,$L$2,GDevice,$I$2)","v":10211},{"$f":"IF(G5=0,0,E5/G5)","v":15.948280701754387},{"$f":"IF(C5=0,0,G5/C5)","v":0.10575139146567718},{"$f":"IF(E5=0,0,H5/E5)","v":2.2465161508912579}]
[{"$f":"DATE(YEAR(A5),MONTH(A5),0)","v":"2021-03-31"},65942,4153,{"$f":"IF(B6=0,0,C6/B6)","v":6.2979588122895877E-2},6045.9900000000016,{"$f":"IF(C6=0,0,E6/C6)","v":1.4558126655429813},480,17445,12.595812500000003,0.11557909944618348,2.8853835352026707]
[{"$f":"DATE(YEAR(A6),MONTH(A6),0)","v":"2021-02-28"},75921,3502,4.612689506197231E-2,6306.6799999999994,1.8008794974300397,431,15750,14.632668213457075,0.12307252998286693,2.4973520140549388]
["2021-01-31",126491,4187,3.3101169253148446E-2,6638.18,1.5854263195605447,503,18233,13.197176938369783,0.12013374731311201,2.7466865918067902]
["2020-12-31",90999,2729,2.9989340542203761E-2,4116.46,1.5084133382191278,335,12032,12.287940298507463,0.12275558812751924,2.9228997731060185]
["2020-11-30",170267,5170,3.0364075246524576E-2,7953.91,1.5384738878143134,624,22734,12.74665064102564,0.1206963249516441,2.8582169021273813]
["2020-10-31",226854,6746,2.9737187794793125E-2,9987.4199999999964,1.4804951082122735,805,29071,12.406732919254654,0.1193299733175215,2.9107617382667406]
["2020-09-30",191212,5701,2.9815074367717506E-2,8527.4,1.495772671461147,698,25187,12.216905444126073,0.12243466058586212,2.953655275934048]
["2020-08-31",192091,6167,3.2104575435600836E-2,8309.0300000000007,1.3473374412193937,766,27853,10.84729765013055,0.12420950218907086,3.3521361699259717]
["2020-07-31",177311,5623,3.1712640501717321E-2,8025.6399999999994,1.4272879245954115,696,25331,11.531091954022987,0.12377734305530855,3.1562591892982992]
["2020-06-30",170065,5969,3.509834475053656E-2,10720.079999999998,1.7959591221310098,772,28658,13.886113989637304,0.12933489696766629,2.6733009455153325]
["2020-05-31",123750,3625,2.9292929292929294E-2,8134.9600000000009,2.2441268965517245,499,18796,16.302525050100201,0.1376551724137931,2.3105215022569254]
["2020-04-30",87532,2700,3.0845862084723299E-2,4679.42,1.7331185185185185,355,13266,13.181464788732395,0.13148148148148148,2.83496672664561]
["2020-03-31",76600,2063,2.6932114882506526E-2,3129.7499999999991,1.517086766844401,252,9063,12.419642857142854,0.1221522055259331,2.8957584471603171]
["Total",{"$f":"SUM(B5:B18)","v":1804179},{"$f":"SUM(C5:C18)","v":61030},{"$f":"IF(B19=0,0,C19/B19)","v":3.3827020489652082E-2},97120.180000000008,{"$f":"IF(C19=0,0,E19/C19)","v":1.5913514664918893},7501,273630,12.947630982535664,0.12290676716368999,2.8174371176000701]