{"text_format":"1","workbook":"xlsx","n_sheets":9,"sheets":["Info","Trial","Instructions","Setup","Data","Campaigns","AdGroups","CamCharts","AgCharts"],"not_rendered":{"charts":16,"images":3,"macros":1,"external_links":0,"defined_names":25,"comments":0,"pivot_tables":0},"unopened":[],"bounds":{"document_bytes":16777216,"sheet_cells":100000,"rows_first":2000,"rows_last":500,"rows_between":2000,"halvings":0,"cell_chars":16384,"cell_head_chars":4096},"cells_cut":0,"cells_raw":0,"read":"whole","date_system":"1900"}

{"sheet":"Info","index":0,"n_rows":0,"n_cols":0,"rows_kept":0,"cut":false,"hidden":false,"merged":[]}

{"sheet":"Trial","index":1,"n_rows":0,"n_cols":0,"rows_kept":0,"cut":false,"hidden":true,"merged":[]}

{"sheet":"Instructions","index":2,"n_rows":127,"n_cols":1,"rows_kept":127,"cut":false,"hidden":true,"merged":[]}
["Excel Skills | Google Adwords - Monthly Statistics Template"]
["Instructions"]
["www.excel-skills.com"]
[]
["This template enables users to analyse their monthly Google Ads data on an overall, campaign, ad group and device level. The template can be used for any Ads account by adding all the relevant campaigns & ad group names to the template and copying the monthly Ads data from an Excel extract of their Ads account. The template includes a lot of automated calculations & charts which make it easy to spot trends in the data."]
[]
{"$rows_left_out":122}
{"sheet":"Setup","index":3,"n_rows":11,"n_cols":2,"rows_kept":11,"cut":false,"hidden":true,"merged":[]}
["Google Adwords - Monthly Statistics"]
["Setup"]
["© www.excel-skills.com"]
["Report Date","2021-04-30"]
[]
["Device List"]
{"$rows_left_out":6}
{"sheet":"Data","index":4,"n_rows":529,"n_cols":9,"rows_kept":529,"cut":false,"hidden":true,"merged":[]}
["Google Adwords - Monthly Statistics"]
["Import Data"]
["© www.excel-skills.com"]
["Month","Campaign","Ad Group","Device","Clicks","Impressions","Cost","Conversions","Total Conv. Value"]
["2020-01-01","Campaign 1","Ad Group 1.1","Desktop",80,9758,24.74,19,741]
["2020-01-01","Campaign 1","Ad Group 1.1","Mobile",34,2927,13.61,8,356]
{"$rows_left_out":524}
{"sheet":"Campaigns","index":5,"n_rows":11,"n_cols":13,"rows_kept":11,"cut":false,"hidden":true,"merged":[[1,11,1,12],[0,11,0,12]]}
["Google Adwords - Monthly Statistics",null,null,null,null,null,null,null,null,"Device:",null,"Select values to display:"]
["Campaigns",null,null,{"$f":"IF(AND($L$2=\"Cost\",$K$2=\"*\"),IF(ROUND(SUM(OFFSET($B$6,1,0,CampCount,COLUMN($M$5)-1)),2)=ROUND(SUMIFS(GCost,GDate,\"<=\"&$B$5,GDate,\">=\"&DATE(YEAR($M$5),MONTH($M$5),1)),2),\"ok\",\"error!\"),\"ok\")","v":"ok"},{"$f":"IF(ISERROR(FIND(\"*\",$H$2)),\"error!\",MID($H$2,FIND(\"*\",$H$2)+1,LEN($H$2)-FIND(\"*\",$H$2)))","v":"N0"},{"$f":"IF(ISERROR(FIND(\"-\",$H$2)),\"error!\",MID($H$2,1,FIND(\"-\",$H$2)-1))","v":"Cost"},{"$f":"IF(ISERROR(FIND(\"-\",$H$2)),\"error!\",IF(ISERROR(FIND(\"*\",$H$2)),\"error!\",MID($H$2,FIND(\"-\",$H$2)+1,FIND(\"*\",$H$2)-1-FIND(\"-\",$H$2))))","v":"None"},{"$f":"IF(ISNA(MATCH($L$2,CTypeList,0)),\"Cost-None*N0\",OFFSET(CamCharts!$A$4,-1,MATCH($L$2,CTypeList,0),1,1))","v":"Cost-None*N0"},null,null,{"$f":"IF(ISBLANK($J$2),\"*\",$J$2)","v":"*"},"Cost"]
["© www.excel-skills.com"]
[{"$f":"IF(ISBLANK($L$2),\"Total Cost: \",\"Total \"&$L$2&\": \")","v":"Total Cost: "},{"$f":"IF($G$2=\"None\",SUMIFS(INDIRECT(\"G\"&$F$2),GDate,\"<=\"&B$5,GDate,\">=\"&DATE(YEAR(B$5),MONTH(B$5),1),GDevice,$K$2),IF(SUMIFS(INDIRECT(\"G\"&$G$2),GDate,\"<=\"&B$5,GDate,\">=\"&DATE(YEAR(B$5),MONTH(B$5),1),GDevice,$K$2)=0,0,SUMIFS(INDIRECT(\"G\"&$F$2),GDate,\"<=\"&B$5,GDate,\">=\"&DATE(YEAR(B$5),MONTH(B$5),1),GDevice,$K$2)/SUMIFS(INDIRECT(\"G\"&$G$2),GDate,\"<=\"&B$5,GDate,\">=\"&DATE(YEAR(B$5),MONTH(B$5),1),GDevice,$K$2)))","v":4545.26},{"$f":"IF($G$2=\"None\",SUMIFS(INDIRECT(\"G\"&$F$2),GDate,\"<=\"&C$5,GDate,\">=\"&DATE(YEAR(C$5),MONTH(C$5),1),GDevice,$K$2),IF(SUMIFS(INDIRECT(\"G\"&$G$2),GDate,\"<=\"&C$5,GDate,\">=\"&DATE(YEAR(C$5),MONTH(C$5),1),GDevice,$K$2)=0,0,SUMIFS(INDIRECT(\"G\"&$F$2),GDate,\"<=\"&C$5,GDate,\">=\"&DATE(YEAR(C$5),MONTH(C$5),1),GDevice,$K$2)/SUMIFS(INDIRECT(\"G\"&$G$2),GDate,\"<=\"&C$5,GDate,\">=\"&DATE(YEAR(C$5),MONTH(C$5),1),GDevice,$K$2)))","v":6045.9900000000016},{"$f":"IF($G$2=\"None\",SUMIFS(INDIRECT(\"G\"&$F$2),GDate,\"<=\"&D$5,GDate,\">=\"&DATE(YEAR(D$5),MONTH(D$5),1),GDevice,$K$2),IF(SUMIFS(INDIRECT(\"G\"&$G$2),GDate,\"<=\"&D$5,GDate,\">=\"&DATE(YEAR(D$5),MONTH(D$5),1),GDevice,$K$2)=0,0,SUMIFS(INDIRECT(\"G\"&$F$2),GDate,\"<=\"&D$5,GDate,\">=\"&DATE(YEAR(D$5),MONTH(D$5),1),GDevice,$K$2)/SUMIFS(INDIRECT(\"G\"&$G$2),GDate,\"<=\"&D$5,GDate,\">=\"&DATE(YEAR(D$5),MONTH(D$5),1),GDevice,$K$2)))","v":6306.6799999999994},{"$f":"IF($G$2=\"None\",SUMIFS(INDIRECT(\"G\"&$F$2),GDate,\"<=\"&E$5,GDate,\">=\"&DATE(YEAR(E$5),MONTH(E$5),1),GDevice,$K$2),IF(SUMIFS(INDIRECT(\"G\"&$G$2),GDate,\"<=\"&E$5,GDate,\">=\"&DATE(YEAR(E$5),MONTH(E$5),1),GDevice,$K$2)=0,0,SUMIFS(INDIRECT(\"G\"&$F$2),GDate,\"<=\"&E$5,GDate,\">=\"&DATE(YEAR(E$5),MONTH(E$5),1),GDevice,$K$2)/SUMIFS(INDIRECT(\"G\"&$G$2),GDate,\"<=\"&E$5,GDate,\">=\"&DATE(YEAR(E$5),MONTH(E$5),1),GDevice,$K$2)))","v":6638.18},{"$f":"IF($G$2=\"None\",SUMIFS(INDIRECT(\"G\"&$F$2),GDate,\"<=\"&F$5,GDate,\">=\"&DATE(YEAR(F$5),MONTH(F$5),1),GDevice,$K$2),IF(SUMIFS(INDIRECT(\"G\"&$G$2),GDate,\"<=\"&F$5,GDate,\">=\"&DATE(YEAR(F$5),MONTH(F$5),1),GDevice,$K$2)=0,0,SUMIFS(INDIRECT(\"G\"&$F$2),GDate,\"<=\"&F$5,GDate,\">=\"&DATE(YEAR(F$5),MONTH(F$5),1),GDevice,$K$2)/SUMIFS(INDIRECT(\"G\"&$G$2),GDate,\"<=\"&F$5,GDate,\">=\"&DATE(YEAR(F$5),MONTH(F$5),1),GDevice,$K$2)))","v":4116.46},{"$f":"IF($G$2=\"None\",SUMIFS(INDIRECT(\"G\"&$F$2),GDate,\"<=\"&G$5,GDate,\">=\"&DATE(YEAR(G$5),MONTH(G$5),1),GDevice,$K$2),IF(SUMIFS(INDIRECT(\"G\"&$G$2),GDate,\"<=\"&G$5,GDate,\">=\"&DATE(YEAR(G$5),MONTH(G$5),1),GDevice,$K$2)=0,0,SUMIFS(INDIRECT(\"G\"&$F$2),GDate,\"<=\"&G$5,GDate,\">=\"&DATE(YEAR(G$5),MONTH(G$5),1),GDevice,$K$2)/SUMIFS(INDIRECT(\"G\"&$G$2),GDate,\"<=\"&G$5,GDate,\">=\"&DATE(YEAR(G$5),MONTH(G$5),1),GDevice,$K$2)))","v":7953.91},{"$f":"IF($G$2=\"None\",SUMIFS(INDIRECT(\"G\"&$F$2),GDate,\"<=\"&H$5,GDate,\">=\"&DATE(YEAR(H$5),MONTH(H$5),1),GDevice,$K$2),IF(SUMIFS(INDIRECT(\"G\"&$G$2),GDate,\"<=\"&H$5,GDate,\">=\"&DATE(YEAR(H$5),MONTH(H$5),1),GDevice,$K$2)=0,0,SUMIFS(INDIRECT(\"G\"&$F$2),GDate,\"<=\"&H$5,GDate,\">=\"&DATE(YEAR(H$5),MONTH(H$5),1),GDevice,$K$2)/SUMIFS(INDIRECT(\"G\"&$G$2),GDate,\"<=\"&H$5,GDate,\">=\"&DATE(YEAR(H$5),MONTH(H$5),1),GDevice,$K$2)))","v":9987.4199999999964},{"$f":"IF($G$2=\"None\",SUMIFS(INDIRECT(\"G\"&$F$2),GDate,\"<=\"&I$5,GDate,\">=\"&DATE(YEAR(I$5),MONTH(I$5),1),GDevice,$K$2),IF(SUMIFS(INDIRECT(\"G\"&$G$2),GDate,\"<=\"&I$5,GDate,\">=\"&DATE(YEAR(I$5),MONTH(I$5),1),GDevice,$K$2)=0,0,SUMIFS(INDIRECT(\"G\"&$F$2),GDate,\"<=\"&I$5,GDate,\">=\"&DATE(YEAR(I$5),MONTH(I$5),1),GDevice,$K$2)/SUMIFS(INDIRECT(\"G\"&$G$2),GDate,\"<=\"&I$5,GDate,\">=\"&DATE(YEAR(I$5),MONTH(I$5),1),GDevice,$K$2)))","v":8527.4},{"$f":"IF($G$2=\"None\",SUMIFS(INDIRECT(\"G\"&$F$2),GDate,\"<=\"&J$5,GDate,\">=\"&DATE(YEAR(J$5),MONTH(J$5),1),GDevice,$K$2),IF(SUMIFS(INDIRECT(\"G\"&$G$2),GDate,\"<=\"&J$5,GDate,\">=\"&DATE(YEAR(J$5),MONTH(J$5),1),GDevice,$K$2)=0,0,SUMIFS(INDIRECT(\"G\"&$F$2),GDate,\"<=\"&J$5,GDate,\">=\"&DATE(YEAR(J$5),MONTH(J$5),1),GDevice,$K$2)/SUMIFS(INDIRECT(\"G\"&$G$2),GDate,\"<=\"&J$5,GDate,\">=\"&DATE(YEAR(J$5),MONTH(J$5),1),GDevice,$K$2)))","v":8309.0300000000007},{"$f":"IF($G$2=\"None\",SUMIFS(INDIRECT(\"G\"&$F$2),GDate,\"<=\"&K$5,GDate,\">=\"&DATE(YEAR(K$5),MONTH(K$5),1),GDevice,$K$2),IF(SUMIFS(INDIRECT(\"G\"&$G$2),GDate,\"<=\"&K$5,GDate,\">=\"&DATE(YEAR(K$5),MONTH(K$5),1),GDevice,$K$2)=0,0,SUMIFS(INDIRECT(\"G\"&$F$2),GDate,\"<=\"&K$5,GDate,\">=\"&DATE(YEAR(K$5),MONTH(K$5),1),GDevice,$K$2)/SUMIFS(INDIRECT(\"G\"&$G$2),GDate,\"<=\"&K$5,GDate,\">=\"&DATE(YEAR(K$5),MONTH(K$5),1),GDevice,$K$2)))","v":8025.6399999999994},{"$f":"IF($G$2=\"None\",SUMIFS(INDIRECT(\"G\"&$F$2),GDate,\"<=\"&L$5,GDate,\">=\"&DATE(YEAR(L$5),MONTH(L$5),1),GDevice,$K$2),IF(SUMIFS(INDIRECT(\"G\"&$G$2),GDate,\"<=\"&L$5,GDate,\">=\"&DATE(YEAR(L$5),MONTH(L$5),1),GDevice,$K$2)=0,0,SUMIFS(INDIRECT(\"G\"&$F$2),GDate,\"<=\"&L$5,GDate,\">=\"&DATE(YEAR(L$5),MONTH(L$5),1),GDevice,$K$2)/SUMIFS(INDIRECT(\"G\"&$G$2),GDate,\"<=\"&L$5,GDate,\">=\"&DATE(YEAR(L$5),MONTH(L$5),1),GDevice,$K$2)))","v":10720.079999999998},{"$f":"IF($G$2=\"None\",SUMIFS(INDIRECT(\"G\"&$F$2),GDate,\"<=\"&M$5,GDate,\">=\"&DATE(YEAR(M$5),MONTH(M$5),1),GDevice,$K$2),IF(SUMIFS(INDIRECT(\"G\"&$G$2),GDate,\"<=\"&M$5,GDate,\">=\"&DATE(YEAR(M$5),MONTH(M$5),1),GDevice,$K$2)=0,0,SUMIFS(INDIRECT(\"G\"&$F$2),GDate,\"<=\"&M$5,GDate,\">=\"&DATE(YEAR(M$5),MONTH(M$5),1),GDevice,$K$2)/SUMIFS(INDIRECT(\"G\"&$G$2),GDate,\"<=\"&M$5,GDate,\">=\"&DATE(YEAR(M$5),MONTH(M$5),1),GDevice,$K$2)))","v":8134.9600000000009}]
["Month: ",{"$f":"DATE(YEAR(Setup!$B$4),MONTH(Setup!$B$4)+1,0)","v":"2021-04-30"},{"$f":"DATE(YEAR(B5),MONTH(B5),0)","v":"2021-03-31"},{"$f":"DATE(YEAR(C5),MONTH(C5),0)","v":"2021-02-28"},"2021-01-31","2020-12-31","2020-11-30","2020-10-31","2020-09-30","2020-08-31","2020-07-31","2020-06-30","2020-05-31"]
["Campaign Name","Period1","Period2","Period3","Period4","Period5","Period6","Period7","Period8","Period9","Period10","Period11","Period12"]
{"$rows_left_out":6}
{"sheet":"AdGroups","index":6,"n_rows":18,"n_cols":14,"rows_kept":18,"cut":false,"hidden":true,"merged":[[0,10,0,11],[1,10,1,11]]}
["Google Adwords - Monthly Statistics",null,null,null,null,null,null,null,"Device:",null,"Select values to display:"]
["Campaigns",{"$f":"IF(AND($K$2=\"Cost\",$J$2=\"*\"),IF(ROUND(SUM(OFFSET($C$6,1,0,AGCount,COLUMN($N$5)-2)),2)=ROUND(SUMIFS(GCost,GDate,\"<=\"&$C$5,GDate,\">=\"&DATE(YEAR($N$5),MONTH($N$5),1)),2),\"ok\",\"error!\"),\"ok\")","v":"ok"},{"$f":"IF(ISERROR(FIND(\"*\",$F$2)),\"error!\",MID($F$2,FIND(\"*\",$F$2)+1,LEN($F$2)-FIND(\"*\",$F$2)))","v":"N0"},{"$f":"IF(ISERROR(FIND(\"-\",$F$2)),\"error!\",MID($F$2,1,FIND(\"-\",$F$2)-1))","v":"Cost"},{"$f":"IF(ISERROR(FIND(\"-\",$F$2)),\"error!\",IF(ISERROR(FIND(\"*\",$F$2)),\"error!\",MID($F$2,FIND(\"-\",$F$2)+1,FIND(\"*\",$F$2)-1-FIND(\"-\",$F$2))))","v":"None"},{"$f":"IF(ISNA(MATCH($K$2,CTypeList,0)),\"Cost-None*N0\",OFFSET(CamCharts!$A$4,-1,MATCH($K$2,CTypeList,0),1,1))","v":"Cost-None*N0"},null,null,null,{"$f":"IF(ISBLANK($I$2),\"*\",$I$2)","v":"*"},"Cost"]
["© www.excel-skills.com"]
[null,{"$f":"IF(ISBLANK($K$2),\"Total Cost: \",\"Total \"&$K$2&\": \")","v":"Total Cost: "},{"$f":"IF($E$2=\"None\",SUMIFS(INDIRECT(\"G\"&$D$2),GDate,\"<=\"&C$5,GDate,\">=\"&DATE(YEAR(C$5),MONTH(C$5),1),GDevice,$J$2),IF(SUMIFS(INDIRECT(\"G\"&$E$2),GDate,\"<=\"&C$5,GDate,\">=\"&DATE(YEAR(C$5),MONTH(C$5),1),GDevice,$J$2)=0,0,SUMIFS(INDIRECT(\"G\"&$D$2),GDate,\"<=\"&C$5,GDate,\">=\"&DATE(YEAR(C$5),MONTH(C$5),1),GDevice,$J$2)/SUMIFS(INDIRECT(\"G\"&$E$2),GDate,\"<=\"&C$5,GDate,\">=\"&DATE(YEAR(C$5),MONTH(C$5),1),GDevice,$J$2)))","v":4545.26},{"$f":"IF($E$2=\"None\",SUMIFS(INDIRECT(\"G\"&$D$2),GDate,\"<=\"&D$5,GDate,\">=\"&DATE(YEAR(D$5),MONTH(D$5),1),GDevice,$J$2),IF(SUMIFS(INDIRECT(\"G\"&$E$2),GDate,\"<=\"&D$5,GDate,\">=\"&DATE(YEAR(D$5),MONTH(D$5),1),GDevice,$J$2)=0,0,SUMIFS(INDIRECT(\"G\"&$D$2),GDate,\"<=\"&D$5,GDate,\">=\"&DATE(YEAR(D$5),MONTH(D$5),1),GDevice,$J$2)/SUMIFS(INDIRECT(\"G\"&$E$2),GDate,\"<=\"&D$5,GDate,\">=\"&DATE(YEAR(D$5),MONTH(D$5),1),GDevice,$J$2)))","v":6045.9900000000016},{"$f":"IF($E$2=\"None\",SUMIFS(INDIRECT(\"G\"&$D$2),GDate,\"<=\"&E$5,GDate,\">=\"&DATE(YEAR(E$5),MONTH(E$5),1),GDevice,$J$2),IF(SUMIFS(INDIRECT(\"G\"&$E$2),GDate,\"<=\"&E$5,GDate,\">=\"&DATE(YEAR(E$5),MONTH(E$5),1),GDevice,$J$2)=0,0,SUMIFS(INDIRECT(\"G\"&$D$2),GDate,\"<=\"&E$5,GDate,\">=\"&DATE(YEAR(E$5),MONTH(E$5),1),GDevice,$J$2)/SUMIFS(INDIRECT(\"G\"&$E$2),GDate,\"<=\"&E$5,GDate,\">=\"&DATE(YEAR(E$5),MONTH(E$5),1),GDevice,$J$2)))","v":6306.6799999999994},{"$f":"IF($E$2=\"None\",SUMIFS(INDIRECT(\"G\"&$D$2),GDate,\"<=\"&F$5,GDate,\">=\"&DATE(YEAR(F$5),MONTH(F$5),1),GDevice,$J$2),IF(SUMIFS(INDIRECT(\"G\"&$E$2),GDate,\"<=\"&F$5,GDate,\">=\"&DATE(YEAR(F$5),MONTH(F$5),1),GDevice,$J$2)=0,0,SUMIFS(INDIRECT(\"G\"&$D$2),GDate,\"<=\"&F$5,GDate,\">=\"&DATE(YEAR(F$5),MONTH(F$5),1),GDevice,$J$2)/SUMIFS(INDIRECT(\"G\"&$E$2),GDate,\"<=\"&F$5,GDate,\">=\"&DATE(YEAR(F$5),MONTH(F$5),1),GDevice,$J$2)))","v":6638.18},{"$f":"IF($E$2=\"None\",SUMIFS(INDIRECT(\"G\"&$D$2),GDate,\"<=\"&G$5,GDate,\">=\"&DATE(YEAR(G$5),MONTH(G$5),1),GDevice,$J$2),IF(SUMIFS(INDIRECT(\"G\"&$E$2),GDate,\"<=\"&G$5,GDate,\">=\"&DATE(YEAR(G$5),MONTH(G$5),1),GDevice,$J$2)=0,0,SUMIFS(INDIRECT(\"G\"&$D$2),GDate,\"<=\"&G$5,GDate,\">=\"&DATE(YEAR(G$5),MONTH(G$5),1),GDevice,$J$2)/SUMIFS(INDIRECT(\"G\"&$E$2),GDate,\"<=\"&G$5,GDate,\">=\"&DATE(YEAR(G$5),MONTH(G$5),1),GDevice,$J$2)))","v":4116.46},{"$f":"IF($E$2=\"None\",SUMIFS(INDIRECT(\"G\"&$D$2),GDate,\"<=\"&H$5,GDate,\">=\"&DATE(YEAR(H$5),MONTH(H$5),1),GDevice,$J$2),IF(SUMIFS(INDIRECT(\"G\"&$E$2),GDate,\"<=\"&H$5,GDate,\">=\"&DATE(YEAR(H$5),MONTH(H$5),1),GDevice,$J$2)=0,0,SUMIFS(INDIRECT(\"G\"&$D$2),GDate,\"<=\"&H$5,GDate,\">=\"&DATE(YEAR(H$5),MONTH(H$5),1),GDevice,$J$2)/SUMIFS(INDIRECT(\"G\"&$E$2),GDate,\"<=\"&H$5,GDate,\">=\"&DATE(YEAR(H$5),MONTH(H$5),1),GDevice,$J$2)))","v":7953.91},{"$f":"IF($E$2=\"None\",SUMIFS(INDIRECT(\"G\"&$D$2),GDate,\"<=\"&I$5,GDate,\">=\"&DATE(YEAR(I$5),MONTH(I$5),1),GDevice,$J$2),IF(SUMIFS(INDIRECT(\"G\"&$E$2),GDate,\"<=\"&I$5,GDate,\">=\"&DATE(YEAR(I$5),MONTH(I$5),1),GDevice,$J$2)=0,0,SUMIFS(INDIRECT(\"G\"&$D$2),GDate,\"<=\"&I$5,GDate,\">=\"&DATE(YEAR(I$5),MONTH(I$5),1),GDevice,$J$2)/SUMIFS(INDIRECT(\"G\"&$E$2),GDate,\"<=\"&I$5,GDate,\">=\"&DATE(YEAR(I$5),MONTH(I$5),1),GDevice,$J$2)))","v":9987.4199999999964},{"$f":"IF($E$2=\"None\",SUMIFS(INDIRECT(\"G\"&$D$2),GDate,\"<=\"&J$5,GDate,\">=\"&DATE(YEAR(J$5),MONTH(J$5),1),GDevice,$J$2),IF(SUMIFS(INDIRECT(\"G\"&$E$2),GDate,\"<=\"&J$5,GDate,\">=\"&DATE(YEAR(J$5),MONTH(J$5),1),GDevice,$J$2)=0,0,SUMIFS(INDIRECT(\"G\"&$D$2),GDate,\"<=\"&J$5,GDate,\">=\"&DATE(YEAR(J$5),MONTH(J$5),1),GDevice,$J$2)/SUMIFS(INDIRECT(\"G\"&$E$2),GDate,\"<=\"&J$5,GDate,\">=\"&DATE(YEAR(J$5),MONTH(J$5),1),GDevice,$J$2)))","v":8527.4},{"$f":"IF($E$2=\"None\",SUMIFS(INDIRECT(\"G\"&$D$2),GDate,\"<=\"&K$5,GDate,\">=\"&DATE(YEAR(K$5),MONTH(K$5),1),GDevice,$J$2),IF(SUMIFS(INDIRECT(\"G\"&$E$2),GDate,\"<=\"&K$5,GDate,\">=\"&DATE(YEAR(K$5),MONTH(K$5),1),GDevice,$J$2)=0,0,SUMIFS(INDIRECT(\"G\"&$D$2),GDate,\"<=\"&K$5,GDate,\">=\"&DATE(YEAR(K$5),MONTH(K$5),1),GDevice,$J$2)/SUMIFS(INDIRECT(\"G\"&$E$2),GDate,\"<=\"&K$5,GDate,\">=\"&DATE(YEAR(K$5),MONTH(K$5),1),GDevice,$J$2)))","v":8309.0300000000007},{"$f":"IF($E$2=\"None\",SUMIFS(INDIRECT(\"G\"&$D$2),GDate,\"<=\"&L$5,GDate,\">=\"&DATE(YEAR(L$5),MONTH(L$5),1),GDevice,$J$2),IF(SUMIFS(INDIRECT(\"G\"&$E$2),GDate,\"<=\"&L$5,GDate,\">=\"&DATE(YEAR(L$5),MONTH(L$5),1),GDevice,$J$2)=0,0,SUMIFS(INDIRECT(\"G\"&$D$2),GDate,\"<=\"&L$5,GDate,\">=\"&DATE(YEAR(L$5),MONTH(L$5),1),GDevice,$J$2)/SUMIFS(INDIRECT(\"G\"&$E$2),GDate,\"<=\"&L$5,GDate,\">=\"&DATE(YEAR(L$5),MONTH(L$5),1),GDevice,$J$2)))","v":8025.6399999999994},{"$f":"IF($E$2=\"None\",SUMIFS(INDIRECT(\"G\"&$D$2),GDate,\"<=\"&M$5,GDate,\">=\"&DATE(YEAR(M$5),MONTH(M$5),1),GDevice,$J$2),IF(SUMIFS(INDIRECT(\"G\"&$E$2),GDate,\"<=\"&M$5,GDate,\">=\"&DATE(YEAR(M$5),MONTH(M$5),1),GDevice,$J$2)=0,0,SUMIFS(INDIRECT(\"G\"&$D$2),GDate,\"<=\"&M$5,GDate,\">=\"&DATE(YEAR(M$5),MONTH(M$5),1),GDevice,$J$2)/SUMIFS(INDIRECT(\"G\"&$E$2),GDate,\"<=\"&M$5,GDate,\">=\"&DATE(YEAR(M$5),MONTH(M$5),1),GDevice,$J$2)))","v":10720.079999999998},{"$f":"IF($E$2=\"None\",SUMIFS(INDIRECT(\"G\"&$D$2),GDate,\"<=\"&N$5,GDate,\">=\"&DATE(YEAR(N$5),MONTH(N$5),1),GDevice,$J$2),IF(SUMIFS(INDIRECT(\"G\"&$E$2),GDate,\"<=\"&N$5,GDate,\">=\"&DATE(YEAR(N$5),MONTH(N$5),1),GDevice,$J$2)=0,0,SUMIFS(INDIRECT(\"G\"&$D$2),GDate,\"<=\"&N$5,GDate,\">=\"&DATE(YEAR(N$5),MONTH(N$5),1),GDevice,$J$2)/SUMIFS(INDIRECT(\"G\"&$E$2),GDate,\"<=\"&N$5,GDate,\">=\"&DATE(YEAR(N$5),MONTH(N$5),1),GDevice,$J$2)))","v":8134.9600000000009}]
[null,"Month: ",{"$f":"DATE(YEAR(Setup!$B$4),MONTH(Setup!$B$4)+1,0)","v":"2021-04-30"},{"$f":"DATE(YEAR(C5),MONTH(C5),0)","v":"2021-03-31"},{"$f":"DATE(YEAR(D5),MONTH(D5),0)","v":"2021-02-28"},"2021-01-31","2020-12-31","2020-11-30","2020-10-31","2020-09-30","2020-08-31","2020-07-31","2020-06-30","2020-05-31"]
["Ad Group Name","Campaign Name","Period1","Period2","Period3","Period4","Period5","Period6","Period7","Period8","Period9","Period10","Period11","Period12"]
{"$rows_left_out":13}
{"sheet":"CamCharts","index":7,"n_rows":19,"n_cols":12,"rows_kept":19,"cut":false,"hidden":true,"merged":[[1,9,1,10],[0,9,0,10]]}
["Google Adwords - Monthly Statistics",null,null,null,null,null,null,"Device:",null,"Select a campaign:"]
["Campaign Summary",null,null,null,null,null,null,null,{"$f":"IF(ISBLANK($H$2),\"*\",$H$2)","v":"*"},null,null,{"$f":"IF(ISBLANK($J$2),\"*\",$J$2)","v":"*"}]
["© www.excel-skills.com",{"$f":"B4&\"-None\"&\"*N0\"","v":"Impressions-None*N0"},{"$f":"C4&\"-None\"&\"*N0\"","v":"Clicks-None*N0"},{"$f":"$C$4&\"-\"&$B$4&\"*P1\"","v":"Clicks-Impressions*P1"},{"$f":"E4&\"-None\"&\"*N0\"","v":"Cost-None*N0"},{"$f":"$E$4&\"-\"&$C$4&\"*N2\"","v":"Cost-Clicks*N2"},{"$f":"G4&\"-None\"&\"*N0\"","v":"Conversions-None*N0"},{"$f":"H4&\"-None\"&\"*N0\"","v":"Revenue-None*N0"},{"$f":"$E$4&\"-\"&$G$4&\"*N2\"","v":"Cost-Conversions*N2"},{"$f":"$G$4&\"-\"&$C$4&\"*P1\"","v":"Conversions-Clicks*P1"},{"$f":"$H$4&\"-\"&$E$4&\"*N2\"","v":"Revenue-Cost*N2"}]
["Month","Impressions","Clicks","CTR","Cost","CPC","Conversions","Revenue","Cost / Conv","Conv Rate","ROI"]
[{"$f":"DATE(YEAR(Setup!$B$4),MONTH(Setup!$B$4)+1,0)","v":"2021-04-30"},{"$f":"SUMIFS(GImpressions,GDate,\"<=\"&$A5,GDate,\">=\"&DATE(YEAR($A5),MONTH($A5),1),GCampaign,$L$2,GDevice,$I$2)","v":29144},{"$f":"SUMIFS(GClicks,GDate,\"<=\"&$A5,GDate,\">=\"&DATE(YEAR($A5),MONTH($A5),1),GCampaign,$L$2,GDevice,$I$2)","v":2695},{"$f":"IF(B5=0,0,C5/B5)","v":9.2471863848476527E-2},{"$f":"SUMIFS(GCost,GDate,\"<=\"&$A5,GDate,\">=\"&DATE(YEAR($A5),MONTH($A5),1),GCampaign,$L$2,GDevice,$I$2)","v":4545.26},{"$f":"IF(C5=0,0,E5/C5)","v":1.6865528756957329},{"$f":"SUMIFS(GConversions,GDate,\"<=\"&$A5,GDate,\">=\"&DATE(YEAR($A5),MONTH($A5),1),GCampaign,$L$2,GDevice,$I$2)","v":285},{"$f":"SUMIFS(GRevenue,GDate,\"<=\"&$A5,GDate,\">=\"&DATE(YEAR($A5),MONTH($A5),1),GCampaign,$L$2,GDevice,$I$2)","v":10211},{"$f":"IF(G5=0,0,E5/G5)","v":15.948280701754387},{"$f":"IF(C5=0,0,G5/C5)","v":0.10575139146567718},{"$f":"IF(E5=0,0,H5/E5)","v":2.2465161508912579}]
[{"$f":"DATE(YEAR(A5),MONTH(A5),0)","v":"2021-03-31"},65942,4153,{"$f":"IF(B6=0,0,C6/B6)","v":6.2979588122895877E-2},6045.9900000000016,{"$f":"IF(C6=0,0,E6/C6)","v":1.4558126655429813},480,17445,12.595812500000003,0.11557909944618348,2.8853835352026707]
{"$rows_left_out":14}
{"sheet":"AgCharts","index":8,"n_rows":19,"n_cols":12,"rows_kept":19,"cut":false,"hidden":true,"merged":[[0,9,0,10],[1,9,1,10],[0,4,0,5],[1,4,1,5]]}
["Google Adwords - Monthly Statistics",null,null,null,"Campaign:",null,null,"Device:",null,"Select Ad Group:"]
["Campaign Summary",null,null,null,{"$f":"CamCharts!$L$2","v":"*"},null,null,null,{"$f":"IF(ISBLANK($H$2),\"*\",$H$2)","v":"*"},null,null,{"$f":"IF(ISBLANK($J$2),\"*\",$J$2)","v":"*"}]
["© www.excel-skills.com"]
["Month","Impressions","Clicks","CTR","Cost","CPC","Conversions","Revenue","Cost / Conv","Conv Rate","ROI"]
[{"$f":"DATE(YEAR(Setup!$B$4),MONTH(Setup!$B$4)+1,0)","v":"2021-04-30"},{"$f":"SUMIFS(GImpressions,GDate,\"<=\"&$A5,GDate,\">=\"&DATE(YEAR($A5),MONTH($A5),1),GCampaign,$E$2,GAdgroup,$L$2,GDevice,$I$2)","v":29144},{"$f":"SUMIFS(GClicks,GDate,\"<=\"&$A5,GDate,\">=\"&DATE(YEAR($A5),MONTH($A5),1),GCampaign,$E$2,GAdgroup,$L$2,GDevice,$I$2)","v":2695},{"$f":"IF(B5=0,0,C5/B5)","v":9.2471863848476527E-2},{"$f":"SUMIFS(GCost,GDate,\"<=\"&$A5,GDate,\">=\"&DATE(YEAR($A5),MONTH($A5),1),GCampaign,$E$2,GAdgroup,$L$2,GDevice,$I$2)","v":4545.26},{"$f":"IF(C5=0,0,E5/C5)","v":1.6865528756957329},{"$f":"SUMIFS(GConversions,GDate,\"<=\"&$A5,GDate,\">=\"&DATE(YEAR($A5),MONTH($A5),1),GCampaign,$E$2,GAdgroup,$L$2,GDevice,$I$2)","v":285},{"$f":"SUMIFS(GRevenue,GDate,\"<=\"&$A5,GDate,\">=\"&DATE(YEAR($A5),MONTH($A5),1),GCampaign,$E$2,GAdgroup,$L$2,GDevice,$I$2)","v":10211},{"$f":"IF(G5=0,0,E5/G5)","v":15.948280701754387},{"$f":"IF(C5=0,0,G5/C5)","v":0.10575139146567718},{"$f":"IF(E5=0,0,H5/E5)","v":2.2465161508912579}]
[{"$f":"DATE(YEAR(A5),MONTH(A5),0)","v":"2021-03-31"},65942,4153,{"$f":"IF(B6=0,0,C6/B6)","v":6.2979588122895877E-2},6045.9900000000016,{"$f":"IF(C6=0,0,E6/C6)","v":1.4558126655429813},480,17445,12.595812500000003,0.11557909944618348,2.8853835352026707]
{"$rows_left_out":13}