{"text_format":"1","workbook":"xlsx","n_sheets":6,"sheets":["Info","Trial","Instructions","Search","Keywords","Invoices"],"not_rendered":{"charts":0,"images":3,"macros":1,"external_links":0,"defined_names":7,"comments":0,"pivot_tables":0},"unopened":[],"bounds":{"document_bytes":16777216,"sheet_cells":100000,"rows_first":2000,"rows_last":500,"rows_between":2000,"halvings":0,"cell_chars":16384,"cell_head_chars":4096},"cells_cut":0,"cells_raw":0,"read":"whole","date_system":"1900"}

{"sheet":"Info","index":0,"n_rows":0,"n_cols":0,"rows_kept":0,"cut":false,"hidden":false,"merged":[]}

{"sheet":"Trial","index":1,"n_rows":0,"n_cols":0,"rows_kept":0,"cut":false,"hidden":true,"merged":[]}

{"sheet":"Instructions","index":2,"n_rows":78,"n_cols":1,"rows_kept":78,"cut":false,"hidden":true,"merged":[]}
["Excel Skills | Google Adwords - Search Terms Template"]
["Instructions"]
["www.excel-skills.com"]
[]
["This template enables users to identify the search terms which are the most effective for converting customers who are searching for their products or services on Google. The exact match keywords which have been added to the user's Google AdWords account are also indicated and if invoicing is not incorporated into the user's AdWords account, the invoices can be included in the template in order to analyse the profitability of individual search terms. The template results can be used to measure the profitability of individual search terms or phrases and to then adjust keywords on AdWords."]
[]
["The following sheets are included in the template:"]
["Search - extract search term data from your Google AdWords account and paste onto this sheet. Keywords added as exact match keywords will automatically be indicated and if your invoicing is separate from AdWords, invoice values will also be displayed on the sheet. You can also use the Column Filters to display statistics for phrase match search terms. The columns with light blue column headings contain formulas which are calculated automatically."]
["Keywords - extract keyword data from your Google AdWords account and paste onto this sheet. Only the exact match keywords need to be retained on this sheet in order for the keywords to be indicated on the Search sheet."]
["Invoices - Copy your invoice data onto this sheet. Only the search terms and invoice amounts are required but you can add additional columns between the two existing columns if necessary. This sheet is only required if you do not measure invoice values in Google AdWords."]
[]
["Search Term Data"]
[]
["All search term data needs to be included on this sheet. The easiest way of including your search term data is by creating the appropriate report through the Google AdWords account interface and then exporting the data to Excel before copying the data from the Excel extract onto this sheet. The report needs to be created so that the columns are included in exactly the same sequence as the columns on the Search sheet although you can add columns or move columns so that the sequence between your extract file and the columns on the Search sheet are the same."]
[]
["Note: The AdWords fields that you need to add to your report will have the exact same field names as the column headings that we have included on the Search sheet in all the columns with yellow column headings. The Search Term column needs to be added to the Row section of the report and all the other fields need to be added to the Columns section."]
[]
["The AdWords report can be extracted as an Excel or CSV file and downloaded. When you then open the report, you will be able to copy the data onto the Search sheet in this template. Note that some columns may contain a currency symbol which may result in the data in that column being interpreted as text instead of values by Excel. We therefore recommend removing all currency symbols from your Google data (Control + H for Replace and then replace currency text with nothing for the entire data selection)."]
[]
["Note: The ROI, Keyword Status and Invoice Value columns contain formulas which should not be edited, amended or overwritten otherwise the template may not function as it should."]
[]
["Note: All the columns on the Search sheet have been included in an Excel table. This feature is extremely useful when entering or copying data in a table format because the formulas in the calculated columns (with light blue column headings) are automatically copied when you add data to the table."]
[]
["If you already track your invoice amounts in Google Adwords and the invoice amounts are included in the Total Conversion Value report column, you do not need to include invoice amounts in the template. The Invoice Value column (M) on the Search sheet can then be deleted and you can also delete the entire Invoices sheet."]
[]
["If your invoices are not included in AdWords, you need to include all the appropriate invoices for the same date range as the search term report by adding the invoices to the Invoices sheet. The invoice values that are included on this sheet will then automatically be included in the Invoice Value column (column M) on the Search sheet."]
[]
["Note: We recommend still including the Total Conversion Value column in your AdWords report although the column will have nil values if you don't track invoice values in AdWords. The nil values in this column can then be replaced by a formula which links to the Invoice Value column in order for the return on investment (ROI) to be calculated correctly. Clear all the nil values in the Total Conversion Value column and enter \"=M5\" as the formula in the first cell in the column to link the two columns."]
[]
["The return on investment is calculated by dividing the Total Conversion Value (column H) by the total cost in column E. Any value above 1 means that the search term is profitable and the higher the value, the more profitable. Values below 1 indicate that the cost exceeds the invoice value."]
[]
["The Keyword Status column indicates whether a search term has been added as an exact match keyword in your AdWords account. The formula in this column determines whether the search term has been included on the Keywords sheet and if included, displays a status of \"exact match\". If the search term is not found, the status is reflected as \"no\"."]
[]
["Keywords"]
[]
["One of the core principles of a profitable Google AdWords marketing campaign is to display your ads on the most profitable keywords - or to be more precise - the most profitable search terms. You also do not want to display your ads on search terms which are not profitable. In order to determine whether a search term is profitable, you need to measure invoicing against cost. You also then need to analyse which search terms need to be targeted with exact keyword matching."]
[]
["The analysis of search term profitability for the purpose of this template is included on the Search sheet but in order to indicate which search terms have been added as exact match keywords, you need to include all exact match keywords in the template. These keywords therefore need to be included on the Keywords sheet."]
[]
["Note: All the columns on the Keywords sheet have been included in an Excel table. This feature is extremely useful when entering or copying data in a table format because the cell range which refers to the table is automatically extended when you add data to the table."]
[]
["The easiest way of including your exact match keywords on the Keywords sheet is by exporting the data from Google Adwords to Excel. We recommend exporting all your enabled keywords and then deleting all your phrase & broad matched keywords before copying the data onto the Keywords sheet. The Match Type column indicates whether a keyword is an exact, phrase or broad match keyword."]
[]
["Only the exact match keywords should be added to the Keywords sheet and it is only really the Keyword column which is used in the template. You can therefore add or delete any other columns as long as you retain the Keyword column in its current position. We also recommend only retaining enabled keywords on this sheet (Keyword Status of enabled) and therefore not including paused or deleted keywords."]
[]
["Note: All the exact match keywords that are added to the Keywords sheet are indicated as \"exact match\" in the Keyword Status column on the Search sheet."]
[]
["Invoices"]
[]
["As we've mentioned earlier on in these template instructions, the profitability of search terms can only be measured if invoice values are compared to marketing costs. If you do not include invoice values in AdWords, we have provided the Invoice sheet which can be used to include your invoice values and automatically populates the Invoice Values column on the Search sheet."]
[]
["The invoice values that are included on the Invoices sheet should relate to the same date range as the search term data that is included on the Search sheet. If you include search term data for 6 months, the invoice values should also relate to the same 6 month period otherwise the data will not be comparable and may distort the measurement of profitability by individual search term."]
[]
["Note: You need to be able to measure invoice values by search term in order to be able to include your invoice values in this template. We recommend using Google Analytics to measure your invoice values by individual search term and exporting the invoice totals per search term for inclusion on the Invoices sheet."]
[]
["Note: If you already measure your invoice values in Google AdWords, the Invoices sheet is not required and can therefore safely be deleted. You also then need to delete the Invoice Values column on the Search sheet."]
[]
["Search Term Analysis"]
[]
["Different types of businesses may measure their search term data by using vastly different approaches but we recommend the following general approach when reviewing the search term results that are included on the Search sheet:"]
{"$rows_left_out":19}
{"sheet":"Search","index":3,"n_rows":41,"n_cols":13,"rows_kept":41,"cut":false,"hidden":true,"merged":[]}
["Google AdWords"]
["Search Term Report"]
["© www.excel-skills.com",{"$f":"SUBTOTAL(109,SearchTerms[[#Data],[Clicks]])","v":2455},{"$f":"SUBTOTAL(109,SearchTerms[[#Data],[Impressions]])","v":23890},{"$f":"IF(C3=0,0,B3/C3)","v":0.10276266220175806},{"$f":"SUBTOTAL(109,SearchTerms[[#Data],[Cost]])","v":22279.599999999995},{"$f":"IF(B3=0,0,E3/B3)","v":9.0751934826883893},{"$f":"SUBTOTAL(109,SearchTerms[[#Data],[Conversions]])","v":126},{"$f":"SUBTOTAL(109,SearchTerms[[#Data],[Total conv. value]])","v":59807},{"$f":"IF(G3=0,0,E3/G3)","v":176.82222222222219},{"$f":"IF(B3=0,0,G3/B3)","v":5.1323828920570268E-2},{"$f":"IF(E3=0,0,H3/E3)","v":2.6843839207167099},null,{"$f":"SUBTOTAL(109,SearchTerms[[#Data],[Invoice \nValue]])","v":59807}]
["Search term","Clicks","Impressions","CTR","Cost","Avg. CPC","Conversions","Total conv. value","Cost / conv.","Conv. rate","ROI","Keyword Status","Invoice \nValue"]
["statement of cash flow",365,4670,0.08,1154,3.16,30,7515,38.47,0.08,{"$f":"IF(E5=0,0,H5/E5)","v":6.5121317157712308},{"$f":"IF(ISNA(VLOOKUP(\"[\"&$A5&\"]\",Ekeymatch,COLUMN(Keywords!$B$4)-1,0)),\"no\",\"exact match\")","v":"exact match"},{"$f":"SUMIF(InvAll,$A5,InvAmount)","v":7515}]
["management accounting",140,2280,0.06,1610.6,11.5,25,4875,64.42,0.18,3.0268223022476097,{"$f":"IF(ISNA(VLOOKUP(\"[\"&$A6&\"]\",Ekeymatch,COLUMN(Keywords!$B$4)-1,0)),\"no\",\"exact match\")","v":"exact match"},4875]
["online financial accounts software",320,3940,0.08,3125,9.77,20,30660,156.25,0.06,9.8111999999999995,{"$f":"IF(ISNA(VLOOKUP(\"[\"&$A7&\"]\",Ekeymatch,COLUMN(Keywords!$B$4)-1,0)),\"no\",\"exact match\")","v":"no"},30660]
["statement of cash flow software",435,4110,0.11,2418,5.56,12,3660,201.5,0.03,1.5136476426799008,{"$f":"IF(ISNA(VLOOKUP(\"[\"&$A8&\"]\",Ekeymatch,COLUMN(Keywords!$B$4)-1,0)),\"no\",\"exact match\")","v":"exact match"},3660]
["business plan projections software",30,150,0.2,157.4,5.25,7,1229,22.49,0.23,7.8081321473951713,{"$f":"IF(ISNA(VLOOKUP(\"[\"&$A9&\"]\",Ekeymatch,COLUMN(Keywords!$B$4)-1,0)),\"no\",\"exact match\")","v":"no"},1229]
["valuation software",10,20,0.5,9,0.9,6,1053,1.5,0.6,117,{"$f":"IF(ISNA(VLOOKUP(\"[\"&$A10&\"]\",Ekeymatch,COLUMN(Keywords!$B$4)-1,0)),\"no\",\"exact match\")","v":"exact match"},1053]
["simple company valuation calculator",15,40,0.38,229.2,15.28,4,2280,57.3,0.27,9.9476439790575917,{"$f":"IF(ISNA(VLOOKUP(\"[\"&$A11&\"]\",Ekeymatch,COLUMN(Keywords!$B$4)-1,0)),\"no\",\"exact match\")","v":"no"},2280]
["accounting software",10,20,0.5,125.4,12.54,4,1404,31.35,0.4,11.196172248803828,{"$f":"IF(ISNA(VLOOKUP(\"[\"&$A12&\"]\",Ekeymatch,COLUMN(Keywords!$B$4)-1,0)),\"no\",\"exact match\")","v":"exact match"},1404]
["programs that compile financial accounts",5,10,0.5,35.6,7.12,3,1053,11.87,0.6,29.578651685393258,{"$f":"IF(ISNA(VLOOKUP(\"[\"&$A13&\"]\",Ekeymatch,COLUMN(Keywords!$B$4)-1,0)),\"no\",\"exact match\")","v":"no"},1053]
["cc financial accounts software",5,10,0.5,35.4,7.08,3,1053,11.8,0.6,29.745762711864408,{"$f":"IF(ISNA(VLOOKUP(\"[\"&$A14&\"]\",Ekeymatch,COLUMN(Keywords!$B$4)-1,0)),\"no\",\"exact match\")","v":"no"},1053]
["valuation calculation",5,10,0.5,75.400000000000006,15.08,3,527,25.13,0.6,6.9893899204244025,{"$f":"IF(ISNA(VLOOKUP(\"[\"&$A15&\"]\",Ekeymatch,COLUMN(Keywords!$B$4)-1,0)),\"no\",\"exact match\")","v":"exact match"},527]
["bank approved financial accounts ",5,10,0.5,24,4.8,2,1404,12,0.4,58.5,{"$f":"IF(ISNA(VLOOKUP(\"[\"&$A16&\"]\",Ekeymatch,COLUMN(Keywords!$B$4)-1,0)),\"no\",\"exact match\")","v":"no"},1404]
["accounting worksheet",5,10,0.5,53,10.6,2,351,26.5,0.4,6.6226415094339623,{"$f":"IF(ISNA(VLOOKUP(\"[\"&$A17&\"]\",Ekeymatch,COLUMN(Keywords!$B$4)-1,0)),\"no\",\"exact match\")","v":"exact match"},351]
["preparation of ifrs financial accounts",5,10,0.5,47.2,9.44,2,351,23.6,0.4,7.4364406779661012,{"$f":"IF(ISNA(VLOOKUP(\"[\"&$A18&\"]\",Ekeymatch,COLUMN(Keywords!$B$4)-1,0)),\"no\",\"exact match\")","v":"no"},351]
["best company valuation software",5,20,0.25,93.2,18.64,1,1760,93.2,0.2,18.884120171673818,{"$f":"IF(ISNA(VLOOKUP(\"[\"&$A19&\"]\",Ekeymatch,COLUMN(Keywords!$B$4)-1,0)),\"no\",\"exact match\")","v":"no"},1760]
["compiling financial accounts",5,20,0.25,25,5,1,351,25,0.2,14.04,{"$f":"IF(ISNA(VLOOKUP(\"[\"&$A20&\"]\",Ekeymatch,COLUMN(Keywords!$B$4)-1,0)),\"no\",\"exact match\")","v":"no"},351]
["business plan projection software free",5,50,0.1,11.8,2.36,1,281,11.8,0.2,23.813559322033896,{"$f":"IF(ISNA(VLOOKUP(\"[\"&$A21&\"]\",Ekeymatch,COLUMN(Keywords!$B$4)-1,0)),\"no\",\"exact match\")","v":"no"},281]
["management accounts software",165,1250,0.13,1933.2,11.72,0,0,0,0,0,{"$f":"IF(ISNA(VLOOKUP(\"[\"&$A22&\"]\",Ekeymatch,COLUMN(Keywords!$B$4)-1,0)),\"no\",\"exact match\")","v":"exact match"},0]
["financial accounting software",115,800,0.14000000000000001,1254.4000000000001,10.91,0,0,0,0,0,{"$f":"IF(ISNA(VLOOKUP(\"[\"&$A23&\"]\",Ekeymatch,COLUMN(Keywords!$B$4)-1,0)),\"no\",\"exact match\")","v":"exact match"},0]
["financial accounts software",45,530,0.08,1172.8,26.06,0,0,0,0,0,{"$f":"IF(ISNA(VLOOKUP(\"[\"&$A24&\"]\",Ekeymatch,COLUMN(Keywords!$B$4)-1,0)),\"no\",\"exact match\")","v":"exact match"},0]
["cc valuation software",35,130,0.27,874.8,24.99,0,0,0,0,0,{"$f":"IF(ISNA(VLOOKUP(\"[\"&$A25&\"]\",Ekeymatch,COLUMN(Keywords!$B$4)-1,0)),\"no\",\"exact match\")","v":"no"},0]
["business plan projection software",130,1020,0.13,699,5.38,0,0,0,0,0,{"$f":"IF(ISNA(VLOOKUP(\"[\"&$A26&\"]\",Ekeymatch,COLUMN(Keywords!$B$4)-1,0)),\"no\",\"exact match\")","v":"exact match"},0]
["annual financial accounts software ",30,370,0.08,677.4,22.58,0,0,0,0,0,{"$f":"IF(ISNA(VLOOKUP(\"[\"&$A27&\"]\",Ekeymatch,COLUMN(Keywords!$B$4)-1,0)),\"no\",\"exact match\")","v":"no"},0]
["company valuation calculator",35,230,0.15,653.4,18.670000000000002,0,0,0,0,0,{"$f":"IF(ISNA(VLOOKUP(\"[\"&$A28&\"]\",Ekeymatch,COLUMN(Keywords!$B$4)-1,0)),\"no\",\"exact match\")","v":"exact match"},0]
["company valuation software",25,280,0.09,647.79999999999995,25.91,0,0,0,0,0,{"$f":"IF(ISNA(VLOOKUP(\"[\"&$A29&\"]\",Ekeymatch,COLUMN(Keywords!$B$4)-1,0)),\"no\",\"exact match\")","v":"exact match"},0]
["business plan forecast software",160,1480,0.11,604.6,3.78,0,0,0,0,0,{"$f":"IF(ISNA(VLOOKUP(\"[\"&$A30&\"]\",Ekeymatch,COLUMN(Keywords!$B$4)-1,0)),\"no\",\"exact match\")","v":"exact match"},0]
["management account software",45,140,0.32,475.6,10.57,0,0,0,0,0,{"$f":"IF(ISNA(VLOOKUP(\"[\"&$A31&\"]\",Ekeymatch,COLUMN(Keywords!$B$4)-1,0)),\"no\",\"exact match\")","v":"no"},0]
["cash flow software",85,910,0.09,471.8,5.55,0,0,0,0,0,{"$f":"IF(ISNA(VLOOKUP(\"[\"&$A32&\"]\",Ekeymatch,COLUMN(Keywords!$B$4)-1,0)),\"no\",\"exact match\")","v":"no"},0]
["annual financial accounts software",50,590,0.08,455.6,9.11,0,0,0,0,0,{"$f":"IF(ISNA(VLOOKUP(\"[\"&$A33&\"]\",Ekeymatch,COLUMN(Keywords!$B$4)-1,0)),\"no\",\"exact match\")","v":"exact match"},0]
["company valuation calculator",30,230,0.13,449.8,14.99,0,0,0,0,0,{"$f":"IF(ISNA(VLOOKUP(\"[\"&$A34&\"]\",Ekeymatch,COLUMN(Keywords!$B$4)-1,0)),\"no\",\"exact match\")","v":"exact match"},0]
["sme financial accounts software",25,80,0.31,418.8,16.75,0,0,0,0,0,{"$f":"IF(ISNA(VLOOKUP(\"[\"&$A35&\"]\",Ekeymatch,COLUMN(Keywords!$B$4)-1,0)),\"no\",\"exact match\")","v":"no"},0]
["discounted cash flow valuation",15,100,0.15,404,26.93,0,0,0,0,0,{"$f":"IF(ISNA(VLOOKUP(\"[\"&$A36&\"]\",Ekeymatch,COLUMN(Keywords!$B$4)-1,0)),\"no\",\"exact match\")","v":"no"},0]
["software for financial accounts preparation",15,60,0.25,398.8,26.59,0,0,0,0,0,{"$f":"IF(ISNA(VLOOKUP(\"[\"&$A37&\"]\",Ekeymatch,COLUMN(Keywords!$B$4)-1,0)),\"no\",\"exact match\")","v":"no"},0]
["financial accounts software",15,60,0.25,389.2,25.95,0,0,0,0,0,{"$f":"IF(ISNA(VLOOKUP(\"[\"&$A38&\"]\",Ekeymatch,COLUMN(Keywords!$B$4)-1,0)),\"no\",\"exact match\")","v":"exact match"},0]
["accounting management software",10,20,0.5,377.4,37.74,0,0,0,0,0,{"$f":"IF(ISNA(VLOOKUP(\"[\"&$A39&\"]\",Ekeymatch,COLUMN(Keywords!$B$4)-1,0)),\"no\",\"exact match\")","v":"no"},0]
["financial accounts software for accountants",10,10,1,357.6,35.76,0,0,0,0,0,{"$f":"IF(ISNA(VLOOKUP(\"[\"&$A40&\"]\",Ekeymatch,COLUMN(Keywords!$B$4)-1,0)),\"no\",\"exact match\")","v":"no"},0]
["projected cash flow software",45,220,0.2,334.4,7.43,0,0,0,0,0,{"$f":"IF(ISNA(VLOOKUP(\"[\"&$A41&\"]\",Ekeymatch,COLUMN(Keywords!$B$4)-1,0)),\"no\",\"exact match\")","v":"no"},0]

{"sheet":"Keywords","index":4,"n_rows":28,"n_cols":6,"rows_kept":28,"cut":false,"hidden":true,"merged":[]}
["Google AdWords"]
["Exact Match Keywords"]
["© www.excel-skills.com"]
["Keyword Status","Keyword","Campaign","Ad group","Status","Match type"]
["Enabled","[accounting software]","Campaign 1","Ad Group 1.1","Eligible","Exact match"]
["Enabled","[accounting worksheet]","Campaign 1","Ad Group 1.1","Eligible","Exact match"]
["Enabled","[business plan calculation]","Campaign 2","Ad Group 2.1","Eligible","Exact match"]
["Enabled","[business plan forecast software]","Campaign 2","Ad Group 2.1","Eligible","Exact match"]
["Enabled","[business plan forecast]","Campaign 2","Ad Group 2.1","Eligible","Exact match"]
["Enabled","[business plan forecasting software]","Campaign 2","Ad Group 2.1","Eligible","Exact match"]
["Enabled","[business plan projection software]","Campaign 2","Ad Group 2.1","Eligible","Exact match"]
["Enabled","[business plan software]","Campaign 2","Ad Group 2.1","Eligible","Exact match"]
["Enabled","[statement of cash flow software]","Campaign 3","Ad Group 3.1","Eligible","Exact match"]
["Enabled","[statement of cash flow]","Campaign 3","Ad Group 3.1","Eligible","Exact match"]
["Enabled","[annual financial accounts software]","Campaign 4","Ad Group 4.1","Eligible","Exact match"]
["Enabled","[caseware financial accounts software]","Campaign 4","Ad Group 4.1","Eligible","Exact match"]
["Enabled","[financial accounting software]","Campaign 4","Ad Group 4.1","Eligible","Exact match"]
["Enabled","[financial accounts software]","Campaign 4","Ad Group 4.1","Eligible","Exact match"]
["Enabled","[financials software]","Campaign 4","Ad Group 4.1","Eligible","Exact match"]
["Enabled","[monthly financial summary software]","Campaign 4","Ad Group 4.1","Eligible","Exact match"]
["Enabled","[software for preparation of financial accounts]","Campaign 4","Ad Group 4.1","Eligible","Exact match"]
["Enabled","[management accounting software]","Campaign 5","Ad Group 5.1","Eligible","Exact match"]
["Enabled","[management accounting]","Campaign 5","Ad Group 5.1","Eligible","Exact match"]
["Enabled","[management accounts software]","Campaign 5","Ad Group 5.1","Eligible","Exact match"]
["Enabled","[company valuation calculator]","Campaign 6","Ad Group 6.1","Eligible","Exact match"]
["Enabled","[company valuation software]","Campaign 6","Ad Group 6.1","Eligible","Exact match"]
["Enabled","[valuation calculation]","Campaign 6","Ad Group 6.1","Eligible","Exact match"]
["Enabled","[valuation software]","Campaign 6","Ad Group 6.1","Eligible","Exact match"]

{"sheet":"Invoices","index":5,"n_rows":21,"n_cols":2,"rows_kept":21,"cut":false,"hidden":true,"merged":[]}
["Google AdWords"]
["Invoice Values"]
["© www.excel-skills.com",{"$f":"SUBTOTAL(109,Invoices[Invoice Amount])","v":59807}]
["Search Term","Invoice Amount"]
["accounting software",1404]
["accounting worksheet",351]
["bank approved financial accounts ",1404]
["best company valuation software",1760]
["business plan projection software free",281]
["business plan projections software",1229]
["cc financial accounts software",1053]
["compiling financial accounts",351]
["management accounting",4875]
["online financial accounts software",30660]
["preparation of ifrs financial accounts",351]
["programs that compile financial accounts",1053]
["simple company valuation calculator",2280]
["statement of cash flow",7515]
["statement of cash flow software",3660]
["valuation calculation",527]
["valuation software",1053]