{"text_format":"1","workbook":"xlsx","n_sheets":6,"sheets":["Info","Trial","Instructions","Setup","Leave","Summary"],"not_rendered":{"charts":0,"images":2,"macros":1,"external_links":0,"defined_names":17,"comments":0,"pivot_tables":0},"unopened":[],"bounds":{"document_bytes":16777216,"sheet_cells":100000,"rows_first":2000,"rows_last":500,"rows_between":2000,"halvings":0,"cell_chars":16384,"cell_head_chars":4096},"cells_cut":0,"cells_raw":0,"read":"whole","date_system":"1900"}

{"sheet":"Info","index":0,"n_rows":0,"n_cols":0,"rows_kept":0,"cut":false,"hidden":false,"merged":[]}

{"sheet":"Trial","index":1,"n_rows":0,"n_cols":0,"rows_kept":0,"cut":false,"hidden":true,"merged":[]}

{"sheet":"Instructions","index":2,"n_rows":95,"n_cols":1,"rows_kept":95,"cut":false,"hidden":true,"merged":[]}
["Excel Skills | Annual Leave Template"]
["Instructions"]
["www.excel-skills.com"]
[]
["This template calculates the outstanding annual leave days of employees and keeps record of all leave taken or paid. Annual leave is sometimes also referred to as holiday pay or vacation days and we have designed this template with flexibility in mind to be able to keep record of any annual leave system whether leave accrues based on hourly, daily, weekly, bi-weekly (fortnightly) or monthly pay periods. The template can basically be used to calculate leave balances for any annual period with easy roll forwards to the next annual periods and you can save different copies of the template to accommodate different types of leave."]
[]
["The template includes the following sheets:"]
["Setup - set up the template for your business by changing the user input settings in the cells with yellow cell backgrounds. All other cells contain formulas and are automatically updated based on your settings. You can set the business name which is used as a sheet heading, enter a cycle date which represents the first day of the annual period included in the template, select a pay basis (monthly, bi-weekly, weekly, daily or hourly), enter the number of work hours per day, elect to accrue leave on total or worked hours or days and enter the number of holidays included in the specified annual period. This template can be used for an unlimited number of years by simply saving a new file for every year and copying over the opening balances from the previous year's file."]
["Leave - when an employee takes leave, the number of leave units taken should be recorded on this sheet. Leave units are usually expressed as days but the template also accommodates entering leave units in hours if the hourly pay period option is selected on the Setup sheet."]
["Summary - the outstanding leave days of each employee is calculated on this sheet. You need to create an employee code for each employee, enter the employment date and termination date (if applicable), enter the salary and leave entitlement per pay period and enter the opening leave units. The annual leave entitlement, leave accrual, leave taken or paid, outstanding leave days and provision for outstanding leave values are then calculated automatically. The sheet also contains a monthly analysis of leave taken or paid over the specified 12-month period."]
[]
["Template Set-up"]
[]
["The template can be customized for your business by setting the appropriate user input values on the Setup sheet. Start by entering your business name which is used as a heading on all of the sheets. You can then set your leave cycle start date - the template covers an annual period and the date entered in this cell should therefore be the first day of the annual period which should be included in the template calculations. The cycle end date is then automatically determined based on the start date."]
[]
["Note: The template can be used for multiple annual periods by saving a new version for each annual period and copying the opening leave balances from the previous period's file."]
[]
["You can then select a pay period basis. The template accommodates monthly, bi-weekly (fortnightly), weekly, daily and hourly pay periods. When you select the pay period, the dates in the pay period section on the Setup sheet will be updated automatically and these dates are also included in the list box in cell L2 on the Summary sheet."]
[]
["You also need to enter the work hours per day which only has a calculation effect if the hourly pay period basis is selected and you need to specify if leave should be accrued based on total hours or days or only based on worked hours or days. The last user defined setting is for the number of public holidays included in the selected annual period. The holidays only affect the business days calculation which in turn only affects the calculation of the provision for outstanding leave on the Summary sheet."]
{"$rows_left_out":76}
{"sheet":"Setup","index":3,"n_rows":395,"n_cols":5,"rows_kept":395,"cut":false,"hidden":true,"merged":[[4,1,4,3]]}
[{"$f":"IF(ISBLANK($B$5),\"Example Company Limited\",$B$5)","v":"Example Company (Pty) Limited"}]
["Annual Leave Setup"]
["© www.excel-skills.com"]
[]
["Business Name","Example Company (Pty) Limited"]
[]
["Cycle Start Date","2021-03-01",{"$f":"IF(ISBLANK($B$7),DATE(YEAR(TODAY()),MONTH(TODAY()),1),$B$7)","v":"2021-03-01"},"Cycle End Date",{"$f":"DATE(YEAR(Start)+1,MONTH(Start),0)","v":"2022-02-28"}]
[]
["Pay Period Basis","Monthly"]
[]
["Work Hours Per Day",8,{"$f":"IF(ISBLANK($B$11),8,$B$11)","v":8}]
[]
["Accrue On Total Or Worked Units",null,"Total"]
[]
["Number of Public Holidays",null,10]
[]
["Number of Work Days",null,{"$f":"IF(ISERROR(NETWORKDAYS(Start,$E$7))=TRUE,260,NETWORKDAYS(Start,$E$7))","v":261}]
["Net Work Days",null,{"$f":"C17-C15","v":251}]
[]
["Pay Basis","Annual Factor","Units","Interval","Rows"]
{"$rows_left_out":376}
{"sheet":"Leave","index":4,"n_rows":16,"n_cols":6,"rows_kept":16,"cut":false,"hidden":true,"merged":[]}
[{"$f":"Setup!$A$1","v":"Example Company (Pty) Limited"}]
["Leave Records"]
["© www.excel-skills.com",null,null,{"$f":"Setup!$C$32","v":"Days"}]
["Annual Leave Date","Form \nNumber","Employee Code","Number of Units","Payment Indicator","Employee \nName"]
["2021-03-22",1,1000,3,null,{"$f":"IF(ISBLANK($C5)=TRUE,\"\",IF(ISNA(VLOOKUP($C5,Employees,COLUMN(Summary!$B$5),0))=TRUE,\"incorrect code\",VLOOKUP($C5,Employees,COLUMN(Summary!$B$5),0)))","v":"A Taylor"}]
["2021-04-15",2,1020,3,null,{"$f":"IF(ISBLANK($C6)=TRUE,\"\",IF(ISNA(VLOOKUP($C6,Employees,COLUMN(Summary!$B$5),0))=TRUE,\"incorrect code\",VLOOKUP($C6,Employees,COLUMN(Summary!$B$5),0)))","v":"M Smith"}]
["2021-04-26",3,1000,3,null,{"$f":"IF(ISBLANK($C7)=TRUE,\"\",IF(ISNA(VLOOKUP($C7,Employees,COLUMN(Summary!$B$5),0))=TRUE,\"incorrect code\",VLOOKUP($C7,Employees,COLUMN(Summary!$B$5),0)))","v":"A Taylor"}]
["2021-05-03",4,1025,4,null,{"$f":"IF(ISBLANK($C8)=TRUE,\"\",IF(ISNA(VLOOKUP($C8,Employees,COLUMN(Summary!$B$5),0))=TRUE,\"incorrect code\",VLOOKUP($C8,Employees,COLUMN(Summary!$B$5),0)))","v":"C Jones"}]
["2021-06-20",5,1000,9,null,{"$f":"IF(ISBLANK($C9)=TRUE,\"\",IF(ISNA(VLOOKUP($C9,Employees,COLUMN(Summary!$B$5),0))=TRUE,\"incorrect code\",VLOOKUP($C9,Employees,COLUMN(Summary!$B$5),0)))","v":"A Taylor"}]
["2021-06-30","Payment",1020,14,"P",{"$f":"IF(ISBLANK($C10)=TRUE,\"\",IF(ISNA(VLOOKUP($C10,Employees,COLUMN(Summary!$B$5),0))=TRUE,\"incorrect code\",VLOOKUP($C10,Employees,COLUMN(Summary!$B$5),0)))","v":"M Smith"}]
["2021-07-20",6,1035,2,null,{"$f":"IF(ISBLANK($C11)=TRUE,\"\",IF(ISNA(VLOOKUP($C11,Employees,COLUMN(Summary!$B$5),0))=TRUE,\"incorrect code\",VLOOKUP($C11,Employees,COLUMN(Summary!$B$5),0)))","v":"T Cook"}]
["2021-09-18",7,1050,10,null,{"$f":"IF(ISBLANK($C12)=TRUE,\"\",IF(ISNA(VLOOKUP($C12,Employees,COLUMN(Summary!$B$5),0))=TRUE,\"incorrect code\",VLOOKUP($C12,Employees,COLUMN(Summary!$B$5),0)))","v":"W Clark"}]
["2021-09-30","Payment",1035,6.75,"P",{"$f":"IF(ISBLANK($C13)=TRUE,\"\",IF(ISNA(VLOOKUP($C13,Employees,COLUMN(Summary!$B$5),0))=TRUE,\"incorrect code\",VLOOKUP($C13,Employees,COLUMN(Summary!$B$5),0)))","v":"T Cook"}]
["2021-12-16",8,1025,9,null,{"$f":"IF(ISBLANK($C14)=TRUE,\"\",IF(ISNA(VLOOKUP($C14,Employees,COLUMN(Summary!$B$5),0))=TRUE,\"incorrect code\",VLOOKUP($C14,Employees,COLUMN(Summary!$B$5),0)))","v":"C Jones"}]
["2021-12-16",9,1050,5,null,{"$f":"IF(ISBLANK($C15)=TRUE,\"\",IF(ISNA(VLOOKUP($C15,Employees,COLUMN(Summary!$B$5),0))=TRUE,\"incorrect code\",VLOOKUP($C15,Employees,COLUMN(Summary!$B$5),0)))","v":"W Clark"}]
["2022-02-10",10,1000,3,null,{"$f":"IF(ISBLANK($C16)=TRUE,\"\",IF(ISNA(VLOOKUP($C16,Employees,COLUMN(Summary!$B$5),0))=TRUE,\"incorrect code\",VLOOKUP($C16,Employees,COLUMN(Summary!$B$5),0)))","v":"A Taylor"}]

{"sheet":"Summary","index":5,"n_rows":11,"n_cols":26,"rows_kept":11,"cut":false,"hidden":true,"merged":[]}
[{"$f":"Setup!$A$1","v":"Example Company (Pty) Limited"},null,null,null,null,null,null,null,null,null,null,{"$f":"IF(ISNA(MATCH($L$2,PayPeriod,0))=TRUE,\"Period error!\",\"\")","v":""}]
["Leave Summary",null,"Start Date",{"$f":"Start","v":"2021-03-01"},null,null,null,null,null,null,"Select  Pay Period","2022-02-28",null,"Total Provision"]
["© www.excel-skills.com",null,"End Date",{"$f":"DATE(YEAR(Start)+1,MONTH(Start),0)","v":"2022-02-28"},null,null,null,null,null,null,"Pay Period No",{"$f":"IF(OR(ISBLANK($L$2),ISNA(MATCH($L$2,PayPeriod,0))),0,MATCH($L$2,PayPeriod,0))","v":12},null,{"$f":"SUBTOTAL(109,Summary[[#Data],[Annual Leave Provision]])","v":14345.019920318724}]
[null,null,null,{"$f":"IF(ISBLANK($D$2),DATE(YEAR(TODAY()),MONTH(TODAY()),1),$D$2)","v":"2021-03-01"},null,{"$f":"Setup!$C$30","v":"Monthly"},null,{"$f":"Setup!$C$30","v":"Monthly"},null,null,null,null,null,null,{"$f":"$D$3","v":"2022-02-28"},{"$f":"DATE(YEAR(O4),MONTH(O4),0)","v":"2022-01-31"},{"$f":"DATE(YEAR(P4),MONTH(P4),0)","v":"2021-12-31"},"2021-11-30","2021-10-31","2021-09-30","2021-08-31","2021-07-31","2021-06-30","2021-05-31","2021-04-30","2021-03-31"]
["Employee Code","Employee \nName","Department Code","Employment Date","Termination Date","Salary Per Pay Period","Annual Leave Opening","Leave Per Pay Period","Annual Leave Entitlement","Annual Leave Accrued","Annual Leave Taken","Annual Leave Paid","Annual Leave Due","Annual Leave Provision","Leave \n1","Leave \n2","Leave \n3","Leave \n4","Leave \n5","Leave \n6","Leave \n7","Leave \n8","Leave \n9","Leave \n10","Leave \n11","Leave \n12"]
[1000,"A Taylor",1,"2018-08-01",null,36000,5,1.6666666666666667,{"$f":"IF($L$3=0,0,ROUND(H6*Setup!$C$31*Setup!$C$35,2))","v":20},{"$f":"IF(OR($L$3=0,$L$2<$D6,AND(ISBLANK($E6)=FALSE,$E6<$D$2)),0,I6/Setup!$C$31*MAX(0,IF(AND(ISBLANK(E6)=FALSE,E6<=$D$3),IF(ISNA(MATCH($E6,PayPeriod,1)),1,MIN($L$3,IF(ISNA(MATCH($E6,PayPeriod,0))=FALSE,MATCH($E6,PayPeriod,0),MATCH($E6,PayPeriod,1)+1))),$L$3)-IF(AND(D6>=$D$2,D6<=$D$3),IF(ISNA(MATCH($D6,PayPeriod,1)),0,IF(ISNA(MATCH($D6,PayPeriod,0))=FALSE,MATCH($D6,PayPeriod,1)-1,MATCH($D6,PayPeriod,1))),0))*IF($H$4=\"Hourly\",Setup!$C$11,1))","v":20},{"$f":"IF($L$3=0,0,IF(AND(ISBLANK($E6)=FALSE,$E6<$D$2),0,-SUMIFS(LeaveDays,LeaveDate,\">=\"&Start,LeaveDate,\"<=\"&$L$2,LeaveCode,$A6,LeavePmt,\"<>P\")))","v":-18},{"$f":"IF($L$3=0,0,IF(AND(ISBLANK($E6)=FALSE,$E6<$D$2),0,-SUMIFS(LeaveDays,LeaveDate,\">=\"&Start,LeaveDate,\"<=\"&$L$2,LeaveCode,$A6,LeavePmt,\"P\")))","v":0},{"$f":"IF($L$3=0,0,IF(AND(ISBLANK($E6)=FALSE,$E6<$D$2),0,G6+SUM(J6:L6)))","v":7},{"$f":"IF($L$3=0,0,IF(M6<0,0,IF(Setup!$C$18=0,0,$F6*Setup!$C$31/Setup!$C$18/IF($H$4=\"Hourly\",Setup!$C$11,1)*$M6)))","v":12047.808764940239},{"$f":"SUMIFS(LeaveDays,LeaveDate,\">=\"&DATE(YEAR(O$4),MONTH(O$4),1),LeaveDate,\"<=\"&O$4,LeaveCode,$A6)","v":3},{"$f":"SUMIFS(LeaveDays,LeaveDate,\">=\"&DATE(YEAR(P$4),MONTH(P$4),1),LeaveDate,\"<=\"&P$4,LeaveCode,$A6)","v":0},{"$f":"SUMIFS(LeaveDays,LeaveDate,\">=\"&DATE(YEAR(Q$4),MONTH(Q$4),1),LeaveDate,\"<=\"&Q$4,LeaveCode,$A6)","v":0},{"$f":"SUMIFS(LeaveDays,LeaveDate,\">=\"&DATE(YEAR(R$4),MONTH(R$4),1),LeaveDate,\"<=\"&R$4,LeaveCode,$A6)","v":0},{"$f":"SUMIFS(LeaveDays,LeaveDate,\">=\"&DATE(YEAR(S$4),MONTH(S$4),1),LeaveDate,\"<=\"&S$4,LeaveCode,$A6)","v":0},{"$f":"SUMIFS(LeaveDays,LeaveDate,\">=\"&DATE(YEAR(T$4),MONTH(T$4),1),LeaveDate,\"<=\"&T$4,LeaveCode,$A6)","v":0},{"$f":"SUMIFS(LeaveDays,LeaveDate,\">=\"&DATE(YEAR(U$4),MONTH(U$4),1),LeaveDate,\"<=\"&U$4,LeaveCode,$A6)","v":0},{"$f":"SUMIFS(LeaveDays,LeaveDate,\">=\"&DATE(YEAR(V$4),MONTH(V$4),1),LeaveDate,\"<=\"&V$4,LeaveCode,$A6)","v":0},{"$f":"SUMIFS(LeaveDays,LeaveDate,\">=\"&DATE(YEAR(W$4),MONTH(W$4),1),LeaveDate,\"<=\"&W$4,LeaveCode,$A6)","v":9},{"$f":"SUMIFS(LeaveDays,LeaveDate,\">=\"&DATE(YEAR(X$4),MONTH(X$4),1),LeaveDate,\"<=\"&X$4,LeaveCode,$A6)","v":0},{"$f":"SUMIFS(LeaveDays,LeaveDate,\">=\"&DATE(YEAR(Y$4),MONTH(Y$4),1),LeaveDate,\"<=\"&Y$4,LeaveCode,$A6)","v":3},{"$f":"SUMIFS(LeaveDays,LeaveDate,\">=\"&DATE(YEAR(Z$4),MONTH(Z$4),1),LeaveDate,\"<=\"&Z$4,LeaveCode,$A6)","v":3}]
[1020,"M Smith",1,"2020-05-31","2021-06-30",17500,12,1.25,{"$f":"IF($L$3=0,0,ROUND(H7*Setup!$C$31*Setup!$C$35,2))","v":15},{"$f":"IF(OR($L$3=0,$L$2<$D7,AND(ISBLANK($E7)=FALSE,$E7<$D$2)),0,I7/Setup!$C$31*MAX(0,IF(AND(ISBLANK(E7)=FALSE,E7<=$D$3),IF(ISNA(MATCH($E7,PayPeriod,1)),1,MIN($L$3,IF(ISNA(MATCH($E7,PayPeriod,0))=FALSE,MATCH($E7,PayPeriod,0),MATCH($E7,PayPeriod,1)+1))),$L$3)-IF(AND(D7>=$D$2,D7<=$D$3),IF(ISNA(MATCH($D7,PayPeriod,1)),0,IF(ISNA(MATCH($D7,PayPeriod,0))=FALSE,MATCH($D7,PayPeriod,1)-1,MATCH($D7,PayPeriod,1))),0))*IF($H$4=\"Hourly\",Setup!$C$11,1))","v":5},{"$f":"IF($L$3=0,0,IF(AND(ISBLANK($E7)=FALSE,$E7<$D$2),0,-SUMIFS(LeaveDays,LeaveDate,\">=\"&Start,LeaveDate,\"<=\"&$L$2,LeaveCode,$A7,LeavePmt,\"<>P\")))","v":-3},{"$f":"IF($L$3=0,0,IF(AND(ISBLANK($E7)=FALSE,$E7<$D$2),0,-SUMIFS(LeaveDays,LeaveDate,\">=\"&Start,LeaveDate,\"<=\"&$L$2,LeaveCode,$A7,LeavePmt,\"P\")))","v":-14},0,{"$f":"IF($L$3=0,0,IF(M7<0,0,IF(Setup!$C$18=0,0,$F7*Setup!$C$31/Setup!$C$18/IF($H$4=\"Hourly\",Setup!$C$11,1)*$M7)))","v":0},{"$f":"SUMIFS(LeaveDays,LeaveDate,\">=\"&DATE(YEAR(O$4),MONTH(O$4),1),LeaveDate,\"<=\"&O$4,LeaveCode,$A7)","v":0},{"$f":"SUMIFS(LeaveDays,LeaveDate,\">=\"&DATE(YEAR(P$4),MONTH(P$4),1),LeaveDate,\"<=\"&P$4,LeaveCode,$A7)","v":0},{"$f":"SUMIFS(LeaveDays,LeaveDate,\">=\"&DATE(YEAR(Q$4),MONTH(Q$4),1),LeaveDate,\"<=\"&Q$4,LeaveCode,$A7)","v":0},{"$f":"SUMIFS(LeaveDays,LeaveDate,\">=\"&DATE(YEAR(R$4),MONTH(R$4),1),LeaveDate,\"<=\"&R$4,LeaveCode,$A7)","v":0},{"$f":"SUMIFS(LeaveDays,LeaveDate,\">=\"&DATE(YEAR(S$4),MONTH(S$4),1),LeaveDate,\"<=\"&S$4,LeaveCode,$A7)","v":0},{"$f":"SUMIFS(LeaveDays,LeaveDate,\">=\"&DATE(YEAR(T$4),MONTH(T$4),1),LeaveDate,\"<=\"&T$4,LeaveCode,$A7)","v":0},{"$f":"SUMIFS(LeaveDays,LeaveDate,\">=\"&DATE(YEAR(U$4),MONTH(U$4),1),LeaveDate,\"<=\"&U$4,LeaveCode,$A7)","v":0},{"$f":"SUMIFS(LeaveDays,LeaveDate,\">=\"&DATE(YEAR(V$4),MONTH(V$4),1),LeaveDate,\"<=\"&V$4,LeaveCode,$A7)","v":0},{"$f":"SUMIFS(LeaveDays,LeaveDate,\">=\"&DATE(YEAR(W$4),MONTH(W$4),1),LeaveDate,\"<=\"&W$4,LeaveCode,$A7)","v":14},{"$f":"SUMIFS(LeaveDays,LeaveDate,\">=\"&DATE(YEAR(X$4),MONTH(X$4),1),LeaveDate,\"<=\"&X$4,LeaveCode,$A7)","v":0},{"$f":"SUMIFS(LeaveDays,LeaveDate,\">=\"&DATE(YEAR(Y$4),MONTH(Y$4),1),LeaveDate,\"<=\"&Y$4,LeaveCode,$A7)","v":3},{"$f":"SUMIFS(LeaveDays,LeaveDate,\">=\"&DATE(YEAR(Z$4),MONTH(Z$4),1),LeaveDate,\"<=\"&Z$4,LeaveCode,$A7)","v":0}]
[1025,"C Jones",2,"2021-01-01",null,8400,0,1.25,{"$f":"IF($L$3=0,0,ROUND(H8*Setup!$C$31*Setup!$C$35,2))","v":15},{"$f":"IF(OR($L$3=0,$L$2<$D8,AND(ISBLANK($E8)=FALSE,$E8<$D$2)),0,I8/Setup!$C$31*MAX(0,IF(AND(ISBLANK(E8)=FALSE,E8<=$D$3),IF(ISNA(MATCH($E8,PayPeriod,1)),1,MIN($L$3,IF(ISNA(MATCH($E8,PayPeriod,0))=FALSE,MATCH($E8,PayPeriod,0),MATCH($E8,PayPeriod,1)+1))),$L$3)-IF(AND(D8>=$D$2,D8<=$D$3),IF(ISNA(MATCH($D8,PayPeriod,1)),0,IF(ISNA(MATCH($D8,PayPeriod,0))=FALSE,MATCH($D8,PayPeriod,1)-1,MATCH($D8,PayPeriod,1))),0))*IF($H$4=\"Hourly\",Setup!$C$11,1))","v":15},{"$f":"IF($L$3=0,0,IF(AND(ISBLANK($E8)=FALSE,$E8<$D$2),0,-SUMIFS(LeaveDays,LeaveDate,\">=\"&Start,LeaveDate,\"<=\"&$L$2,LeaveCode,$A8,LeavePmt,\"<>P\")))","v":-13},{"$f":"IF($L$3=0,0,IF(AND(ISBLANK($E8)=FALSE,$E8<$D$2),0,-SUMIFS(LeaveDays,LeaveDate,\">=\"&Start,LeaveDate,\"<=\"&$L$2,LeaveCode,$A8,LeavePmt,\"P\")))","v":0},2,{"$f":"IF($L$3=0,0,IF(M8<0,0,IF(Setup!$C$18=0,0,$F8*Setup!$C$31/Setup!$C$18/IF($H$4=\"Hourly\",Setup!$C$11,1)*$M8)))","v":803.18725099601591},{"$f":"SUMIFS(LeaveDays,LeaveDate,\">=\"&DATE(YEAR(O$4),MONTH(O$4),1),LeaveDate,\"<=\"&O$4,LeaveCode,$A8)","v":0},{"$f":"SUMIFS(LeaveDays,LeaveDate,\">=\"&DATE(YEAR(P$4),MONTH(P$4),1),LeaveDate,\"<=\"&P$4,LeaveCode,$A8)","v":0},{"$f":"SUMIFS(LeaveDays,LeaveDate,\">=\"&DATE(YEAR(Q$4),MONTH(Q$4),1),LeaveDate,\"<=\"&Q$4,LeaveCode,$A8)","v":9},{"$f":"SUMIFS(LeaveDays,LeaveDate,\">=\"&DATE(YEAR(R$4),MONTH(R$4),1),LeaveDate,\"<=\"&R$4,LeaveCode,$A8)","v":0},{"$f":"SUMIFS(LeaveDays,LeaveDate,\">=\"&DATE(YEAR(S$4),MONTH(S$4),1),LeaveDate,\"<=\"&S$4,LeaveCode,$A8)","v":0},{"$f":"SUMIFS(LeaveDays,LeaveDate,\">=\"&DATE(YEAR(T$4),MONTH(T$4),1),LeaveDate,\"<=\"&T$4,LeaveCode,$A8)","v":0},{"$f":"SUMIFS(LeaveDays,LeaveDate,\">=\"&DATE(YEAR(U$4),MONTH(U$4),1),LeaveDate,\"<=\"&U$4,LeaveCode,$A8)","v":0},{"$f":"SUMIFS(LeaveDays,LeaveDate,\">=\"&DATE(YEAR(V$4),MONTH(V$4),1),LeaveDate,\"<=\"&V$4,LeaveCode,$A8)","v":0},{"$f":"SUMIFS(LeaveDays,LeaveDate,\">=\"&DATE(YEAR(W$4),MONTH(W$4),1),LeaveDate,\"<=\"&W$4,LeaveCode,$A8)","v":0},{"$f":"SUMIFS(LeaveDays,LeaveDate,\">=\"&DATE(YEAR(X$4),MONTH(X$4),1),LeaveDate,\"<=\"&X$4,LeaveCode,$A8)","v":4},{"$f":"SUMIFS(LeaveDays,LeaveDate,\">=\"&DATE(YEAR(Y$4),MONTH(Y$4),1),LeaveDate,\"<=\"&Y$4,LeaveCode,$A8)","v":0},{"$f":"SUMIFS(LeaveDays,LeaveDate,\">=\"&DATE(YEAR(Z$4),MONTH(Z$4),1),LeaveDate,\"<=\"&Z$4,LeaveCode,$A8)","v":0}]
[1035,"T Cook",2,"2021-07-01","2022-01-31",26000,0,1.25,{"$f":"IF($L$3=0,0,ROUND(H9*Setup!$C$31*Setup!$C$35,2))","v":15},{"$f":"IF(OR($L$3=0,$L$2<$D9,AND(ISBLANK($E9)=FALSE,$E9<$D$2)),0,I9/Setup!$C$31*MAX(0,IF(AND(ISBLANK(E9)=FALSE,E9<=$D$3),IF(ISNA(MATCH($E9,PayPeriod,1)),1,MIN($L$3,IF(ISNA(MATCH($E9,PayPeriod,0))=FALSE,MATCH($E9,PayPeriod,0),MATCH($E9,PayPeriod,1)+1))),$L$3)-IF(AND(D9>=$D$2,D9<=$D$3),IF(ISNA(MATCH($D9,PayPeriod,1)),0,IF(ISNA(MATCH($D9,PayPeriod,0))=FALSE,MATCH($D9,PayPeriod,1)-1,MATCH($D9,PayPeriod,1))),0))*IF($H$4=\"Hourly\",Setup!$C$11,1))","v":8.75},{"$f":"IF($L$3=0,0,IF(AND(ISBLANK($E9)=FALSE,$E9<$D$2),0,-SUMIFS(LeaveDays,LeaveDate,\">=\"&Start,LeaveDate,\"<=\"&$L$2,LeaveCode,$A9,LeavePmt,\"<>P\")))","v":-2},{"$f":"IF($L$3=0,0,IF(AND(ISBLANK($E9)=FALSE,$E9<$D$2),0,-SUMIFS(LeaveDays,LeaveDate,\">=\"&Start,LeaveDate,\"<=\"&$L$2,LeaveCode,$A9,LeavePmt,\"P\")))","v":-6.75},0,{"$f":"IF($L$3=0,0,IF(M9<0,0,IF(Setup!$C$18=0,0,$F9*Setup!$C$31/Setup!$C$18/IF($H$4=\"Hourly\",Setup!$C$11,1)*$M9)))","v":0},{"$f":"SUMIFS(LeaveDays,LeaveDate,\">=\"&DATE(YEAR(O$4),MONTH(O$4),1),LeaveDate,\"<=\"&O$4,LeaveCode,$A9)","v":0},{"$f":"SUMIFS(LeaveDays,LeaveDate,\">=\"&DATE(YEAR(P$4),MONTH(P$4),1),LeaveDate,\"<=\"&P$4,LeaveCode,$A9)","v":0},{"$f":"SUMIFS(LeaveDays,LeaveDate,\">=\"&DATE(YEAR(Q$4),MONTH(Q$4),1),LeaveDate,\"<=\"&Q$4,LeaveCode,$A9)","v":0},{"$f":"SUMIFS(LeaveDays,LeaveDate,\">=\"&DATE(YEAR(R$4),MONTH(R$4),1),LeaveDate,\"<=\"&R$4,LeaveCode,$A9)","v":0},{"$f":"SUMIFS(LeaveDays,LeaveDate,\">=\"&DATE(YEAR(S$4),MONTH(S$4),1),LeaveDate,\"<=\"&S$4,LeaveCode,$A9)","v":0},{"$f":"SUMIFS(LeaveDays,LeaveDate,\">=\"&DATE(YEAR(T$4),MONTH(T$4),1),LeaveDate,\"<=\"&T$4,LeaveCode,$A9)","v":6.75},{"$f":"SUMIFS(LeaveDays,LeaveDate,\">=\"&DATE(YEAR(U$4),MONTH(U$4),1),LeaveDate,\"<=\"&U$4,LeaveCode,$A9)","v":0},{"$f":"SUMIFS(LeaveDays,LeaveDate,\">=\"&DATE(YEAR(V$4),MONTH(V$4),1),LeaveDate,\"<=\"&V$4,LeaveCode,$A9)","v":2},{"$f":"SUMIFS(LeaveDays,LeaveDate,\">=\"&DATE(YEAR(W$4),MONTH(W$4),1),LeaveDate,\"<=\"&W$4,LeaveCode,$A9)","v":0},{"$f":"SUMIFS(LeaveDays,LeaveDate,\">=\"&DATE(YEAR(X$4),MONTH(X$4),1),LeaveDate,\"<=\"&X$4,LeaveCode,$A9)","v":0},{"$f":"SUMIFS(LeaveDays,LeaveDate,\">=\"&DATE(YEAR(Y$4),MONTH(Y$4),1),LeaveDate,\"<=\"&Y$4,LeaveCode,$A9)","v":0},{"$f":"SUMIFS(LeaveDays,LeaveDate,\">=\"&DATE(YEAR(Z$4),MONTH(Z$4),1),LeaveDate,\"<=\"&Z$4,LeaveCode,$A9)","v":0}]
[1050,"W Clark",2,"2021-08-01",null,41000,0,2.0833333333333335,{"$f":"IF($L$3=0,0,ROUND(H10*Setup!$C$31*Setup!$C$35,2))","v":25},{"$f":"IF(OR($L$3=0,$L$2<$D10,AND(ISBLANK($E10)=FALSE,$E10<$D$2)),0,I10/Setup!$C$31*MAX(0,IF(AND(ISBLANK(E10)=FALSE,E10<=$D$3),IF(ISNA(MATCH($E10,PayPeriod,1)),1,MIN($L$3,IF(ISNA(MATCH($E10,PayPeriod,0))=FALSE,MATCH($E10,PayPeriod,0),MATCH($E10,PayPeriod,1)+1))),$L$3)-IF(AND(D10>=$D$2,D10<=$D$3),IF(ISNA(MATCH($D10,PayPeriod,1)),0,IF(ISNA(MATCH($D10,PayPeriod,0))=FALSE,MATCH($D10,PayPeriod,1)-1,MATCH($D10,PayPeriod,1))),0))*IF($H$4=\"Hourly\",Setup!$C$11,1))","v":14.583333333333334},{"$f":"IF($L$3=0,0,IF(AND(ISBLANK($E10)=FALSE,$E10<$D$2),0,-SUMIFS(LeaveDays,LeaveDate,\">=\"&Start,LeaveDate,\"<=\"&$L$2,LeaveCode,$A10,LeavePmt,\"<>P\")))","v":-15},{"$f":"IF($L$3=0,0,IF(AND(ISBLANK($E10)=FALSE,$E10<$D$2),0,-SUMIFS(LeaveDays,LeaveDate,\">=\"&Start,LeaveDate,\"<=\"&$L$2,LeaveCode,$A10,LeavePmt,\"P\")))","v":0},-0.41666666666666607,{"$f":"IF($L$3=0,0,IF(M10<0,0,IF(Setup!$C$18=0,0,$F10*Setup!$C$31/Setup!$C$18/IF($H$4=\"Hourly\",Setup!$C$11,1)*$M10)))","v":0},{"$f":"SUMIFS(LeaveDays,LeaveDate,\">=\"&DATE(YEAR(O$4),MONTH(O$4),1),LeaveDate,\"<=\"&O$4,LeaveCode,$A10)","v":0},{"$f":"SUMIFS(LeaveDays,LeaveDate,\">=\"&DATE(YEAR(P$4),MONTH(P$4),1),LeaveDate,\"<=\"&P$4,LeaveCode,$A10)","v":0},{"$f":"SUMIFS(LeaveDays,LeaveDate,\">=\"&DATE(YEAR(Q$4),MONTH(Q$4),1),LeaveDate,\"<=\"&Q$4,LeaveCode,$A10)","v":5},{"$f":"SUMIFS(LeaveDays,LeaveDate,\">=\"&DATE(YEAR(R$4),MONTH(R$4),1),LeaveDate,\"<=\"&R$4,LeaveCode,$A10)","v":0},{"$f":"SUMIFS(LeaveDays,LeaveDate,\">=\"&DATE(YEAR(S$4),MONTH(S$4),1),LeaveDate,\"<=\"&S$4,LeaveCode,$A10)","v":0},{"$f":"SUMIFS(LeaveDays,LeaveDate,\">=\"&DATE(YEAR(T$4),MONTH(T$4),1),LeaveDate,\"<=\"&T$4,LeaveCode,$A10)","v":10},{"$f":"SUMIFS(LeaveDays,LeaveDate,\">=\"&DATE(YEAR(U$4),MONTH(U$4),1),LeaveDate,\"<=\"&U$4,LeaveCode,$A10)","v":0},{"$f":"SUMIFS(LeaveDays,LeaveDate,\">=\"&DATE(YEAR(V$4),MONTH(V$4),1),LeaveDate,\"<=\"&V$4,LeaveCode,$A10)","v":0},{"$f":"SUMIFS(LeaveDays,LeaveDate,\">=\"&DATE(YEAR(W$4),MONTH(W$4),1),LeaveDate,\"<=\"&W$4,LeaveCode,$A10)","v":0},{"$f":"SUMIFS(LeaveDays,LeaveDate,\">=\"&DATE(YEAR(X$4),MONTH(X$4),1),LeaveDate,\"<=\"&X$4,LeaveCode,$A10)","v":0},{"$f":"SUMIFS(LeaveDays,LeaveDate,\">=\"&DATE(YEAR(Y$4),MONTH(Y$4),1),LeaveDate,\"<=\"&Y$4,LeaveCode,$A10)","v":0},{"$f":"SUMIFS(LeaveDays,LeaveDate,\">=\"&DATE(YEAR(Z$4),MONTH(Z$4),1),LeaveDate,\"<=\"&Z$4,LeaveCode,$A10)","v":0}]
[1060,"J Brady",3,"2022-02-01",null,25000,0,1.25,{"$f":"IF($L$3=0,0,ROUND(H11*Setup!$C$31*Setup!$C$35,2))","v":15},{"$f":"IF(OR($L$3=0,$L$2<$D11,AND(ISBLANK($E11)=FALSE,$E11<$D$2)),0,I11/Setup!$C$31*MAX(0,IF(AND(ISBLANK(E11)=FALSE,E11<=$D$3),IF(ISNA(MATCH($E11,PayPeriod,1)),1,MIN($L$3,IF(ISNA(MATCH($E11,PayPeriod,0))=FALSE,MATCH($E11,PayPeriod,0),MATCH($E11,PayPeriod,1)+1))),$L$3)-IF(AND(D11>=$D$2,D11<=$D$3),IF(ISNA(MATCH($D11,PayPeriod,1)),0,IF(ISNA(MATCH($D11,PayPeriod,0))=FALSE,MATCH($D11,PayPeriod,1)-1,MATCH($D11,PayPeriod,1))),0))*IF($H$4=\"Hourly\",Setup!$C$11,1))","v":1.25},{"$f":"IF($L$3=0,0,IF(AND(ISBLANK($E11)=FALSE,$E11<$D$2),0,-SUMIFS(LeaveDays,LeaveDate,\">=\"&Start,LeaveDate,\"<=\"&$L$2,LeaveCode,$A11,LeavePmt,\"<>P\")))","v":0},{"$f":"IF($L$3=0,0,IF(AND(ISBLANK($E11)=FALSE,$E11<$D$2),0,-SUMIFS(LeaveDays,LeaveDate,\">=\"&Start,LeaveDate,\"<=\"&$L$2,LeaveCode,$A11,LeavePmt,\"P\")))","v":0},1.25,{"$f":"IF($L$3=0,0,IF(M11<0,0,IF(Setup!$C$18=0,0,$F11*Setup!$C$31/Setup!$C$18/IF($H$4=\"Hourly\",Setup!$C$11,1)*$M11)))","v":1494.0239043824702},{"$f":"SUMIFS(LeaveDays,LeaveDate,\">=\"&DATE(YEAR(O$4),MONTH(O$4),1),LeaveDate,\"<=\"&O$4,LeaveCode,$A11)","v":0},{"$f":"SUMIFS(LeaveDays,LeaveDate,\">=\"&DATE(YEAR(P$4),MONTH(P$4),1),LeaveDate,\"<=\"&P$4,LeaveCode,$A11)","v":0},{"$f":"SUMIFS(LeaveDays,LeaveDate,\">=\"&DATE(YEAR(Q$4),MONTH(Q$4),1),LeaveDate,\"<=\"&Q$4,LeaveCode,$A11)","v":0},{"$f":"SUMIFS(LeaveDays,LeaveDate,\">=\"&DATE(YEAR(R$4),MONTH(R$4),1),LeaveDate,\"<=\"&R$4,LeaveCode,$A11)","v":0},{"$f":"SUMIFS(LeaveDays,LeaveDate,\">=\"&DATE(YEAR(S$4),MONTH(S$4),1),LeaveDate,\"<=\"&S$4,LeaveCode,$A11)","v":0},{"$f":"SUMIFS(LeaveDays,LeaveDate,\">=\"&DATE(YEAR(T$4),MONTH(T$4),1),LeaveDate,\"<=\"&T$4,LeaveCode,$A11)","v":0},{"$f":"SUMIFS(LeaveDays,LeaveDate,\">=\"&DATE(YEAR(U$4),MONTH(U$4),1),LeaveDate,\"<=\"&U$4,LeaveCode,$A11)","v":0},{"$f":"SUMIFS(LeaveDays,LeaveDate,\">=\"&DATE(YEAR(V$4),MONTH(V$4),1),LeaveDate,\"<=\"&V$4,LeaveCode,$A11)","v":0},{"$f":"SUMIFS(LeaveDays,LeaveDate,\">=\"&DATE(YEAR(W$4),MONTH(W$4),1),LeaveDate,\"<=\"&W$4,LeaveCode,$A11)","v":0},{"$f":"SUMIFS(LeaveDays,LeaveDate,\">=\"&DATE(YEAR(X$4),MONTH(X$4),1),LeaveDate,\"<=\"&X$4,LeaveCode,$A11)","v":0},{"$f":"SUMIFS(LeaveDays,LeaveDate,\">=\"&DATE(YEAR(Y$4),MONTH(Y$4),1),LeaveDate,\"<=\"&Y$4,LeaveCode,$A11)","v":0},{"$f":"SUMIFS(LeaveDays,LeaveDate,\">=\"&DATE(YEAR(Z$4),MONTH(Z$4),1),LeaveDate,\"<=\"&Z$4,LeaveCode,$A11)","v":0}]