{"text_format":"1","workbook":"xlsx","n_sheets":6,"sheets":["Info","Trial","Instructions","Setup","Summary","Tracking"],"not_rendered":{"charts":0,"images":2,"macros":1,"external_links":0,"defined_names":17,"comments":0,"pivot_tables":0},"unopened":[],"bounds":{"document_bytes":16777216,"sheet_cells":100000,"rows_first":2000,"rows_last":500,"rows_between":2000,"halvings":0,"cell_chars":16384,"cell_head_chars":4096},"cells_cut":0,"cells_raw":0,"read":"whole","date_system":"1900"}

{"sheet":"Info","index":0,"n_rows":0,"n_cols":0,"rows_kept":0,"cut":false,"hidden":false,"merged":[]}

{"sheet":"Trial","index":1,"n_rows":0,"n_cols":0,"rows_kept":0,"cut":false,"hidden":true,"merged":[]}

{"sheet":"Instructions","index":2,"n_rows":130,"n_cols":1,"rows_kept":130,"cut":false,"hidden":true,"merged":[]}
["Excel Skills | Leave Tracker Template"]
["Instructions"]
["www.excel-skills.com"]
[]
["This template enables users to track the leave that is applied for by all employees and to ensure that there is always adequate staff in each department or for every defined role. All leave that is applied for needs to be recorded on an individual employee basis and is then displayed visually on the Summary sheet. The Summary sheet can also be filtered by department or role to determine whether there are always sufficient resources available."]
[]
{"$rows_left_out":125}
{"sheet":"Setup","index":3,"n_rows":29,"n_cols":5,"rows_kept":29,"cut":false,"hidden":true,"merged":[]}
["Leave Tracker"]
["Setup"]
["© www.excel-skills.com"]
[]
["Tracking Start Date","2021-03-29"]
[]
{"$rows_left_out":24}
{"sheet":"Summary","index":4,"n_rows":18,"n_cols":63,"rows_kept":18,"cut":false,"hidden":true,"merged":[]}
["Leave Tracker",null,"Workday Status: ",{"$f":"IF(AND(Setup!$C$8=0,D$4=\"Fri\"),\"N\",IF(AND(Setup!$C$9=0,D$4=\"Sat\"),\"N\",IF(AND(Setup!$C$10=0,D$4=\"Sun\"),\"N\",IF(AND(Setup!$C$11=0,D$3=\"Y\"),\"N\",\"Y\"))))","v":"Y"},{"$f":"IF(AND(Setup!$C$8=0,E$4=\"Fri\"),\"N\",IF(AND(Setup!$C$9=0,E$4=\"Sat\"),\"N\",IF(AND(Setup!$C$10=0,E$4=\"Sun\"),\"N\",IF(AND(Setup!$C$11=0,E$3=\"Y\"),\"N\",\"Y\"))))","v":"Y"},{"$f":"IF(AND(Setup!$C$8=0,F$4=\"Fri\"),\"N\",IF(AND(Setup!$C$9=0,F$4=\"Sat\"),\"N\",IF(AND(Setup!$C$10=0,F$4=\"Sun\"),\"N\",IF(AND(Setup!$C$11=0,F$3=\"Y\"),\"N\",\"Y\"))))","v":"Y"},{"$f":"IF(AND(Setup!$C$8=0,G$4=\"Fri\"),\"N\",IF(AND(Setup!$C$9=0,G$4=\"Sat\"),\"N\",IF(AND(Setup!$C$10=0,G$4=\"Sun\"),\"N\",IF(AND(Setup!$C$11=0,G$3=\"Y\"),\"N\",\"Y\"))))","v":"Y"},{"$f":"IF(AND(Setup!$C$8=0,H$4=\"Fri\"),\"N\",IF(AND(Setup!$C$9=0,H$4=\"Sat\"),\"N\",IF(AND(Setup!$C$10=0,H$4=\"Sun\"),\"N\",IF(AND(Setup!$C$11=0,H$3=\"Y\"),\"N\",\"Y\"))))","v":"N"},{"$f":"IF(AND(Setup!$C$8=0,I$4=\"Fri\"),\"N\",IF(AND(Setup!$C$9=0,I$4=\"Sat\"),\"N\",IF(AND(Setup!$C$10=0,I$4=\"Sun\"),\"N\",IF(AND(Setup!$C$11=0,I$3=\"Y\"),\"N\",\"Y\"))))","v":"N"},{"$f":"IF(AND(Setup!$C$8=0,J$4=\"Fri\"),\"N\",IF(AND(Setup!$C$9=0,J$4=\"Sat\"),\"N\",IF(AND(Setup!$C$10=0,J$4=\"Sun\"),\"N\",IF(AND(Setup!$C$11=0,J$3=\"Y\"),\"N\",\"Y\"))))","v":"N"},{"$f":"IF(AND(Setup!$C$8=0,K$4=\"Fri\"),\"N\",IF(AND(Setup!$C$9=0,K$4=\"Sat\"),\"N\",IF(AND(Setup!$C$10=0,K$4=\"Sun\"),\"N\",IF(AND(Setup!$C$11=0,K$3=\"Y\"),\"N\",\"Y\"))))","v":"N"},{"$f":"IF(AND(Setup!$C$8=0,L$4=\"Fri\"),\"N\",IF(AND(Setup!$C$9=0,L$4=\"Sat\"),\"N\",IF(AND(Setup!$C$10=0,L$4=\"Sun\"),\"N\",IF(AND(Setup!$C$11=0,L$3=\"Y\"),\"N\",\"Y\"))))","v":"Y"},{"$f":"IF(AND(Setup!$C$8=0,M$4=\"Fri\"),\"N\",IF(AND(Setup!$C$9=0,M$4=\"Sat\"),\"N\",IF(AND(Setup!$C$10=0,M$4=\"Sun\"),\"N\",IF(AND(Setup!$C$11=0,M$3=\"Y\"),\"N\",\"Y\"))))","v":"Y"},{"$f":"IF(AND(Setup!$C$8=0,N$4=\"Fri\"),\"N\",IF(AND(Setup!$C$9=0,N$4=\"Sat\"),\"N\",IF(AND(Setup!$C$10=0,N$4=\"Sun\"),\"N\",IF(AND(Setup!$C$11=0,N$3=\"Y\"),\"N\",\"Y\"))))","v":"Y"},{"$f":"IF(AND(Setup!$C$8=0,O$4=\"Fri\"),\"N\",IF(AND(Setup!$C$9=0,O$4=\"Sat\"),\"N\",IF(AND(Setup!$C$10=0,O$4=\"Sun\"),\"N\",IF(AND(Setup!$C$11=0,O$3=\"Y\"),\"N\",\"Y\"))))","v":"Y"},{"$f":"IF(AND(Setup!$C$8=0,P$4=\"Fri\"),\"N\",IF(AND(Setup!$C$9=0,P$4=\"Sat\"),\"N\",IF(AND(Setup!$C$10=0,P$4=\"Sun\"),\"N\",IF(AND(Setup!$C$11=0,P$3=\"Y\"),\"N\",\"Y\"))))","v":"N"},{"$f":"IF(AND(Setup!$C$8=0,Q$4=\"Fri\"),\"N\",IF(AND(Setup!$C$9=0,Q$4=\"Sat\"),\"N\",IF(AND(Setup!$C$10=0,Q$4=\"Sun\"),\"N\",IF(AND(Setup!$C$11=0,Q$3=\"Y\"),\"N\",\"Y\"))))","v":"N"},{"$f":"IF(AND(Setup!$C$8=0,R$4=\"Fri\"),\"N\",IF(AND(Setup!$C$9=0,R$4=\"Sat\"),\"N\",IF(AND(Setup!$C$10=0,R$4=\"Sun\"),\"N\",IF(AND(Setup!$C$11=0,R$3=\"Y\"),\"N\",\"Y\"))))","v":"Y"},{"$f":"IF(AND(Setup!$C$8=0,S$4=\"Fri\"),\"N\",IF(AND(Setup!$C$9=0,S$4=\"Sat\"),\"N\",IF(AND(Setup!$C$10=0,S$4=\"Sun\"),\"N\",IF(AND(Setup!$C$11=0,S$3=\"Y\"),\"N\",\"Y\"))))","v":"Y"},{"$f":"IF(AND(Setup!$C$8=0,T$4=\"Fri\"),\"N\",IF(AND(Setup!$C$9=0,T$4=\"Sat\"),\"N\",IF(AND(Setup!$C$10=0,T$4=\"Sun\"),\"N\",IF(AND(Setup!$C$11=0,T$3=\"Y\"),\"N\",\"Y\"))))","v":"Y"},{"$f":"IF(AND(Setup!$C$8=0,U$4=\"Fri\"),\"N\",IF(AND(Setup!$C$9=0,U$4=\"Sat\"),\"N\",IF(AND(Setup!$C$10=0,U$4=\"Sun\"),\"N\",IF(AND(Setup!$C$11=0,U$3=\"Y\"),\"N\",\"Y\"))))","v":"Y"},{"$f":"IF(AND(Setup!$C$8=0,V$4=\"Fri\"),\"N\",IF(AND(Setup!$C$9=0,V$4=\"Sat\"),\"N\",IF(AND(Setup!$C$10=0,V$4=\"Sun\"),\"N\",IF(AND(Setup!$C$11=0,V$3=\"Y\"),\"N\",\"Y\"))))","v":"Y"},{"$f":"IF(AND(Setup!$C$8=0,W$4=\"Fri\"),\"N\",IF(AND(Setup!$C$9=0,W$4=\"Sat\"),\"N\",IF(AND(Setup!$C$10=0,W$4=\"Sun\"),\"N\",IF(AND(Setup!$C$11=0,W$3=\"Y\"),\"N\",\"Y\"))))","v":"N"},{"$f":"IF(AND(Setup!$C$8=0,X$4=\"Fri\"),\"N\",IF(AND(Setup!$C$9=0,X$4=\"Sat\"),\"N\",IF(AND(Setup!$C$10=0,X$4=\"Sun\"),\"N\",IF(AND(Setup!$C$11=0,X$3=\"Y\"),\"N\",\"Y\"))))","v":"N"},{"$f":"IF(AND(Setup!$C$8=0,Y$4=\"Fri\"),\"N\",IF(AND(Setup!$C$9=0,Y$4=\"Sat\"),\"N\",IF(AND(Setup!$C$10=0,Y$4=\"Sun\"),\"N\",IF(AND(Setup!$C$11=0,Y$3=\"Y\"),\"N\",\"Y\"))))","v":"Y"},{"$f":"IF(AND(Setup!$C$8=0,Z$4=\"Fri\"),\"N\",IF(AND(Setup!$C$9=0,Z$4=\"Sat\"),\"N\",IF(AND(Setup!$C$10=0,Z$4=\"Sun\"),\"N\",IF(AND(Setup!$C$11=0,Z$3=\"Y\"),\"N\",\"Y\"))))","v":"Y"},{"$f":"IF(AND(Setup!$C$8=0,AA$4=\"Fri\"),\"N\",IF(AND(Setup!$C$9=0,AA$4=\"Sat\"),\"N\",IF(AND(Setup!$C$10=0,AA$4=\"Sun\"),\"N\",IF(AND(Setup!$C$11=0,AA$3=\"Y\"),\"N\",\"Y\"))))","v":"Y"},{"$f":"IF(AND(Setup!$C$8=0,AB$4=\"Fri\"),\"N\",IF(AND(Setup!$C$9=0,AB$4=\"Sat\"),\"N\",IF(AND(Setup!$C$10=0,AB$4=\"Sun\"),\"N\",IF(AND(Setup!$C$11=0,AB$3=\"Y\"),\"N\",\"Y\"))))","v":"Y"},{"$f":"IF(AND(Setup!$C$8=0,AC$4=\"Fri\"),\"N\",IF(AND(Setup!$C$9=0,AC$4=\"Sat\"),\"N\",IF(AND(Setup!$C$10=0,AC$4=\"Sun\"),\"N\",IF(AND(Setup!$C$11=0,AC$3=\"Y\"),\"N\",\"Y\"))))","v":"Y"},{"$f":"IF(AND(Setup!$C$8=0,AD$4=\"Fri\"),\"N\",IF(AND(Setup!$C$9=0,AD$4=\"Sat\"),\"N\",IF(AND(Setup!$C$10=0,AD$4=\"Sun\"),\"N\",IF(AND(Setup!$C$11=0,AD$3=\"Y\"),\"N\",\"Y\"))))","v":"N"},{"$f":"IF(AND(Setup!$C$8=0,AE$4=\"Fri\"),\"N\",IF(AND(Setup!$C$9=0,AE$4=\"Sat\"),\"N\",IF(AND(Setup!$C$10=0,AE$4=\"Sun\"),\"N\",IF(AND(Setup!$C$11=0,AE$3=\"Y\"),\"N\",\"Y\"))))","v":"N"},{"$f":"IF(AND(Setup!$C$8=0,AF$4=\"Fri\"),\"N\",IF(AND(Setup!$C$9=0,AF$4=\"Sat\"),\"N\",IF(AND(Setup!$C$10=0,AF$4=\"Sun\"),\"N\",IF(AND(Setup!$C$11=0,AF$3=\"Y\"),\"N\",\"Y\"))))","v":"Y"},{"$f":"IF(AND(Setup!$C$8=0,AG$4=\"Fri\"),\"N\",IF(AND(Setup!$C$9=0,AG$4=\"Sat\"),\"N\",IF(AND(Setup!$C$10=0,AG$4=\"Sun\"),\"N\",IF(AND(Setup!$C$11=0,AG$3=\"Y\"),\"N\",\"Y\"))))","v":"N"},{"$f":"IF(AND(Setup!$C$8=0,AH$4=\"Fri\"),\"N\",IF(AND(Setup!$C$9=0,AH$4=\"Sat\"),\"N\",IF(AND(Setup!$C$10=0,AH$4=\"Sun\"),\"N\",IF(AND(Setup!$C$11=0,AH$3=\"Y\"),\"N\",\"Y\"))))","v":"Y"},{"$f":"IF(AND(Setup!$C$8=0,AI$4=\"Fri\"),\"N\",IF(AND(Setup!$C$9=0,AI$4=\"Sat\"),\"N\",IF(AND(Setup!$C$10=0,AI$4=\"Sun\"),\"N\",IF(AND(Setup!$C$11=0,AI$3=\"Y\"),\"N\",\"Y\"))))","v":"Y"},{"$f":"IF(AND(Setup!$C$8=0,AJ$4=\"Fri\"),\"N\",IF(AND(Setup!$C$9=0,AJ$4=\"Sat\"),\"N\",IF(AND(Setup!$C$10=0,AJ$4=\"Sun\"),\"N\",IF(AND(Setup!$C$11=0,AJ$3=\"Y\"),\"N\",\"Y\"))))","v":"Y"},{"$f":"IF(AND(Setup!$C$8=0,AK$4=\"Fri\"),\"N\",IF(AND(Setup!$C$9=0,AK$4=\"Sat\"),\"N\",IF(AND(Setup!$C$10=0,AK$4=\"Sun\"),\"N\",IF(AND(Setup!$C$11=0,AK$3=\"Y\"),\"N\",\"Y\"))))","v":"N"},{"$f":"IF(AND(Setup!$C$8=0,AL$4=\"Fri\"),\"N\",IF(AND(Setup!$C$9=0,AL$4=\"Sat\"),\"N\",IF(AND(Setup!$C$10=0,AL$4=\"Sun\"),\"N\",IF(AND(Setup!$C$11=0,AL$3=\"Y\"),\"N\",\"Y\"))))","v":"N"},{"$f":"IF(AND(Setup!$C$8=0,AM$4=\"Fri\"),\"N\",IF(AND(Setup!$C$9=0,AM$4=\"Sat\"),\"N\",IF(AND(Setup!$C$10=0,AM$4=\"Sun\"),\"N\",IF(AND(Setup!$C$11=0,AM$3=\"Y\"),\"N\",\"Y\"))))","v":"Y"},{"$f":"IF(AND(Setup!$C$8=0,AN$4=\"Fri\"),\"N\",IF(AND(Setup!$C$9=0,AN$4=\"Sat\"),\"N\",IF(AND(Setup!$C$10=0,AN$4=\"Sun\"),\"N\",IF(AND(Setup!$C$11=0,AN$3=\"Y\"),\"N\",\"Y\"))))","v":"Y"},{"$f":"IF(AND(Setup!$C$8=0,AO$4=\"Fri\"),\"N\",IF(AND(Setup!$C$9=0,AO$4=\"Sat\"),\"N\",IF(AND(Setup!$C$10=0,AO$4=\"Sun\"),\"N\",IF(AND(Setup!$C$11=0,AO$3=\"Y\"),\"N\",\"Y\"))))","v":"Y"},{"$f":"IF(AND(Setup!$C$8=0,AP$4=\"Fri\"),\"N\",IF(AND(Setup!$C$9=0,AP$4=\"Sat\"),\"N\",IF(AND(Setup!$C$10=0,AP$4=\"Sun\"),\"N\",IF(AND(Setup!$C$11=0,AP$3=\"Y\"),\"N\",\"Y\"))))","v":"Y"},{"$f":"IF(AND(Setup!$C$8=0,AQ$4=\"Fri\"),\"N\",IF(AND(Setup!$C$9=0,AQ$4=\"Sat\"),\"N\",IF(AND(Setup!$C$10=0,AQ$4=\"Sun\"),\"N\",IF(AND(Setup!$C$11=0,AQ$3=\"Y\"),\"N\",\"Y\"))))","v":"Y"},{"$f":"IF(AND(Setup!$C$8=0,AR$4=\"Fri\"),\"N\",IF(AND(Setup!$C$9=0,AR$4=\"Sat\"),\"N\",IF(AND(Setup!$C$10=0,AR$4=\"Sun\"),\"N\",IF(AND(Setup!$C$11=0,AR$3=\"Y\"),\"N\",\"Y\"))))","v":"N"},{"$f":"IF(AND(Setup!$C$8=0,AS$4=\"Fri\"),\"N\",IF(AND(Setup!$C$9=0,AS$4=\"Sat\"),\"N\",IF(AND(Setup!$C$10=0,AS$4=\"Sun\"),\"N\",IF(AND(Setup!$C$11=0,AS$3=\"Y\"),\"N\",\"Y\"))))","v":"N"},{"$f":"IF(AND(Setup!$C$8=0,AT$4=\"Fri\"),\"N\",IF(AND(Setup!$C$9=0,AT$4=\"Sat\"),\"N\",IF(AND(Setup!$C$10=0,AT$4=\"Sun\"),\"N\",IF(AND(Setup!$C$11=0,AT$3=\"Y\"),\"N\",\"Y\"))))","v":"Y"},{"$f":"IF(AND(Setup!$C$8=0,AU$4=\"Fri\"),\"N\",IF(AND(Setup!$C$9=0,AU$4=\"Sat\"),\"N\",IF(AND(Setup!$C$10=0,AU$4=\"Sun\"),\"N\",IF(AND(Setup!$C$11=0,AU$3=\"Y\"),\"N\",\"Y\"))))","v":"Y"},{"$f":"IF(AND(Setup!$C$8=0,AV$4=\"Fri\"),\"N\",IF(AND(Setup!$C$9=0,AV$4=\"Sat\"),\"N\",IF(AND(Setup!$C$10=0,AV$4=\"Sun\"),\"N\",IF(AND(Setup!$C$11=0,AV$3=\"Y\"),\"N\",\"Y\"))))","v":"Y"},{"$f":"IF(AND(Setup!$C$8=0,AW$4=\"Fri\"),\"N\",IF(AND(Setup!$C$9=0,AW$4=\"Sat\"),\"N\",IF(AND(Setup!$C$10=0,AW$4=\"Sun\"),\"N\",IF(AND(Setup!$C$11=0,AW$3=\"Y\"),\"N\",\"Y\"))))","v":"Y"},{"$f":"IF(AND(Setup!$C$8=0,AX$4=\"Fri\"),\"N\",IF(AND(Setup!$C$9=0,AX$4=\"Sat\"),\"N\",IF(AND(Setup!$C$10=0,AX$4=\"Sun\"),\"N\",IF(AND(Setup!$C$11=0,AX$3=\"Y\"),\"N\",\"Y\"))))","v":"Y"},{"$f":"IF(AND(Setup!$C$8=0,AY$4=\"Fri\"),\"N\",IF(AND(Setup!$C$9=0,AY$4=\"Sat\"),\"N\",IF(AND(Setup!$C$10=0,AY$4=\"Sun\"),\"N\",IF(AND(Setup!$C$11=0,AY$3=\"Y\"),\"N\",\"Y\"))))","v":"N"},{"$f":"IF(AND(Setup!$C$8=0,AZ$4=\"Fri\"),\"N\",IF(AND(Setup!$C$9=0,AZ$4=\"Sat\"),\"N\",IF(AND(Setup!$C$10=0,AZ$4=\"Sun\"),\"N\",IF(AND(Setup!$C$11=0,AZ$3=\"Y\"),\"N\",\"Y\"))))","v":"N"},{"$f":"IF(AND(Setup!$C$8=0,BA$4=\"Fri\"),\"N\",IF(AND(Setup!$C$9=0,BA$4=\"Sat\"),\"N\",IF(AND(Setup!$C$10=0,BA$4=\"Sun\"),\"N\",IF(AND(Setup!$C$11=0,BA$3=\"Y\"),\"N\",\"Y\"))))","v":"Y"},{"$f":"IF(AND(Setup!$C$8=0,BB$4=\"Fri\"),\"N\",IF(AND(Setup!$C$9=0,BB$4=\"Sat\"),\"N\",IF(AND(Setup!$C$10=0,BB$4=\"Sun\"),\"N\",IF(AND(Setup!$C$11=0,BB$3=\"Y\"),\"N\",\"Y\"))))","v":"Y"},{"$f":"IF(AND(Setup!$C$8=0,BC$4=\"Fri\"),\"N\",IF(AND(Setup!$C$9=0,BC$4=\"Sat\"),\"N\",IF(AND(Setup!$C$10=0,BC$4=\"Sun\"),\"N\",IF(AND(Setup!$C$11=0,BC$3=\"Y\"),\"N\",\"Y\"))))","v":"Y"},{"$f":"IF(AND(Setup!$C$8=0,BD$4=\"Fri\"),\"N\",IF(AND(Setup!$C$9=0,BD$4=\"Sat\"),\"N\",IF(AND(Setup!$C$10=0,BD$4=\"Sun\"),\"N\",IF(AND(Setup!$C$11=0,BD$3=\"Y\"),\"N\",\"Y\"))))","v":"Y"},{"$f":"IF(AND(Setup!$C$8=0,BE$4=\"Fri\"),\"N\",IF(AND(Setup!$C$9=0,BE$4=\"Sat\"),\"N\",IF(AND(Setup!$C$10=0,BE$4=\"Sun\"),\"N\",IF(AND(Setup!$C$11=0,BE$3=\"Y\"),\"N\",\"Y\"))))","v":"Y"},{"$f":"IF(AND(Setup!$C$8=0,BF$4=\"Fri\"),\"N\",IF(AND(Setup!$C$9=0,BF$4=\"Sat\"),\"N\",IF(AND(Setup!$C$10=0,BF$4=\"Sun\"),\"N\",IF(AND(Setup!$C$11=0,BF$3=\"Y\"),\"N\",\"Y\"))))","v":"N"},{"$f":"IF(AND(Setup!$C$8=0,BG$4=\"Fri\"),\"N\",IF(AND(Setup!$C$9=0,BG$4=\"Sat\"),\"N\",IF(AND(Setup!$C$10=0,BG$4=\"Sun\"),\"N\",IF(AND(Setup!$C$11=0,BG$3=\"Y\"),\"N\",\"Y\"))))","v":"N"},{"$f":"IF(AND(Setup!$C$8=0,BH$4=\"Fri\"),\"N\",IF(AND(Setup!$C$9=0,BH$4=\"Sat\"),\"N\",IF(AND(Setup!$C$10=0,BH$4=\"Sun\"),\"N\",IF(AND(Setup!$C$11=0,BH$3=\"Y\"),\"N\",\"Y\"))))","v":"Y"},{"$f":"IF(AND(Setup!$C$8=0,BI$4=\"Fri\"),\"N\",IF(AND(Setup!$C$9=0,BI$4=\"Sat\"),\"N\",IF(AND(Setup!$C$10=0,BI$4=\"Sun\"),\"N\",IF(AND(Setup!$C$11=0,BI$3=\"Y\"),\"N\",\"Y\"))))","v":"Y"},{"$f":"IF(AND(Setup!$C$8=0,BJ$4=\"Fri\"),\"N\",IF(AND(Setup!$C$9=0,BJ$4=\"Sat\"),\"N\",IF(AND(Setup!$C$10=0,BJ$4=\"Sun\"),\"N\",IF(AND(Setup!$C$11=0,BJ$3=\"Y\"),\"N\",\"Y\"))))","v":"Y"},{"$f":"IF(AND(Setup!$C$8=0,BK$4=\"Fri\"),\"N\",IF(AND(Setup!$C$9=0,BK$4=\"Sat\"),\"N\",IF(AND(Setup!$C$10=0,BK$4=\"Sun\"),\"N\",IF(AND(Setup!$C$11=0,BK$3=\"Y\"),\"N\",\"Y\"))))","v":"Y"}]
["Summary",null,"Number of Employees Present: ",{"$f":"IF(D$1=\"N\",0,$A$5-SUBTOTAL(109,OFFSET(D$6,1,0,EmpCount,1)))","v":11},{"$f":"IF(E$1=\"N\",0,$A$5-SUBTOTAL(109,OFFSET(E$6,1,0,EmpCount,1)))","v":11},{"$f":"IF(F$1=\"N\",0,$A$5-SUBTOTAL(109,OFFSET(F$6,1,0,EmpCount,1)))","v":11},{"$f":"IF(G$1=\"N\",0,$A$5-SUBTOTAL(109,OFFSET(G$6,1,0,EmpCount,1)))","v":11},{"$f":"IF(H$1=\"N\",0,$A$5-SUBTOTAL(109,OFFSET(H$6,1,0,EmpCount,1)))","v":0},{"$f":"IF(I$1=\"N\",0,$A$5-SUBTOTAL(109,OFFSET(I$6,1,0,EmpCount,1)))","v":0},{"$f":"IF(J$1=\"N\",0,$A$5-SUBTOTAL(109,OFFSET(J$6,1,0,EmpCount,1)))","v":0},{"$f":"IF(K$1=\"N\",0,$A$5-SUBTOTAL(109,OFFSET(K$6,1,0,EmpCount,1)))","v":0},{"$f":"IF(L$1=\"N\",0,$A$5-SUBTOTAL(109,OFFSET(L$6,1,0,EmpCount,1)))","v":8},{"$f":"IF(M$1=\"N\",0,$A$5-SUBTOTAL(109,OFFSET(M$6,1,0,EmpCount,1)))","v":8},{"$f":"IF(N$1=\"N\",0,$A$5-SUBTOTAL(109,OFFSET(N$6,1,0,EmpCount,1)))","v":8},{"$f":"IF(O$1=\"N\",0,$A$5-SUBTOTAL(109,OFFSET(O$6,1,0,EmpCount,1)))","v":8},{"$f":"IF(P$1=\"N\",0,$A$5-SUBTOTAL(109,OFFSET(P$6,1,0,EmpCount,1)))","v":0},{"$f":"IF(Q$1=\"N\",0,$A$5-SUBTOTAL(109,OFFSET(Q$6,1,0,EmpCount,1)))","v":0},{"$f":"IF(R$1=\"N\",0,$A$5-SUBTOTAL(109,OFFSET(R$6,1,0,EmpCount,1)))","v":12},{"$f":"IF(S$1=\"N\",0,$A$5-SUBTOTAL(109,OFFSET(S$6,1,0,EmpCount,1)))","v":12},{"$f":"IF(T$1=\"N\",0,$A$5-SUBTOTAL(109,OFFSET(T$6,1,0,EmpCount,1)))","v":12},{"$f":"IF(U$1=\"N\",0,$A$5-SUBTOTAL(109,OFFSET(U$6,1,0,EmpCount,1)))","v":12},{"$f":"IF(V$1=\"N\",0,$A$5-SUBTOTAL(109,OFFSET(V$6,1,0,EmpCount,1)))","v":12},{"$f":"IF(W$1=\"N\",0,$A$5-SUBTOTAL(109,OFFSET(W$6,1,0,EmpCount,1)))","v":0},{"$f":"IF(X$1=\"N\",0,$A$5-SUBTOTAL(109,OFFSET(X$6,1,0,EmpCount,1)))","v":0},{"$f":"IF(Y$1=\"N\",0,$A$5-SUBTOTAL(109,OFFSET(Y$6,1,0,EmpCount,1)))","v":11},{"$f":"IF(Z$1=\"N\",0,$A$5-SUBTOTAL(109,OFFSET(Z$6,1,0,EmpCount,1)))","v":11},{"$f":"IF(AA$1=\"N\",0,$A$5-SUBTOTAL(109,OFFSET(AA$6,1,0,EmpCount,1)))","v":11},{"$f":"IF(AB$1=\"N\",0,$A$5-SUBTOTAL(109,OFFSET(AB$6,1,0,EmpCount,1)))","v":9},{"$f":"IF(AC$1=\"N\",0,$A$5-SUBTOTAL(109,OFFSET(AC$6,1,0,EmpCount,1)))","v":9},{"$f":"IF(AD$1=\"N\",0,$A$5-SUBTOTAL(109,OFFSET(AD$6,1,0,EmpCount,1)))","v":0},{"$f":"IF(AE$1=\"N\",0,$A$5-SUBTOTAL(109,OFFSET(AE$6,1,0,EmpCount,1)))","v":0},{"$f":"IF(AF$1=\"N\",0,$A$5-SUBTOTAL(109,OFFSET(AF$6,1,0,EmpCount,1)))","v":4},{"$f":"IF(AG$1=\"N\",0,$A$5-SUBTOTAL(109,OFFSET(AG$6,1,0,EmpCount,1)))","v":0},{"$f":"IF(AH$1=\"N\",0,$A$5-SUBTOTAL(109,OFFSET(AH$6,1,0,EmpCount,1)))","v":5},{"$f":"IF(AI$1=\"N\",0,$A$5-SUBTOTAL(109,OFFSET(AI$6,1,0,EmpCount,1)))","v":5},{"$f":"IF(AJ$1=\"N\",0,$A$5-SUBTOTAL(109,OFFSET(AJ$6,1,0,EmpCount,1)))","v":5},{"$f":"IF(AK$1=\"N\",0,$A$5-SUBTOTAL(109,OFFSET(AK$6,1,0,EmpCount,1)))","v":0},{"$f":"IF(AL$1=\"N\",0,$A$5-SUBTOTAL(109,OFFSET(AL$6,1,0,EmpCount,1)))","v":0},{"$f":"IF(AM$1=\"N\",0,$A$5-SUBTOTAL(109,OFFSET(AM$6,1,0,EmpCount,1)))","v":12},{"$f":"IF(AN$1=\"N\",0,$A$5-SUBTOTAL(109,OFFSET(AN$6,1,0,EmpCount,1)))","v":12},{"$f":"IF(AO$1=\"N\",0,$A$5-SUBTOTAL(109,OFFSET(AO$6,1,0,EmpCount,1)))","v":12},{"$f":"IF(AP$1=\"N\",0,$A$5-SUBTOTAL(109,OFFSET(AP$6,1,0,EmpCount,1)))","v":12},{"$f":"IF(AQ$1=\"N\",0,$A$5-SUBTOTAL(109,OFFSET(AQ$6,1,0,EmpCount,1)))","v":12},{"$f":"IF(AR$1=\"N\",0,$A$5-SUBTOTAL(109,OFFSET(AR$6,1,0,EmpCount,1)))","v":0},{"$f":"IF(AS$1=\"N\",0,$A$5-SUBTOTAL(109,OFFSET(AS$6,1,0,EmpCount,1)))","v":0},{"$f":"IF(AT$1=\"N\",0,$A$5-SUBTOTAL(109,OFFSET(AT$6,1,0,EmpCount,1)))","v":12},{"$f":"IF(AU$1=\"N\",0,$A$5-SUBTOTAL(109,OFFSET(AU$6,1,0,EmpCount,1)))","v":12},{"$f":"IF(AV$1=\"N\",0,$A$5-SUBTOTAL(109,OFFSET(AV$6,1,0,EmpCount,1)))","v":12},{"$f":"IF(AW$1=\"N\",0,$A$5-SUBTOTAL(109,OFFSET(AW$6,1,0,EmpCount,1)))","v":12},{"$f":"IF(AX$1=\"N\",0,$A$5-SUBTOTAL(109,OFFSET(AX$6,1,0,EmpCount,1)))","v":12},{"$f":"IF(AY$1=\"N\",0,$A$5-SUBTOTAL(109,OFFSET(AY$6,1,0,EmpCount,1)))","v":0},{"$f":"IF(AZ$1=\"N\",0,$A$5-SUBTOTAL(109,OFFSET(AZ$6,1,0,EmpCount,1)))","v":0},{"$f":"IF(BA$1=\"N\",0,$A$5-SUBTOTAL(109,OFFSET(BA$6,1,0,EmpCount,1)))","v":12},{"$f":"IF(BB$1=\"N\",0,$A$5-SUBTOTAL(109,OFFSET(BB$6,1,0,EmpCount,1)))","v":12},{"$f":"IF(BC$1=\"N\",0,$A$5-SUBTOTAL(109,OFFSET(BC$6,1,0,EmpCount,1)))","v":12},{"$f":"IF(BD$1=\"N\",0,$A$5-SUBTOTAL(109,OFFSET(BD$6,1,0,EmpCount,1)))","v":12},{"$f":"IF(BE$1=\"N\",0,$A$5-SUBTOTAL(109,OFFSET(BE$6,1,0,EmpCount,1)))","v":12},{"$f":"IF(BF$1=\"N\",0,$A$5-SUBTOTAL(109,OFFSET(BF$6,1,0,EmpCount,1)))","v":0},{"$f":"IF(BG$1=\"N\",0,$A$5-SUBTOTAL(109,OFFSET(BG$6,1,0,EmpCount,1)))","v":0},{"$f":"IF(BH$1=\"N\",0,$A$5-SUBTOTAL(109,OFFSET(BH$6,1,0,EmpCount,1)))","v":12},{"$f":"IF(BI$1=\"N\",0,$A$5-SUBTOTAL(109,OFFSET(BI$6,1,0,EmpCount,1)))","v":12},{"$f":"IF(BJ$1=\"N\",0,$A$5-SUBTOTAL(109,OFFSET(BJ$6,1,0,EmpCount,1)))","v":12},{"$f":"IF(BK$1=\"N\",0,$A$5-SUBTOTAL(109,OFFSET(BK$6,1,0,EmpCount,1)))","v":12}]
["© www.excel-skills.com",null,"Public Holiday Indicator: ",{"$f":"IF(ISNA(VLOOKUP(D5,PublicRange,1,0)),\"-\",\"Y\")","v":"-"},{"$f":"IF(ISNA(VLOOKUP(E5,PublicRange,1,0)),\"-\",\"Y\")","v":"-"},{"$f":"IF(ISNA(VLOOKUP(F5,PublicRange,1,0)),\"-\",\"Y\")","v":"-"},{"$f":"IF(ISNA(VLOOKUP(G5,PublicRange,1,0)),\"-\",\"Y\")","v":"-"},{"$f":"IF(ISNA(VLOOKUP(H5,PublicRange,1,0)),\"-\",\"Y\")","v":"Y"},{"$f":"IF(ISNA(VLOOKUP(I5,PublicRange,1,0)),\"-\",\"Y\")","v":"-"},{"$f":"IF(ISNA(VLOOKUP(J5,PublicRange,1,0)),\"-\",\"Y\")","v":"-"},{"$f":"IF(ISNA(VLOOKUP(K5,PublicRange,1,0)),\"-\",\"Y\")","v":"Y"},{"$f":"IF(ISNA(VLOOKUP(L5,PublicRange,1,0)),\"-\",\"Y\")","v":"-"},{"$f":"IF(ISNA(VLOOKUP(M5,PublicRange,1,0)),\"-\",\"Y\")","v":"-"},{"$f":"IF(ISNA(VLOOKUP(N5,PublicRange,1,0)),\"-\",\"Y\")","v":"-"},{"$f":"IF(ISNA(VLOOKUP(O5,PublicRange,1,0)),\"-\",\"Y\")","v":"-"},{"$f":"IF(ISNA(VLOOKUP(P5,PublicRange,1,0)),\"-\",\"Y\")","v":"-"},{"$f":"IF(ISNA(VLOOKUP(Q5,PublicRange,1,0)),\"-\",\"Y\")","v":"-"},{"$f":"IF(ISNA(VLOOKUP(R5,PublicRange,1,0)),\"-\",\"Y\")","v":"-"},{"$f":"IF(ISNA(VLOOKUP(S5,PublicRange,1,0)),\"-\",\"Y\")","v":"-"},{"$f":"IF(ISNA(VLOOKUP(T5,PublicRange,1,0)),\"-\",\"Y\")","v":"-"},{"$f":"IF(ISNA(VLOOKUP(U5,PublicRange,1,0)),\"-\",\"Y\")","v":"-"},{"$f":"IF(ISNA(VLOOKUP(V5,PublicRange,1,0)),\"-\",\"Y\")","v":"-"},{"$f":"IF(ISNA(VLOOKUP(W5,PublicRange,1,0)),\"-\",\"Y\")","v":"-"},{"$f":"IF(ISNA(VLOOKUP(X5,PublicRange,1,0)),\"-\",\"Y\")","v":"-"},{"$f":"IF(ISNA(VLOOKUP(Y5,PublicRange,1,0)),\"-\",\"Y\")","v":"-"},{"$f":"IF(ISNA(VLOOKUP(Z5,PublicRange,1,0)),\"-\",\"Y\")","v":"-"},{"$f":"IF(ISNA(VLOOKUP(AA5,PublicRange,1,0)),\"-\",\"Y\")","v":"-"},{"$f":"IF(ISNA(VLOOKUP(AB5,PublicRange,1,0)),\"-\",\"Y\")","v":"-"},{"$f":"IF(ISNA(VLOOKUP(AC5,PublicRange,1,0)),\"-\",\"Y\")","v":"-"},{"$f":"IF(ISNA(VLOOKUP(AD5,PublicRange,1,0)),\"-\",\"Y\")","v":"-"},{"$f":"IF(ISNA(VLOOKUP(AE5,PublicRange,1,0)),\"-\",\"Y\")","v":"-"},{"$f":"IF(ISNA(VLOOKUP(AF5,PublicRange,1,0)),\"-\",\"Y\")","v":"-"},{"$f":"IF(ISNA(VLOOKUP(AG5,PublicRange,1,0)),\"-\",\"Y\")","v":"Y"},{"$f":"IF(ISNA(VLOOKUP(AH5,PublicRange,1,0)),\"-\",\"Y\")","v":"-"},{"$f":"IF(ISNA(VLOOKUP(AI5,PublicRange,1,0)),\"-\",\"Y\")","v":"-"},{"$f":"IF(ISNA(VLOOKUP(AJ5,PublicRange,1,0)),\"-\",\"Y\")","v":"-"},{"$f":"IF(ISNA(VLOOKUP(AK5,PublicRange,1,0)),\"-\",\"Y\")","v":"Y"},{"$f":"IF(ISNA(VLOOKUP(AL5,PublicRange,1,0)),\"-\",\"Y\")","v":"-"},{"$f":"IF(ISNA(VLOOKUP(AM5,PublicRange,1,0)),\"-\",\"Y\")","v":"-"},{"$f":"IF(ISNA(VLOOKUP(AN5,PublicRange,1,0)),\"-\",\"Y\")","v":"-"},{"$f":"IF(ISNA(VLOOKUP(AO5,PublicRange,1,0)),\"-\",\"Y\")","v":"-"},{"$f":"IF(ISNA(VLOOKUP(AP5,PublicRange,1,0)),\"-\",\"Y\")","v":"-"},{"$f":"IF(ISNA(VLOOKUP(AQ5,PublicRange,1,0)),\"-\",\"Y\")","v":"-"},{"$f":"IF(ISNA(VLOOKUP(AR5,PublicRange,1,0)),\"-\",\"Y\")","v":"-"},{"$f":"IF(ISNA(VLOOKUP(AS5,PublicRange,1,0)),\"-\",\"Y\")","v":"-"},{"$f":"IF(ISNA(VLOOKUP(AT5,PublicRange,1,0)),\"-\",\"Y\")","v":"-"},{"$f":"IF(ISNA(VLOOKUP(AU5,PublicRange,1,0)),\"-\",\"Y\")","v":"-"},{"$f":"IF(ISNA(VLOOKUP(AV5,PublicRange,1,0)),\"-\",\"Y\")","v":"-"},{"$f":"IF(ISNA(VLOOKUP(AW5,PublicRange,1,0)),\"-\",\"Y\")","v":"-"},{"$f":"IF(ISNA(VLOOKUP(AX5,PublicRange,1,0)),\"-\",\"Y\")","v":"-"},{"$f":"IF(ISNA(VLOOKUP(AY5,PublicRange,1,0)),\"-\",\"Y\")","v":"-"},{"$f":"IF(ISNA(VLOOKUP(AZ5,PublicRange,1,0)),\"-\",\"Y\")","v":"-"},{"$f":"IF(ISNA(VLOOKUP(BA5,PublicRange,1,0)),\"-\",\"Y\")","v":"-"},{"$f":"IF(ISNA(VLOOKUP(BB5,PublicRange,1,0)),\"-\",\"Y\")","v":"-"},{"$f":"IF(ISNA(VLOOKUP(BC5,PublicRange,1,0)),\"-\",\"Y\")","v":"-"},{"$f":"IF(ISNA(VLOOKUP(BD5,PublicRange,1,0)),\"-\",\"Y\")","v":"-"},{"$f":"IF(ISNA(VLOOKUP(BE5,PublicRange,1,0)),\"-\",\"Y\")","v":"-"},{"$f":"IF(ISNA(VLOOKUP(BF5,PublicRange,1,0)),\"-\",\"Y\")","v":"-"},{"$f":"IF(ISNA(VLOOKUP(BG5,PublicRange,1,0)),\"-\",\"Y\")","v":"-"},{"$f":"IF(ISNA(VLOOKUP(BH5,PublicRange,1,0)),\"-\",\"Y\")","v":"-"},{"$f":"IF(ISNA(VLOOKUP(BI5,PublicRange,1,0)),\"-\",\"Y\")","v":"-"},{"$f":"IF(ISNA(VLOOKUP(BJ5,PublicRange,1,0)),\"-\",\"Y\")","v":"-"},{"$f":"IF(ISNA(VLOOKUP(BK5,PublicRange,1,0)),\"-\",\"Y\")","v":"-"}]
[null,null,"Weekday: ",{"$f":"TEXT(D5,\"ddd\")","v":"Mon"},{"$f":"TEXT(E5,\"ddd\")","v":"Tue"},"Wed","Thu","Fri","Sat","Sun","Mon","Tue","Wed","Thu","Fri","Sat","Sun","Mon","Tue","Wed","Thu","Fri","Sat","Sun","Mon","Tue","Wed","Thu","Fri","Sat","Sun","Mon","Tue","Wed","Thu","Fri","Sat","Sun",{"$f":"TEXT(AM5,\"ddd\")","v":"Mon"},{"$f":"TEXT(AN5,\"ddd\")","v":"Tue"},{"$f":"TEXT(AO5,\"ddd\")","v":"Wed"},{"$f":"TEXT(AP5,\"ddd\")","v":"Thu"},{"$f":"TEXT(AQ5,\"ddd\")","v":"Fri"},{"$f":"TEXT(AR5,\"ddd\")","v":"Sat"},{"$f":"TEXT(AS5,\"ddd\")","v":"Sun"},{"$f":"TEXT(AT5,\"ddd\")","v":"Mon"},{"$f":"TEXT(AU5,\"ddd\")","v":"Tue"},{"$f":"TEXT(AV5,\"ddd\")","v":"Wed"},{"$f":"TEXT(AW5,\"ddd\")","v":"Thu"},{"$f":"TEXT(AX5,\"ddd\")","v":"Fri"},{"$f":"TEXT(AY5,\"ddd\")","v":"Sat"},{"$f":"TEXT(AZ5,\"ddd\")","v":"Sun"},{"$f":"TEXT(BA5,\"ddd\")","v":"Mon"},{"$f":"TEXT(BB5,\"ddd\")","v":"Tue"},{"$f":"TEXT(BC5,\"ddd\")","v":"Wed"},{"$f":"TEXT(BD5,\"ddd\")","v":"Thu"},{"$f":"TEXT(BE5,\"ddd\")","v":"Fri"},{"$f":"TEXT(BF5,\"ddd\")","v":"Sat"},{"$f":"TEXT(BG5,\"ddd\")","v":"Sun"},{"$f":"TEXT(BH5,\"ddd\")","v":"Mon"},{"$f":"TEXT(BI5,\"ddd\")","v":"Tue"},{"$f":"TEXT(BJ5,\"ddd\")","v":"Wed"},"Thu"]
[{"$f":"SUBTOTAL(103,EmpCode)","v":12},null,"Date: ",{"$f":"Setup!$B$5","v":"2021-03-29"},{"$f":"D5+1","v":"2021-03-30"},{"$f":"E5+1","v":"2021-03-31"},"2021-04-01","2021-04-02","2021-04-03","2021-04-04","2021-04-05","2021-04-06","2021-04-07","2021-04-08","2021-04-09","2021-04-10","2021-04-11","2021-04-12","2021-04-13","2021-04-14","2021-04-15","2021-04-16","2021-04-17","2021-04-18","2021-04-19","2021-04-20","2021-04-21","2021-04-22","2021-04-23","2021-04-24","2021-04-25","2021-04-26","2021-04-27","2021-04-28","2021-04-29","2021-04-30","2021-05-01","2021-05-02",{"$f":"AL5+1","v":"2021-05-03"},{"$f":"AM5+1","v":"2021-05-04"},{"$f":"AN5+1","v":"2021-05-05"},{"$f":"AO5+1","v":"2021-05-06"},{"$f":"AP5+1","v":"2021-05-07"},{"$f":"AQ5+1","v":"2021-05-08"},{"$f":"AR5+1","v":"2021-05-09"},{"$f":"AS5+1","v":"2021-05-10"},{"$f":"AT5+1","v":"2021-05-11"},{"$f":"AU5+1","v":"2021-05-12"},{"$f":"AV5+1","v":"2021-05-13"},{"$f":"AW5+1","v":"2021-05-14"},{"$f":"AX5+1","v":"2021-05-15"},{"$f":"AY5+1","v":"2021-05-16"},{"$f":"AZ5+1","v":"2021-05-17"},{"$f":"BA5+1","v":"2021-05-18"},{"$f":"BB5+1","v":"2021-05-19"},{"$f":"BC5+1","v":"2021-05-20"},{"$f":"BD5+1","v":"2021-05-21"},{"$f":"BE5+1","v":"2021-05-22"},{"$f":"BF5+1","v":"2021-05-23"},{"$f":"BG5+1","v":"2021-05-24"},{"$f":"BH5+1","v":"2021-05-25"},{"$f":"BI5+1","v":"2021-05-26"},{"$f":"BJ5+1","v":"2021-05-27"}]
["Employee Code","Employee Name","Department / Role","D1","D2","D3","D4","D5","D6","D7","D8","D9","D10","D11","D12","D13","D14","D15","D16","D17","D18","D19","D20","D21","D22","D23","D24","D25","D26","D27","D28","D29","D30","D31","D32","D33","D34","D35","D36","D37","D38","D39","D40","D41","D42","D43","D44","D45","D46","D47","D48","D49","D50","D51","D52","D53","D54","D55","D56","D57","D58","D59","D60"]
{"$rows_left_out":13}
{"sheet":"Tracking","index":5,"n_rows":20,"n_cols":6,"rows_kept":20,"cut":false,"hidden":true,"merged":[[3,1,3,2]]}
["Leave Tracker"]
["Leave Dates"]
["© www.excel-skills.com"]
[null,"Leave Planner"]
["Employee Code","From Date","To Date","Employee Name","Work Days","Error Code"]
[1001,"2021-03-29","2021-04-01",{"$f":"IF(ISNA(VLOOKUP($A6,Summary[],2,0)),\"add!\",VLOOKUP($A6,Summary[],2,0))","v":"Employee 1"},{"$f":"COUNTIFS(SumDate,\">=\"&$B6,SumDate,\"<=\"&$C6,SumWDay,\"Y\")","v":4},{"$f":"IF($C6<$B6,\"E1\",IF(ISNA(VLOOKUP($A6,EmpCode,1,0)),\"E2\",\"-\"))","v":"-"}]
{"$rows_left_out":14}