{"text_format":"1","workbook":"xlsx","n_sheets":6,"sheets":["Info","Trial","Instructions","Leave","Summary","Monthly"],"not_rendered":{"charts":0,"images":2,"macros":1,"external_links":0,"defined_names":14,"comments":0,"pivot_tables":0},"unopened":[],"bounds":{"document_bytes":16777216,"sheet_cells":100000,"rows_first":2000,"rows_last":500,"rows_between":2000,"halvings":0,"cell_chars":16384,"cell_head_chars":4096},"cells_cut":0,"cells_raw":0,"read":"whole","date_system":"1900"}

{"sheet":"Info","index":0,"n_rows":0,"n_cols":0,"rows_kept":0,"cut":false,"hidden":false,"merged":[]}

{"sheet":"Trial","index":1,"n_rows":0,"n_cols":0,"rows_kept":0,"cut":false,"hidden":true,"merged":[]}

{"sheet":"Instructions","index":2,"n_rows":86,"n_cols":1,"rows_kept":86,"cut":false,"hidden":true,"merged":[]}
["Excel Skills | Sick Leave Template"]
["Instructions"]
["www.excel-skills.com"]
[]
["This template enables users to control the sick leave entitlement of employees and thereby analyse the attendance of employees. The template can be used to calculate remaining sick leave days for any period based on the sick leave entitlement & sick leave cycle duration which is specified by the user. The sick leave that is taken by each employee can simply be recorded and the template automatically calculates the remaining sick days that an employee has left. The template does not need to be rolled forward and automatically adjusts the sick leave cycles based on the review period that is specified."]
[]
["Note: The template can also be used for other leave types like family responsibility or compassionate leave where only the days leave taken needs to be recorded and measured based on a specified entitlement & cycle duration. Refer to our Annual Leave template for annual leave entitlement calculations which also includes the calculation of a provision based on monthly employee remuneration."]
[]
["The template includes the following sheets:"]
["Leave - when an employee takes sick leave, the number of days that is taken should be recorded on this sheet."]
{"$rows_left_out":77}
{"sheet":"Leave","index":3,"n_rows":43,"n_cols":7,"rows_kept":43,"cut":false,"hidden":true,"merged":[]}
["Sick Leave"]
["Leave Records"]
["© www.excel-skills.com"]
["Date of Leave","Form Number","Employee Code","Number of Days","Certificate","Comments","Employee Name"]
["2020-03-01","OB","EMP004",16,null,"Opening Balance - Leave Taken",{"$f":"IF(ISBLANK($C5)=TRUE,\"\",IF(ISNA(VLOOKUP($C5,Employees,COLUMN(Summary!$B$5),0))=TRUE,\"incorrect code\",VLOOKUP($C5,Employees,COLUMN(Summary!$B$5),0)))","v":"B Flower"}]
["2020-03-01","OB","EMP005",12,null,"Opening Balance - Leave Taken",{"$f":"IF(ISBLANK($C6)=TRUE,\"\",IF(ISNA(VLOOKUP($C6,Employees,COLUMN(Summary!$B$5),0))=TRUE,\"incorrect code\",VLOOKUP($C6,Employees,COLUMN(Summary!$B$5),0)))","v":"B Hendry"}]
["2020-03-01","OB","EMP010",2,null,"Opening Balance - Leave Taken",{"$f":"IF(ISBLANK($C7)=TRUE,\"\",IF(ISNA(VLOOKUP($C7,Employees,COLUMN(Summary!$B$5),0))=TRUE,\"incorrect code\",VLOOKUP($C7,Employees,COLUMN(Summary!$B$5),0)))","v":"C Smith"}]
["2020-03-01","OB","EMP013",1,null,"Opening Balance - Leave Taken",{"$f":"IF(ISBLANK($C8)=TRUE,\"\",IF(ISNA(VLOOKUP($C8,Employees,COLUMN(Summary!$B$5),0))=TRUE,\"incorrect code\",VLOOKUP($C8,Employees,COLUMN(Summary!$B$5),0)))","v":"R Rossouw"}]
["2020-03-01","S0001","EMP009",1,"Yes","Stomach pain",{"$f":"IF(ISBLANK($C9)=TRUE,\"\",IF(ISNA(VLOOKUP($C9,Employees,COLUMN(Summary!$B$5),0))=TRUE,\"incorrect code\",VLOOKUP($C9,Employees,COLUMN(Summary!$B$5),0)))","v":"S Thompson"}]
["2020-03-10","S0002","EMP005",2,null,"Hypertension",{"$f":"IF(ISBLANK($C10)=TRUE,\"\",IF(ISNA(VLOOKUP($C10,Employees,COLUMN(Summary!$B$5),0))=TRUE,\"incorrect code\",VLOOKUP($C10,Employees,COLUMN(Summary!$B$5),0)))","v":"B Hendry"}]
{"$rows_left_out":34}
{"sheet":"Summary","index":4,"n_rows":26,"n_cols":9,"rows_kept":26,"cut":false,"hidden":true,"merged":[]}
["Sick Leave",null,null,null,null,null,null,null,"Review Date:"]
["Summary",null,null,"Sick Leave Entitlement",30,null,null,null,"2021-02-28"]
["© www.excel-skills.com",null,null,"Duration of Sick Leave Cycle (months)",36,null,null,null,{"$f":"IF(ISBLANK($I$2),TODAY(),$I$2)","v":44255}]
[null,null,null,"Sick Leave Cycle Type","Fixed",{"$f":"IF($E$4=\"Fixed\",$E$4,\"Rolling\")","v":"Fixed"}]
["Employee Code","Employee Name","Department Code","Date Employed","Cycle Start Date","Cycle End Date","Days Entitlement","Leave Days Taken","Leave Days Remaining"]
["EMP003","M Solomon",1,"2016-03-01",{"$f":"IF($F$4=\"Rolling\",DATE(YEAR($D6),MONTH($D6)+ROUNDUP(MAX(0,((((YEAR($I$3)*12)+MONTH($I$3))-((YEAR($D6)*12)+MONTH($D6)))+1)-$E$3)/12,0)*12,1),DATE(YEAR(D6)+(ROUNDDOWN(MAX(0,((((YEAR($I$3)*12)+MONTH($I$3))-((YEAR($D6)*12)+MONTH($D6)))))/36,0)*3),MONTH(D6),1))","v":"2019-03-01"},{"$f":"DATE(YEAR($E6),MONTH($E6)+$E$3,DAY($E6)-1)","v":"2022-02-28"},{"$f":"$E$2","v":30},{"$f":"-SUMIFS(LeaveDays,LeaveDate,\">=\"&$E6,LeaveDate,\"<=\"&$I$3,LeaveCode,$A6)","v":-2},{"$f":"SUM(G6:H6)","v":28}]
["EMP004","B Flower",2,"2016-07-01","2019-07-01",{"$f":"DATE(YEAR($E7),MONTH($E7)+$E$3,DAY($E7)-1)","v":"2022-06-30"},{"$f":"$E$2","v":30},-23,{"$f":"SUM(G7:H7)","v":7}]
["EMP005","B Hendry",2,"2017-03-01","2020-03-01","2023-02-28",30,-31,-1]
["EMP006","N Oliver",2,"2017-08-19","2020-08-01","2023-07-31",30,-1.5,28.5]
["EMP007","C Patterson",1,"2017-08-19","2020-08-01","2023-07-31",30,0,30]
{"$rows_left_out":17}
{"sheet":"Monthly","index":5,"n_rows":54,"n_cols":14,"rows_kept":54,"cut":false,"hidden":true,"merged":[]}
["Sick Leave"]
[{"$f":"\"Monthly Sick Leave Taken Summary as at \"&TEXT(Summary!$I$2,\"dd mmmm yyyy\")","v":"Monthly Sick Leave Taken Summary as at 28 February 2021"}]
["© www.excel-skills.com",null,{"$f":"SUBTOTAL(109,OFFSET(C4,1,0,MonthCount,1))","v":35},{"$f":"SUBTOTAL(109,OFFSET(D4,1,0,MonthCount,1))","v":1},{"$f":"SUBTOTAL(109,OFFSET(E4,1,0,MonthCount,1))","v":14},{"$f":"SUBTOTAL(109,OFFSET(F4,1,0,MonthCount,1))","v":2},{"$f":"SUBTOTAL(109,OFFSET(G4,1,0,MonthCount,1))","v":10.5},{"$f":"SUBTOTAL(109,OFFSET(H4,1,0,MonthCount,1))","v":4.5},{"$f":"SUBTOTAL(109,OFFSET(I4,1,0,MonthCount,1))","v":6.5},{"$f":"SUBTOTAL(109,OFFSET(J4,1,0,MonthCount,1))","v":12},{"$f":"SUBTOTAL(109,OFFSET(K4,1,0,MonthCount,1))","v":1},{"$f":"SUBTOTAL(109,OFFSET(L4,1,0,MonthCount,1))","v":0},{"$f":"SUBTOTAL(109,OFFSET(M4,1,0,MonthCount,1))","v":5},{"$f":"SUBTOTAL(109,OFFSET(N4,1,0,MonthCount,1))","v":4}]
["Employee Code","Employee Name",{"$f":"DATE(YEAR(D$4),MONTH(D$4),0)","v":"2020-03-31"},"2020-04-30","2020-05-31","2020-06-30","2020-07-31","2020-08-31","2020-09-30","2020-10-31","2020-11-30","2020-12-31",{"$f":"DATE(YEAR(N$4),MONTH(N$4),0)","v":"2021-01-31"},{"$f":"DATE(YEAR(Summary!$I$3),MONTH(Summary!$I$3)+1,0)","v":"2021-02-28"}]
[{"$f":"IF(ISBLANK(OFFSET(Summary!A$5,ROW($B5)-ROW($B$4),0,1,1))=TRUE,\"\",OFFSET(Summary!A$5,ROW($B5)-ROW($B$4),0,1,1))","v":"EMP003"},{"$f":"IF(ISBLANK(OFFSET(Summary!B$5,ROW($B5)-ROW($B$4),0,1,1))=TRUE,\"\",OFFSET(Summary!B$5,ROW($B5)-ROW($B$4),0,1,1))","v":"M Solomon"},{"$f":"IF(LEN($A5)=0,\"\",SUMIFS(LeaveDays,LeaveDate,\">=\"&DATE(YEAR(C$4),MONTH(C$4),1),LeaveDate,\"<=\"&C$4,LeaveCode,$A5))","v":0},{"$f":"IF(LEN($A5)=0,\"\",SUMIFS(LeaveDays,LeaveDate,\">=\"&DATE(YEAR(D$4),MONTH(D$4),1),LeaveDate,\"<=\"&D$4,LeaveCode,$A5))","v":0},{"$f":"IF(LEN($A5)=0,\"\",SUMIFS(LeaveDays,LeaveDate,\">=\"&DATE(YEAR(E$4),MONTH(E$4),1),LeaveDate,\"<=\"&E$4,LeaveCode,$A5))","v":0},{"$f":"IF(LEN($A5)=0,\"\",SUMIFS(LeaveDays,LeaveDate,\">=\"&DATE(YEAR(F$4),MONTH(F$4),1),LeaveDate,\"<=\"&F$4,LeaveCode,$A5))","v":0},{"$f":"IF(LEN($A5)=0,\"\",SUMIFS(LeaveDays,LeaveDate,\">=\"&DATE(YEAR(G$4),MONTH(G$4),1),LeaveDate,\"<=\"&G$4,LeaveCode,$A5))","v":0},{"$f":"IF(LEN($A5)=0,\"\",SUMIFS(LeaveDays,LeaveDate,\">=\"&DATE(YEAR(H$4),MONTH(H$4),1),LeaveDate,\"<=\"&H$4,LeaveCode,$A5))","v":0},{"$f":"IF(LEN($A5)=0,\"\",SUMIFS(LeaveDays,LeaveDate,\">=\"&DATE(YEAR(I$4),MONTH(I$4),1),LeaveDate,\"<=\"&I$4,LeaveCode,$A5))","v":0},{"$f":"IF(LEN($A5)=0,\"\",SUMIFS(LeaveDays,LeaveDate,\">=\"&DATE(YEAR(J$4),MONTH(J$4),1),LeaveDate,\"<=\"&J$4,LeaveCode,$A5))","v":0},{"$f":"IF(LEN($A5)=0,\"\",SUMIFS(LeaveDays,LeaveDate,\">=\"&DATE(YEAR(K$4),MONTH(K$4),1),LeaveDate,\"<=\"&K$4,LeaveCode,$A5))","v":0},{"$f":"IF(LEN($A5)=0,\"\",SUMIFS(LeaveDays,LeaveDate,\">=\"&DATE(YEAR(L$4),MONTH(L$4),1),LeaveDate,\"<=\"&L$4,LeaveCode,$A5))","v":0},{"$f":"IF(LEN($A5)=0,\"\",SUMIFS(LeaveDays,LeaveDate,\">=\"&DATE(YEAR(M$4),MONTH(M$4),1),LeaveDate,\"<=\"&M$4,LeaveCode,$A5))","v":0},{"$f":"IF(LEN($A5)=0,\"\",SUMIFS(LeaveDays,LeaveDate,\">=\"&DATE(YEAR(N$4),MONTH(N$4),1),LeaveDate,\"<=\"&N$4,LeaveCode,$A5))","v":2}]
[{"$f":"IF(ISBLANK(OFFSET(Summary!A$5,ROW($B6)-ROW($B$4),0,1,1))=TRUE,\"\",OFFSET(Summary!A$5,ROW($B6)-ROW($B$4),0,1,1))","v":"EMP004"},{"$f":"IF(ISBLANK(OFFSET(Summary!B$5,ROW($B6)-ROW($B$4),0,1,1))=TRUE,\"\",OFFSET(Summary!B$5,ROW($B6)-ROW($B$4),0,1,1))","v":"B Flower"},{"$f":"IF(LEN($A6)=0,\"\",SUMIFS(LeaveDays,LeaveDate,\">=\"&DATE(YEAR(C$4),MONTH(C$4),1),LeaveDate,\"<=\"&C$4,LeaveCode,$A6))","v":17},{"$f":"IF(LEN($A6)=0,\"\",SUMIFS(LeaveDays,LeaveDate,\">=\"&DATE(YEAR(D$4),MONTH(D$4),1),LeaveDate,\"<=\"&D$4,LeaveCode,$A6))","v":0},{"$f":"IF(LEN($A6)=0,\"\",SUMIFS(LeaveDays,LeaveDate,\">=\"&DATE(YEAR(E$4),MONTH(E$4),1),LeaveDate,\"<=\"&E$4,LeaveCode,$A6))","v":6},{"$f":"IF(LEN($A6)=0,\"\",SUMIFS(LeaveDays,LeaveDate,\">=\"&DATE(YEAR(F$4),MONTH(F$4),1),LeaveDate,\"<=\"&F$4,LeaveCode,$A6))","v":0},{"$f":"IF(LEN($A6)=0,\"\",SUMIFS(LeaveDays,LeaveDate,\">=\"&DATE(YEAR(G$4),MONTH(G$4),1),LeaveDate,\"<=\"&G$4,LeaveCode,$A6))","v":0},{"$f":"IF(LEN($A6)=0,\"\",SUMIFS(LeaveDays,LeaveDate,\">=\"&DATE(YEAR(H$4),MONTH(H$4),1),LeaveDate,\"<=\"&H$4,LeaveCode,$A6))","v":0},{"$f":"IF(LEN($A6)=0,\"\",SUMIFS(LeaveDays,LeaveDate,\">=\"&DATE(YEAR(I$4),MONTH(I$4),1),LeaveDate,\"<=\"&I$4,LeaveCode,$A6))","v":0},{"$f":"IF(LEN($A6)=0,\"\",SUMIFS(LeaveDays,LeaveDate,\">=\"&DATE(YEAR(J$4),MONTH(J$4),1),LeaveDate,\"<=\"&J$4,LeaveCode,$A6))","v":0},{"$f":"IF(LEN($A6)=0,\"\",SUMIFS(LeaveDays,LeaveDate,\">=\"&DATE(YEAR(K$4),MONTH(K$4),1),LeaveDate,\"<=\"&K$4,LeaveCode,$A6))","v":0},{"$f":"IF(LEN($A6)=0,\"\",SUMIFS(LeaveDays,LeaveDate,\">=\"&DATE(YEAR(L$4),MONTH(L$4),1),LeaveDate,\"<=\"&L$4,LeaveCode,$A6))","v":0},{"$f":"IF(LEN($A6)=0,\"\",SUMIFS(LeaveDays,LeaveDate,\">=\"&DATE(YEAR(M$4),MONTH(M$4),1),LeaveDate,\"<=\"&M$4,LeaveCode,$A6))","v":0},{"$f":"IF(LEN($A6)=0,\"\",SUMIFS(LeaveDays,LeaveDate,\">=\"&DATE(YEAR(N$4),MONTH(N$4),1),LeaveDate,\"<=\"&N$4,LeaveCode,$A6))","v":0}]
[{"$f":"IF(ISBLANK(OFFSET(Summary!A$5,ROW($B7)-ROW($B$4),0,1,1))=TRUE,\"\",OFFSET(Summary!A$5,ROW($B7)-ROW($B$4),0,1,1))","v":"EMP005"},{"$f":"IF(ISBLANK(OFFSET(Summary!B$5,ROW($B7)-ROW($B$4),0,1,1))=TRUE,\"\",OFFSET(Summary!B$5,ROW($B7)-ROW($B$4),0,1,1))","v":"B Hendry"},{"$f":"IF(LEN($A7)=0,\"\",SUMIFS(LeaveDays,LeaveDate,\">=\"&DATE(YEAR(C$4),MONTH(C$4),1),LeaveDate,\"<=\"&C$4,LeaveCode,$A7))","v":14},{"$f":"IF(LEN($A7)=0,\"\",SUMIFS(LeaveDays,LeaveDate,\">=\"&DATE(YEAR(D$4),MONTH(D$4),1),LeaveDate,\"<=\"&D$4,LeaveCode,$A7))","v":1},{"$f":"IF(LEN($A7)=0,\"\",SUMIFS(LeaveDays,LeaveDate,\">=\"&DATE(YEAR(E$4),MONTH(E$4),1),LeaveDate,\"<=\"&E$4,LeaveCode,$A7))","v":3},{"$f":"IF(LEN($A7)=0,\"\",SUMIFS(LeaveDays,LeaveDate,\">=\"&DATE(YEAR(F$4),MONTH(F$4),1),LeaveDate,\"<=\"&F$4,LeaveCode,$A7))","v":1},{"$f":"IF(LEN($A7)=0,\"\",SUMIFS(LeaveDays,LeaveDate,\">=\"&DATE(YEAR(G$4),MONTH(G$4),1),LeaveDate,\"<=\"&G$4,LeaveCode,$A7))","v":0},{"$f":"IF(LEN($A7)=0,\"\",SUMIFS(LeaveDays,LeaveDate,\">=\"&DATE(YEAR(H$4),MONTH(H$4),1),LeaveDate,\"<=\"&H$4,LeaveCode,$A7))","v":0},{"$f":"IF(LEN($A7)=0,\"\",SUMIFS(LeaveDays,LeaveDate,\">=\"&DATE(YEAR(I$4),MONTH(I$4),1),LeaveDate,\"<=\"&I$4,LeaveCode,$A7))","v":4},{"$f":"IF(LEN($A7)=0,\"\",SUMIFS(LeaveDays,LeaveDate,\">=\"&DATE(YEAR(J$4),MONTH(J$4),1),LeaveDate,\"<=\"&J$4,LeaveCode,$A7))","v":3},{"$f":"IF(LEN($A7)=0,\"\",SUMIFS(LeaveDays,LeaveDate,\">=\"&DATE(YEAR(K$4),MONTH(K$4),1),LeaveDate,\"<=\"&K$4,LeaveCode,$A7))","v":0},{"$f":"IF(LEN($A7)=0,\"\",SUMIFS(LeaveDays,LeaveDate,\">=\"&DATE(YEAR(L$4),MONTH(L$4),1),LeaveDate,\"<=\"&L$4,LeaveCode,$A7))","v":0},{"$f":"IF(LEN($A7)=0,\"\",SUMIFS(LeaveDays,LeaveDate,\">=\"&DATE(YEAR(M$4),MONTH(M$4),1),LeaveDate,\"<=\"&M$4,LeaveCode,$A7))","v":5},{"$f":"IF(LEN($A7)=0,\"\",SUMIFS(LeaveDays,LeaveDate,\">=\"&DATE(YEAR(N$4),MONTH(N$4),1),LeaveDate,\"<=\"&N$4,LeaveCode,$A7))","v":0}]
[{"$f":"IF(ISBLANK(OFFSET(Summary!A$5,ROW($B8)-ROW($B$4),0,1,1))=TRUE,\"\",OFFSET(Summary!A$5,ROW($B8)-ROW($B$4),0,1,1))","v":"EMP006"},{"$f":"IF(ISBLANK(OFFSET(Summary!B$5,ROW($B8)-ROW($B$4),0,1,1))=TRUE,\"\",OFFSET(Summary!B$5,ROW($B8)-ROW($B$4),0,1,1))","v":"N Oliver"},{"$f":"IF(LEN($A8)=0,\"\",SUMIFS(LeaveDays,LeaveDate,\">=\"&DATE(YEAR(C$4),MONTH(C$4),1),LeaveDate,\"<=\"&C$4,LeaveCode,$A8))","v":0},{"$f":"IF(LEN($A8)=0,\"\",SUMIFS(LeaveDays,LeaveDate,\">=\"&DATE(YEAR(D$4),MONTH(D$4),1),LeaveDate,\"<=\"&D$4,LeaveCode,$A8))","v":0},{"$f":"IF(LEN($A8)=0,\"\",SUMIFS(LeaveDays,LeaveDate,\">=\"&DATE(YEAR(E$4),MONTH(E$4),1),LeaveDate,\"<=\"&E$4,LeaveCode,$A8))","v":0},{"$f":"IF(LEN($A8)=0,\"\",SUMIFS(LeaveDays,LeaveDate,\">=\"&DATE(YEAR(F$4),MONTH(F$4),1),LeaveDate,\"<=\"&F$4,LeaveCode,$A8))","v":0},{"$f":"IF(LEN($A8)=0,\"\",SUMIFS(LeaveDays,LeaveDate,\">=\"&DATE(YEAR(G$4),MONTH(G$4),1),LeaveDate,\"<=\"&G$4,LeaveCode,$A8))","v":0.5},{"$f":"IF(LEN($A8)=0,\"\",SUMIFS(LeaveDays,LeaveDate,\">=\"&DATE(YEAR(H$4),MONTH(H$4),1),LeaveDate,\"<=\"&H$4,LeaveCode,$A8))","v":1.5},{"$f":"IF(LEN($A8)=0,\"\",SUMIFS(LeaveDays,LeaveDate,\">=\"&DATE(YEAR(I$4),MONTH(I$4),1),LeaveDate,\"<=\"&I$4,LeaveCode,$A8))","v":0},{"$f":"IF(LEN($A8)=0,\"\",SUMIFS(LeaveDays,LeaveDate,\">=\"&DATE(YEAR(J$4),MONTH(J$4),1),LeaveDate,\"<=\"&J$4,LeaveCode,$A8))","v":0},{"$f":"IF(LEN($A8)=0,\"\",SUMIFS(LeaveDays,LeaveDate,\">=\"&DATE(YEAR(K$4),MONTH(K$4),1),LeaveDate,\"<=\"&K$4,LeaveCode,$A8))","v":0},{"$f":"IF(LEN($A8)=0,\"\",SUMIFS(LeaveDays,LeaveDate,\">=\"&DATE(YEAR(L$4),MONTH(L$4),1),LeaveDate,\"<=\"&L$4,LeaveCode,$A8))","v":0},{"$f":"IF(LEN($A8)=0,\"\",SUMIFS(LeaveDays,LeaveDate,\">=\"&DATE(YEAR(M$4),MONTH(M$4),1),LeaveDate,\"<=\"&M$4,LeaveCode,$A8))","v":0},{"$f":"IF(LEN($A8)=0,\"\",SUMIFS(LeaveDays,LeaveDate,\">=\"&DATE(YEAR(N$4),MONTH(N$4),1),LeaveDate,\"<=\"&N$4,LeaveCode,$A8))","v":0}]
[{"$f":"IF(ISBLANK(OFFSET(Summary!A$5,ROW($B9)-ROW($B$4),0,1,1))=TRUE,\"\",OFFSET(Summary!A$5,ROW($B9)-ROW($B$4),0,1,1))","v":"EMP007"},{"$f":"IF(ISBLANK(OFFSET(Summary!B$5,ROW($B9)-ROW($B$4),0,1,1))=TRUE,\"\",OFFSET(Summary!B$5,ROW($B9)-ROW($B$4),0,1,1))","v":"C Patterson"},{"$f":"IF(LEN($A9)=0,\"\",SUMIFS(LeaveDays,LeaveDate,\">=\"&DATE(YEAR(C$4),MONTH(C$4),1),LeaveDate,\"<=\"&C$4,LeaveCode,$A9))","v":0},{"$f":"IF(LEN($A9)=0,\"\",SUMIFS(LeaveDays,LeaveDate,\">=\"&DATE(YEAR(D$4),MONTH(D$4),1),LeaveDate,\"<=\"&D$4,LeaveCode,$A9))","v":0},{"$f":"IF(LEN($A9)=0,\"\",SUMIFS(LeaveDays,LeaveDate,\">=\"&DATE(YEAR(E$4),MONTH(E$4),1),LeaveDate,\"<=\"&E$4,LeaveCode,$A9))","v":0},{"$f":"IF(LEN($A9)=0,\"\",SUMIFS(LeaveDays,LeaveDate,\">=\"&DATE(YEAR(F$4),MONTH(F$4),1),LeaveDate,\"<=\"&F$4,LeaveCode,$A9))","v":0},{"$f":"IF(LEN($A9)=0,\"\",SUMIFS(LeaveDays,LeaveDate,\">=\"&DATE(YEAR(G$4),MONTH(G$4),1),LeaveDate,\"<=\"&G$4,LeaveCode,$A9))","v":0},{"$f":"IF(LEN($A9)=0,\"\",SUMIFS(LeaveDays,LeaveDate,\">=\"&DATE(YEAR(H$4),MONTH(H$4),1),LeaveDate,\"<=\"&H$4,LeaveCode,$A9))","v":0},{"$f":"IF(LEN($A9)=0,\"\",SUMIFS(LeaveDays,LeaveDate,\">=\"&DATE(YEAR(I$4),MONTH(I$4),1),LeaveDate,\"<=\"&I$4,LeaveCode,$A9))","v":0},{"$f":"IF(LEN($A9)=0,\"\",SUMIFS(LeaveDays,LeaveDate,\">=\"&DATE(YEAR(J$4),MONTH(J$4),1),LeaveDate,\"<=\"&J$4,LeaveCode,$A9))","v":0},{"$f":"IF(LEN($A9)=0,\"\",SUMIFS(LeaveDays,LeaveDate,\">=\"&DATE(YEAR(K$4),MONTH(K$4),1),LeaveDate,\"<=\"&K$4,LeaveCode,$A9))","v":0},{"$f":"IF(LEN($A9)=0,\"\",SUMIFS(LeaveDays,LeaveDate,\">=\"&DATE(YEAR(L$4),MONTH(L$4),1),LeaveDate,\"<=\"&L$4,LeaveCode,$A9))","v":0},{"$f":"IF(LEN($A9)=0,\"\",SUMIFS(LeaveDays,LeaveDate,\">=\"&DATE(YEAR(M$4),MONTH(M$4),1),LeaveDate,\"<=\"&M$4,LeaveCode,$A9))","v":0},{"$f":"IF(LEN($A9)=0,\"\",SUMIFS(LeaveDays,LeaveDate,\">=\"&DATE(YEAR(N$4),MONTH(N$4),1),LeaveDate,\"<=\"&N$4,LeaveCode,$A9))","v":0}]
[{"$f":"IF(ISBLANK(OFFSET(Summary!A$5,ROW($B10)-ROW($B$4),0,1,1))=TRUE,\"\",OFFSET(Summary!A$5,ROW($B10)-ROW($B$4),0,1,1))","v":"EMP009"},{"$f":"IF(ISBLANK(OFFSET(Summary!B$5,ROW($B10)-ROW($B$4),0,1,1))=TRUE,\"\",OFFSET(Summary!B$5,ROW($B10)-ROW($B$4),0,1,1))","v":"S Thompson"},{"$f":"IF(LEN($A10)=0,\"\",SUMIFS(LeaveDays,LeaveDate,\">=\"&DATE(YEAR(C$4),MONTH(C$4),1),LeaveDate,\"<=\"&C$4,LeaveCode,$A10))","v":1},{"$f":"IF(LEN($A10)=0,\"\",SUMIFS(LeaveDays,LeaveDate,\">=\"&DATE(YEAR(D$4),MONTH(D$4),1),LeaveDate,\"<=\"&D$4,LeaveCode,$A10))","v":0},{"$f":"IF(LEN($A10)=0,\"\",SUMIFS(LeaveDays,LeaveDate,\">=\"&DATE(YEAR(E$4),MONTH(E$4),1),LeaveDate,\"<=\"&E$4,LeaveCode,$A10))","v":0},{"$f":"IF(LEN($A10)=0,\"\",SUMIFS(LeaveDays,LeaveDate,\">=\"&DATE(YEAR(F$4),MONTH(F$4),1),LeaveDate,\"<=\"&F$4,LeaveCode,$A10))","v":0},{"$f":"IF(LEN($A10)=0,\"\",SUMIFS(LeaveDays,LeaveDate,\">=\"&DATE(YEAR(G$4),MONTH(G$4),1),LeaveDate,\"<=\"&G$4,LeaveCode,$A10))","v":1},{"$f":"IF(LEN($A10)=0,\"\",SUMIFS(LeaveDays,LeaveDate,\">=\"&DATE(YEAR(H$4),MONTH(H$4),1),LeaveDate,\"<=\"&H$4,LeaveCode,$A10))","v":0},{"$f":"IF(LEN($A10)=0,\"\",SUMIFS(LeaveDays,LeaveDate,\">=\"&DATE(YEAR(I$4),MONTH(I$4),1),LeaveDate,\"<=\"&I$4,LeaveCode,$A10))","v":1},{"$f":"IF(LEN($A10)=0,\"\",SUMIFS(LeaveDays,LeaveDate,\">=\"&DATE(YEAR(J$4),MONTH(J$4),1),LeaveDate,\"<=\"&J$4,LeaveCode,$A10))","v":0},{"$f":"IF(LEN($A10)=0,\"\",SUMIFS(LeaveDays,LeaveDate,\">=\"&DATE(YEAR(K$4),MONTH(K$4),1),LeaveDate,\"<=\"&K$4,LeaveCode,$A10))","v":0},{"$f":"IF(LEN($A10)=0,\"\",SUMIFS(LeaveDays,LeaveDate,\">=\"&DATE(YEAR(L$4),MONTH(L$4),1),LeaveDate,\"<=\"&L$4,LeaveCode,$A10))","v":0},{"$f":"IF(LEN($A10)=0,\"\",SUMIFS(LeaveDays,LeaveDate,\">=\"&DATE(YEAR(M$4),MONTH(M$4),1),LeaveDate,\"<=\"&M$4,LeaveCode,$A10))","v":0},{"$f":"IF(LEN($A10)=0,\"\",SUMIFS(LeaveDays,LeaveDate,\">=\"&DATE(YEAR(N$4),MONTH(N$4),1),LeaveDate,\"<=\"&N$4,LeaveCode,$A10))","v":0}]
{"$rows_left_out":44}