{"text_format":"1","workbook":"xlsx","n_sheets":6,"sheets":["Info","Trial","Instructions","TransCode","Statement","Summary"],"not_rendered":{"charts":0,"images":2,"macros":1,"external_links":0,"defined_names":12,"comments":0,"pivot_tables":0},"unopened":[],"bounds":{"document_bytes":16777216,"sheet_cells":100000,"rows_first":2000,"rows_last":500,"rows_between":2000,"halvings":0,"cell_chars":16384,"cell_head_chars":4096},"cells_cut":0,"cells_raw":0,"read":"whole","date_system":"1900"}

{"sheet":"Info","index":0,"n_rows":0,"n_cols":0,"rows_kept":0,"cut":false,"hidden":false,"merged":[]}

{"sheet":"Trial","index":1,"n_rows":0,"n_cols":0,"rows_kept":0,"cut":false,"hidden":true,"merged":[]}

{"sheet":"Instructions","index":2,"n_rows":126,"n_cols":1,"rows_kept":126,"cut":false,"hidden":true,"merged":[]}
["Excel Skills | Fixed Term Deposits Template"]
["Instructions"]
["www.excel-skills.com"]
[]
["This template enables users to compile an investment account statement for any fixed term deposit. The investment account statement includes interest calculations that are based on daily investment account balances and capitalized to the investment account on any user defined date. The template provides for multiple investments of funds, withdrawal of funds, interest payments, bank charges, interest rate changes and investment accounts can be compiled for any investment period."]
[]
["The main purpose of this template is to compile investment accounts and calculate interest based on the same calculation methodology that is applied by most financial institutions. This template can be used to recalculate the amounts on account statements received from financial institutions and can also be used to compile account statements for informal investments."]
[]
["Important: If you use this template to compile investment account statements for your clients, the investment account statement and summary should be converted to a PDF format before being e-mailed to clients. You are not allowed to send the template in its current file format (Excel file) to your clients because this would fall outside the scope of a single user license and result in a copyright infringement."]
[]
["Worksheet Summary"]
[]
["The main purpose of each worksheet is as follows:"]
[]
["TransCode - includes the default transaction types that need to be selected when entering investment account transactions. Additional transaction types can also be added to the default list of transactions codes."]
["Statement - all investment account transactions should be recorded on this sheet. All the interest and investment account balance calculations in this template are based on the transactions that are recorded on this sheet. Note that the Statement sheet includes 10 columns but only four of these columns require user input (the columns with the yellow column headings). "]
["Summary - includes a monthly summary of investment account transactions that is calculated from the Statement sheet. No user input is required on this sheet."]
[]
["Note: The template includes a lot of complex formulas and has been designed within a specific worksheet structure. We therefore do not recommend adding additional rows or columns within the existing worksheet framework because it may result in errors or inaccurate calculations being encountered. If you therefore want to add your own calculations to the template, we recommend inserting a new worksheet for this purpose."]
[]
{"$rows_left_out":107}
{"sheet":"TransCode","index":3,"n_rows":9,"n_cols":2,"rows_kept":9,"cut":false,"hidden":true,"merged":[]}
["Transaction Codes"]
[]
["Code","Transaction Type"]
[1,"Investment of Funds"]
[2,"Withdrawal of Funds"]
[3,"Bank Charges"]
[4,"Interest Capitalized"]
[5,"Interest Rate Change"]
[6,"Interest Paid"]

{"sheet":"Statement","index":4,"n_rows":49,"n_cols":10,"rows_kept":49,"cut":false,"hidden":true,"merged":[]}
["Investment Account Statement"]
["© www.excel-skills.com"]
["Date","Code","Transaction Description","New Interest Rate","Transaction Amount","Capitalized Interest","Account Balance","Interest \nRate","Interest \nDays","Accrued Interest"]
[43556,5,{"$f":"IF(ISNA(VLOOKUP($B4,Transactions,2,0))=TRUE,\"Select Valid Code\",VLOOKUP($B4,Transactions,2,0))","v":"Interest Rate Change"},7.0000000000000007E-2,0,{"$f":"IF(B4<>4,0,SUM(OFFSET($J$3,1,0,ROW(J4)-ROW($J$3),1))-SUM(OFFSET($F$3,1,0,ROW(G4)-ROW($G$3)-1,1)))","v":0},{"$f":"IF(ISNUMBER(OFFSET(A4,-1,COLUMN($G$3)-1,1,1))=FALSE,0,IF(B4=5,OFFSET(A4,-1,COLUMN($G$3)-1,1,1),IF(B4=4,F4+OFFSET(A4,-1,COLUMN($G$3)-1,1,1),E4+OFFSET(A4,-1,COLUMN($G$3)-1,1,1))))","v":0},{"$f":"IF(B4=5,D4,SUM(OFFSET(A4,-1,COLUMN($H$3)-1,1,1)))","v":7.0000000000000007E-2},{"$f":"IF(ISNUMBER(OFFSET(A4,-1,0,1,1))=FALSE,0,IF(B4=4,IF(OFFSET(A4,-1,1,1,1)=4,A4-OFFSET(A4,-1,0,1,1),A4-(OFFSET(A4,-1,0,1,1)-1)),IF(OFFSET(A4,-1,1,1,1)=4,(A4-1)-OFFSET(A4,-1,0,1,1),(A4-1)-(OFFSET(A4,-1,0,1,1)-1))))","v":0},{"$f":"IF(ISNUMBER(OFFSET(H4,-1,0,1,1))=FALSE,0,OFFSET(G4,-1,0,1,1)*I4/365*OFFSET(H4,-1,0,1,1))","v":0}]
[43556,1,"Investment of Funds",0,250000,0,{"$f":"IF(ISNUMBER(OFFSET(A5,-1,COLUMN($G$3)-1,1,1))=FALSE,0,IF(B5=5,OFFSET(A5,-1,COLUMN($G$3)-1,1,1),IF(B5=4,F5+OFFSET(A5,-1,COLUMN($G$3)-1,1,1),E5+OFFSET(A5,-1,COLUMN($G$3)-1,1,1))))","v":250000},7.0000000000000007E-2,{"$f":"IF(ISNUMBER(OFFSET(A5,-1,0,1,1))=FALSE,0,IF(B5=4,IF(OFFSET(A5,-1,1,1,1)=4,A5-OFFSET(A5,-1,0,1,1),A5-(OFFSET(A5,-1,0,1,1)-1)),IF(OFFSET(A5,-1,1,1,1)=4,(A5-1)-OFFSET(A5,-1,0,1,1),(A5-1)-(OFFSET(A5,-1,0,1,1)-1))))","v":0},{"$f":"IF(ISNUMBER(OFFSET(H5,-1,0,1,1))=FALSE,0,OFFSET(G5,-1,0,1,1)*I5/365*OFFSET(H5,-1,0,1,1))","v":0}]
[43580,3,{"$f":"IF(ISNA(VLOOKUP($B6,Transactions,2,0))=TRUE,\"Select Valid Code\",VLOOKUP($B6,Transactions,2,0))","v":"Bank Charges"},0,-70,{"$f":"IF(B6<>4,0,SUM(OFFSET($J$3,1,0,ROW(J6)-ROW($J$3),1))-SUM(OFFSET($F$3,1,0,ROW(G6)-ROW($G$3)-1,1)))","v":0},{"$f":"IF(ISNUMBER(OFFSET(A6,-1,COLUMN($G$3)-1,1,1))=FALSE,0,IF(B6=5,OFFSET(A6,-1,COLUMN($G$3)-1,1,1),IF(B6=4,F6+OFFSET(A6,-1,COLUMN($G$3)-1,1,1),E6+OFFSET(A6,-1,COLUMN($G$3)-1,1,1))))","v":249930},{"$f":"IF(B6=5,D6,SUM(OFFSET(A6,-1,COLUMN($H$3)-1,1,1)))","v":7.0000000000000007E-2},{"$f":"IF(ISNUMBER(OFFSET(A6,-1,0,1,1))=FALSE,0,IF(B6=4,IF(OFFSET(A6,-1,1,1,1)=4,A6-OFFSET(A6,-1,0,1,1),A6-(OFFSET(A6,-1,0,1,1)-1)),IF(OFFSET(A6,-1,1,1,1)=4,(A6-1)-OFFSET(A6,-1,0,1,1),(A6-1)-(OFFSET(A6,-1,0,1,1)-1))))","v":24},{"$f":"IF(ISNUMBER(OFFSET(H6,-1,0,1,1))=FALSE,0,OFFSET(G6,-1,0,1,1)*I6/365*OFFSET(H6,-1,0,1,1))","v":1150.6849315068494}]
[43582,4,"Interest Capitalized",0,0,1294.4802739726028,251224.48027397261,7.0000000000000007E-2,3,143.79534246575344]
[43610,3,"Bank Charges",0,-70,{"$f":"IF(B8<>4,0,SUM(OFFSET($J$3,1,0,ROW(J8)-ROW($J$3),1))-SUM(OFFSET($F$3,1,0,ROW(G8)-ROW($G$3)-1,1)))","v":0},{"$f":"IF(ISNUMBER(OFFSET(A8,-1,COLUMN($G$3)-1,1,1))=FALSE,0,IF(B8=5,OFFSET(A8,-1,COLUMN($G$3)-1,1,1),IF(B8=4,F8+OFFSET(A8,-1,COLUMN($G$3)-1,1,1),E8+OFFSET(A8,-1,COLUMN($G$3)-1,1,1))))","v":251154.48027397261},{"$f":"IF(B8=5,D8,SUM(OFFSET(A8,-1,COLUMN($H$3)-1,1,1)))","v":7.0000000000000007E-2},{"$f":"IF(ISNUMBER(OFFSET(A8,-1,0,1,1))=FALSE,0,IF(B8=4,IF(OFFSET(A8,-1,1,1,1)=4,A8-OFFSET(A8,-1,0,1,1),A8-(OFFSET(A8,-1,0,1,1)-1)),IF(OFFSET(A8,-1,1,1,1)=4,(A8-1)-OFFSET(A8,-1,0,1,1),(A8-1)-(OFFSET(A8,-1,0,1,1)-1))))","v":27},{"$f":"IF(ISNUMBER(OFFSET(H8,-1,0,1,1))=FALSE,0,OFFSET(G8,-1,0,1,1)*I8/365*OFFSET(H8,-1,0,1,1))","v":1300.8610074460501}]
[43612,4,"Interest Capitalized",0,0,1445.3608454118976,252599.84111938451,7.0000000000000007E-2,3,144.49983796584726]
[43641,3,"Bank Charges",0,-70,{"$f":"IF(B10<>4,0,SUM(OFFSET($J$3,1,0,ROW(J10)-ROW($J$3),1))-SUM(OFFSET($F$3,1,0,ROW(G10)-ROW($G$3)-1,1)))","v":0},{"$f":"IF(ISNUMBER(OFFSET(A10,-1,COLUMN($G$3)-1,1,1))=FALSE,0,IF(B10=5,OFFSET(A10,-1,COLUMN($G$3)-1,1,1),IF(B10=4,F10+OFFSET(A10,-1,COLUMN($G$3)-1,1,1),E10+OFFSET(A10,-1,COLUMN($G$3)-1,1,1))))","v":252529.84111938451},{"$f":"IF(B10=5,D10,SUM(OFFSET(A10,-1,COLUMN($H$3)-1,1,1)))","v":7.0000000000000007E-2},{"$f":"IF(ISNUMBER(OFFSET(A10,-1,0,1,1))=FALSE,0,IF(B10=4,IF(OFFSET(A10,-1,1,1,1)=4,A10-OFFSET(A10,-1,0,1,1),A10-(OFFSET(A10,-1,0,1,1)-1)),IF(OFFSET(A10,-1,1,1,1)=4,(A10-1)-OFFSET(A10,-1,0,1,1),(A10-1)-(OFFSET(A10,-1,0,1,1)-1))))","v":28},{"$f":"IF(ISNUMBER(OFFSET(H10,-1,0,1,1))=FALSE,0,OFFSET(G10,-1,0,1,1)*I10/365*OFFSET(H10,-1,0,1,1))","v":1356.4265440931333}]
[43643,4,"Interest Capitalized",0,0,1501.7176855590806,254031.55880494358,7.0000000000000007E-2,3,145.29114146594728]
[43671,3,"Bank Charges",0,-70,{"$f":"IF(B12<>4,0,SUM(OFFSET($J$3,1,0,ROW(J12)-ROW($J$3),1))-SUM(OFFSET($F$3,1,0,ROW(G12)-ROW($G$3)-1,1)))","v":0},{"$f":"IF(ISNUMBER(OFFSET(A12,-1,COLUMN($G$3)-1,1,1))=FALSE,0,IF(B12=5,OFFSET(A12,-1,COLUMN($G$3)-1,1,1),IF(B12=4,F12+OFFSET(A12,-1,COLUMN($G$3)-1,1,1),E12+OFFSET(A12,-1,COLUMN($G$3)-1,1,1))))","v":253961.55880494358},{"$f":"IF(B12=5,D12,SUM(OFFSET(A12,-1,COLUMN($H$3)-1,1,1)))","v":7.0000000000000007E-2},{"$f":"IF(ISNUMBER(OFFSET(A12,-1,0,1,1))=FALSE,0,IF(B12=4,IF(OFFSET(A12,-1,1,1,1)=4,A12-OFFSET(A12,-1,0,1,1),A12-(OFFSET(A12,-1,0,1,1)-1)),IF(OFFSET(A12,-1,1,1,1)=4,(A12-1)-OFFSET(A12,-1,0,1,1),(A12-1)-(OFFSET(A12,-1,0,1,1)-1))))","v":27},{"$f":"IF(ISNUMBER(OFFSET(H12,-1,0,1,1))=FALSE,0,OFFSET(G12,-1,0,1,1)*I12/365*OFFSET(H12,-1,0,1,1))","v":1315.3962907982011}]
[43673,4,"Interest Capitalized",0,0,1461.5111602476209,255423.06996519119,7.0000000000000007E-2,3,146.11486944941961]
[43702,3,"Bank Charges",0,-70,{"$f":"IF(B14<>4,0,SUM(OFFSET($J$3,1,0,ROW(J14)-ROW($J$3),1))-SUM(OFFSET($F$3,1,0,ROW(G14)-ROW($G$3)-1,1)))","v":0},{"$f":"IF(ISNUMBER(OFFSET(A14,-1,COLUMN($G$3)-1,1,1))=FALSE,0,IF(B14=5,OFFSET(A14,-1,COLUMN($G$3)-1,1,1),IF(B14=4,F14+OFFSET(A14,-1,COLUMN($G$3)-1,1,1),E14+OFFSET(A14,-1,COLUMN($G$3)-1,1,1))))","v":255353.06996519119},{"$f":"IF(B14=5,D14,SUM(OFFSET(A14,-1,COLUMN($H$3)-1,1,1)))","v":7.0000000000000007E-2},{"$f":"IF(ISNUMBER(OFFSET(A14,-1,0,1,1))=FALSE,0,IF(B14=4,IF(OFFSET(A14,-1,1,1,1)=4,A14-OFFSET(A14,-1,0,1,1),A14-(OFFSET(A14,-1,0,1,1)-1)),IF(OFFSET(A14,-1,1,1,1)=4,(A14-1)-OFFSET(A14,-1,0,1,1),(A14-1)-(OFFSET(A14,-1,0,1,1)-1))))","v":28},{"$f":"IF(ISNUMBER(OFFSET(H14,-1,0,1,1))=FALSE,0,OFFSET(G14,-1,0,1,1)*I14/365*OFFSET(H14,-1,0,1,1))","v":1371.5868962514376}]
[43704,4,"Interest Capitalized",0,0,1518.5023611629176,256871.5723263541,7.0000000000000007E-2,3,146.91546491147986]
[43733,3,"Bank Charges",0,-70,{"$f":"IF(B16<>4,0,SUM(OFFSET($J$3,1,0,ROW(J16)-ROW($J$3),1))-SUM(OFFSET($F$3,1,0,ROW(G16)-ROW($G$3)-1,1)))","v":0},{"$f":"IF(ISNUMBER(OFFSET(A16,-1,COLUMN($G$3)-1,1,1))=FALSE,0,IF(B16=5,OFFSET(A16,-1,COLUMN($G$3)-1,1,1),IF(B16=4,F16+OFFSET(A16,-1,COLUMN($G$3)-1,1,1),E16+OFFSET(A16,-1,COLUMN($G$3)-1,1,1))))","v":256801.5723263541},{"$f":"IF(B16=5,D16,SUM(OFFSET(A16,-1,COLUMN($H$3)-1,1,1)))","v":7.0000000000000007E-2},{"$f":"IF(ISNUMBER(OFFSET(A16,-1,0,1,1))=FALSE,0,IF(B16=4,IF(OFFSET(A16,-1,1,1,1)=4,A16-OFFSET(A16,-1,0,1,1),A16-(OFFSET(A16,-1,0,1,1)-1)),IF(OFFSET(A16,-1,1,1,1)=4,(A16-1)-OFFSET(A16,-1,0,1,1),(A16-1)-(OFFSET(A16,-1,0,1,1)-1))))","v":28},{"$f":"IF(ISNUMBER(OFFSET(H16,-1,0,1,1))=FALSE,0,OFFSET(G16,-1,0,1,1)*I16/365*OFFSET(H16,-1,0,1,1))","v":1379.3651555059016}]
[43735,4,"Interest Capitalized",0,0,1527.1140053375029,258328.6863316916,7.0000000000000007E-2,3,147.74884983160098]
[43763,3,"Bank Charges",0,-70,{"$f":"IF(B18<>4,0,SUM(OFFSET($J$3,1,0,ROW(J18)-ROW($J$3),1))-SUM(OFFSET($F$3,1,0,ROW(G18)-ROW($G$3)-1,1)))","v":0},{"$f":"IF(ISNUMBER(OFFSET(A18,-1,COLUMN($G$3)-1,1,1))=FALSE,0,IF(B18=5,OFFSET(A18,-1,COLUMN($G$3)-1,1,1),IF(B18=4,F18+OFFSET(A18,-1,COLUMN($G$3)-1,1,1),E18+OFFSET(A18,-1,COLUMN($G$3)-1,1,1))))","v":258258.6863316916},{"$f":"IF(B18=5,D18,SUM(OFFSET(A18,-1,COLUMN($H$3)-1,1,1)))","v":7.0000000000000007E-2},{"$f":"IF(ISNUMBER(OFFSET(A18,-1,0,1,1))=FALSE,0,IF(B18=4,IF(OFFSET(A18,-1,1,1,1)=4,A18-OFFSET(A18,-1,0,1,1),A18-(OFFSET(A18,-1,0,1,1)-1)),IF(OFFSET(A18,-1,1,1,1)=4,(A18-1)-OFFSET(A18,-1,0,1,1),(A18-1)-(OFFSET(A18,-1,0,1,1)-1))))","v":27},{"$f":"IF(ISNUMBER(OFFSET(H18,-1,0,1,1))=FALSE,0,OFFSET(G18,-1,0,1,1)*I18/365*OFFSET(H18,-1,0,1,1))","v":1337.6471703202662}]
[43765,4,"Interest Capitalized",0,0,1486.2343597165818,259744.92069140819,7.0000000000000007E-2,3,148.58718939631572]
[43792,5,{"$f":"IF(ISNA(VLOOKUP($B20,Transactions,2,0))=TRUE,\"Select Valid Code\",VLOOKUP($B20,Transactions,2,0))","v":"Interest Rate Change"},7.2499999999999995E-2,0,{"$f":"IF(B20<>4,0,SUM(OFFSET($J$3,1,0,ROW(J20)-ROW($J$3),1))-SUM(OFFSET($F$3,1,0,ROW(G20)-ROW($G$3)-1,1)))","v":0},{"$f":"IF(ISNUMBER(OFFSET(A20,-1,COLUMN($G$3)-1,1,1))=FALSE,0,IF(B20=5,OFFSET(A20,-1,COLUMN($G$3)-1,1,1),IF(B20=4,F20+OFFSET(A20,-1,COLUMN($G$3)-1,1,1),E20+OFFSET(A20,-1,COLUMN($G$3)-1,1,1))))","v":259744.92069140819},{"$f":"IF(B20=5,D20,SUM(OFFSET(A20,-1,COLUMN($H$3)-1,1,1)))","v":7.2499999999999995E-2},{"$f":"IF(ISNUMBER(OFFSET(A20,-1,0,1,1))=FALSE,0,IF(B20=4,IF(OFFSET(A20,-1,1,1,1)=4,A20-OFFSET(A20,-1,0,1,1),A20-(OFFSET(A20,-1,0,1,1)-1)),IF(OFFSET(A20,-1,1,1,1)=4,(A20-1)-OFFSET(A20,-1,0,1,1),(A20-1)-(OFFSET(A20,-1,0,1,1)-1))))","v":26},{"$f":"IF(ISNUMBER(OFFSET(H20,-1,0,1,1))=FALSE,0,OFFSET(G20,-1,0,1,1)*I20/365*OFFSET(H20,-1,0,1,1))","v":1295.1664538585285}]
{"$rows_left_out":30}
{"sheet":"Summary","index":5,"n_rows":28,"n_cols":9,"rows_kept":28,"cut":false,"hidden":true,"merged":[[2,4,2,5],[3,4,3,5],[4,4,4,5],[2,0,2,1],[3,0,3,1],[4,0,4,1]]}
["Investment Summary"]
["© www.excel-skills.com"]
["Total Investment of Funds",null,{"$f":"SUBTOTAL(109,Summary[[#Data],[Investment of Funds]])","v":250000},null,"Total Interest Capitalized",null,{"$f":"SUBTOTAL(109,Summary[[#Data],[Interest Capitalized]])","v":29980.262802366993}]
["Total Withdrawal of Funds",null,{"$f":"SUBTOTAL(109,Summary[[#Data],[Withdrawal of Funds]])","v":-50000},null,"Total Interest Paid",null,{"$f":"SUBTOTAL(109,Summary[[#Data],[Interest \nPaid]])","v":0}]
["Total Bank Charges",null,{"$f":"SUBTOTAL(109,Summary[[#Data],[Bank    Charges]])","v":-1530},null,"Total Other Costs",null,{"$f":"SUBTOTAL(109,Summary[[#Data],[Other    Charges]])","v":0}]
[]
["Month","Opening Balance","Investment of Funds","Withdrawal of Funds","Bank    Charges","Interest Capitalized","Interest \nPaid","Other    Charges","Closing Balance"]
[{"$f":"IF(ISNUMBER(A7)=FALSE,DATE(YEAR(OFFSET(Statement!$A$3,1,0,1,1)),MONTH(OFFSET(Statement!$A$3,1,0,1,1))+1,0),DATE(YEAR(A7),MONTH(A7)+2,0))","v":"2019-04-30"},{"$f":"IF(ISNUMBER(B7)=FALSE,0,I7)","v":0},{"$f":"SUMPRODUCT((TransDate>=DATE(YEAR($A8),MONTH($A8),1))*(TransDate<=$A8)*(TransCode=1)*(TransAmount))","v":250000},{"$f":"SUMPRODUCT((TransDate>=DATE(YEAR($A8),MONTH($A8),1))*(TransDate<=$A8)*(TransCode=2)*(TransAmount))","v":0},{"$f":"SUMPRODUCT((TransDate>=DATE(YEAR($A8),MONTH($A8),1))*(TransDate<=$A8)*(TransCode=3)*(TransAmount))","v":-70},{"$f":"SUMPRODUCT((TransDate>=DATE(YEAR($A8),MONTH($A8),1))*(TransDate<=$A8)*(TransCode=4)*(TransInt))","v":1294.4802739726028},{"$f":"SUMPRODUCT((TransDate>=DATE(YEAR($A8),MONTH($A8),1))*(TransDate<=$A8)*(TransCode=6)*(TransAmount))","v":0},{"$f":"IF(ROUND(SUMPRODUCT((TransDate>=DATE(YEAR($A8),MONTH($A8),1))*(TransDate<=$A8)*(TransAmount))+SUMPRODUCT((TransDate>=DATE(YEAR($A8),MONTH($A8),1))*(TransDate<=$A8)*(TransInt))-SUM(C8:G8),2)=0,0,SUMPRODUCT((TransDate>=DATE(YEAR($A8),MONTH($A8),1))*(TransDate<=$A8)*(TransAmount))+SUMPRODUCT((TransDate>=DATE(YEAR($A8),MONTH($A8),1))*(TransDate<=$A8)*(TransInt))-SUM(C8:G8))","v":0},{"$f":"SUM(B8:H8)","v":251224.48027397261}]
[{"$f":"IF(ISNUMBER(A8)=FALSE,DATE(YEAR(OFFSET(Statement!$A$3,1,0,1,1)),MONTH(OFFSET(Statement!$A$3,1,0,1,1))+1,0),DATE(YEAR(A8),MONTH(A8)+2,0))","v":"2019-05-31"},251224.48027397261,0,0,-70,1445.3608454118976,0,0,{"$f":"SUM(B9:H9)","v":252599.84111938451}]
[{"$f":"IF(ISNUMBER(A9)=FALSE,DATE(YEAR(OFFSET(Statement!$A$3,1,0,1,1)),MONTH(OFFSET(Statement!$A$3,1,0,1,1))+1,0),DATE(YEAR(A9),MONTH(A9)+2,0))","v":"2019-06-30"},252599.84111938451,0,0,-70,1501.7176855590806,0,0,254031.55880494358]
[{"$f":"IF(ISNUMBER(A10)=FALSE,DATE(YEAR(OFFSET(Statement!$A$3,1,0,1,1)),MONTH(OFFSET(Statement!$A$3,1,0,1,1))+1,0),DATE(YEAR(A10),MONTH(A10)+2,0))","v":"2019-07-31"},254031.55880494358,0,0,-70,1461.5111602476209,0,0,255423.06996519119]
[{"$f":"IF(ISNUMBER(A11)=FALSE,DATE(YEAR(OFFSET(Statement!$A$3,1,0,1,1)),MONTH(OFFSET(Statement!$A$3,1,0,1,1))+1,0),DATE(YEAR(A11),MONTH(A11)+2,0))","v":"2019-08-31"},255423.06996519119,0,0,-70,1518.5023611629176,0,0,256871.5723263541]
[{"$f":"IF(ISNUMBER(A12)=FALSE,DATE(YEAR(OFFSET(Statement!$A$3,1,0,1,1)),MONTH(OFFSET(Statement!$A$3,1,0,1,1))+1,0),DATE(YEAR(A12),MONTH(A12)+2,0))","v":"2019-09-30"},256871.5723263541,0,0,-70,1527.1140053375029,0,0,258328.6863316916]
[{"$f":"IF(ISNUMBER(A13)=FALSE,DATE(YEAR(OFFSET(Statement!$A$3,1,0,1,1)),MONTH(OFFSET(Statement!$A$3,1,0,1,1))+1,0),DATE(YEAR(A13),MONTH(A13)+2,0))","v":"2019-10-31"},258328.6863316916,0,0,-70,1486.2343597165818,0,0,259744.92069140819]
[{"$f":"IF(ISNUMBER(A14)=FALSE,DATE(YEAR(OFFSET(Statement!$A$3,1,0,1,1)),MONTH(OFFSET(Statement!$A$3,1,0,1,1))+1,0),DATE(YEAR(A14),MONTH(A14)+2,0))","v":"2019-11-30"},259744.92069140819,0,0,-70,1553.0905874219134,0,0,261228.01127883009]
[{"$f":"IF(ISNUMBER(A15)=FALSE,DATE(YEAR(OFFSET(Statement!$A$3,1,0,1,1)),MONTH(OFFSET(Statement!$A$3,1,0,1,1))+1,0),DATE(YEAR(A15),MONTH(A15)+2,0))","v":"2019-12-31"},261228.01127883009,0,0,-70,1556.5909576204249,0,0,262714.60223645053]
[{"$f":"IF(ISNUMBER(A16)=FALSE,DATE(YEAR(OFFSET(Statement!$A$3,1,0,1,1)),MONTH(OFFSET(Statement!$A$3,1,0,1,1))+1,0),DATE(YEAR(A16),MONTH(A16)+2,0))","v":"2020-01-31"},262714.60223645053,0,0,-75,1617.6294685655412,0,0,264257.23170501605]
[{"$f":"IF(ISNUMBER(A17)=FALSE,DATE(YEAR(OFFSET(Statement!$A$3,1,0,1,1)),MONTH(OFFSET(Statement!$A$3,1,0,1,1))+1,0),DATE(YEAR(A17),MONTH(A17)+2,0))","v":"2020-02-29"},264257.23170501605,0,0,-75,1627.1282623480092,0,0,265809.35996736406]
[{"$f":"IF(ISNUMBER(A18)=FALSE,DATE(YEAR(OFFSET(Statement!$A$3,1,0,1,1)),MONTH(OFFSET(Statement!$A$3,1,0,1,1))+1,0),DATE(YEAR(A18),MONTH(A18)+2,0))","v":"2020-03-31"},265809.35996736406,0,-50000,-75,1262.9393611818668,0,0,216997.29932854592]
[{"$f":"IF(ISNUMBER(A19)=FALSE,DATE(YEAR(OFFSET(Statement!$A$3,1,0,1,1)),MONTH(OFFSET(Statement!$A$3,1,0,1,1))+1,0),DATE(YEAR(A19),MONTH(A19)+2,0))","v":"2020-04-30"},216997.29932854592,0,0,-75,1336.123610249062,0,0,{"$f":"SUM(B20:H20)","v":218258.42293879497}]
{"$rows_left_out":8}