{"text_format":"1","workbook":"xlsx","n_sheets":6,"sheets":["Info","Trial","Instructions","TaxCalc","Monthly","Values"],"not_rendered":{"charts":0,"images":3,"macros":1,"external_links":0,"defined_names":7,"comments":0,"pivot_tables":0},"unopened":[],"bounds":{"document_bytes":16777216,"sheet_cells":100000,"rows_first":2000,"rows_last":500,"rows_between":2000,"halvings":0,"cell_chars":16384,"cell_head_chars":4096},"cells_cut":0,"cells_raw":0,"read":"whole","date_system":"1900"}

{"sheet":"Info","index":0,"n_rows":0,"n_cols":0,"rows_kept":0,"cut":false,"hidden":false,"merged":[]}

{"sheet":"Trial","index":1,"n_rows":0,"n_cols":0,"rows_kept":0,"cut":false,"hidden":true,"merged":[]}

{"sheet":"Instructions","index":2,"n_rows":108,"n_cols":1,"rows_kept":108,"cut":false,"hidden":true,"merged":[]}
["Excel Skills | Income Tax Calculation Template"]
["Instructions"]
["www.excel-skills.com"]
[]
["This template enables users to perform annual income tax & monthly salary calculations based on multiple tax brackets (also referred to as a sliding income scale) and a number of other income tax & salary calculation variables. The template design incorporates seven default tax brackets but you can add additional tax brackets if your region requires more tax brackets. All the income tax & monthly salary calculations are automated and user input is limited to only a few earnings & deduction amounts."]
[]
["The template includes three sheets:"]
["TaxCalc - this sheet contains the annual income tax, monthly salary and annual bonus calculations. Only the cells with yellow cell backgrounds require user input and all calculations are automated."]
["Monthly - this sheet enables users to perform monthly income tax calculations based on variable monthly earnings and annual bonus amounts. Only the cells with yellow cell backgrounds require user input - all other calculations are automated."]
["Values - all the default values which are used in the income tax & salary calculations need to be specified on this sheet. This includes the income tax rates at the top of the sheet, tax rebate amounts, medical tax credit amounts, unemployment insurance limit and percentage, pension fund tax deduction limits and the travel allowance inclusion percentage. All of these default values need to be updated at the start of a new tax year by entering the new values in the cells with yellow cell backgrounds."]
[]
["Note: This template has been designed for income tax and monthly salary calculation purposes and does not represent a full payroll solution. If you are interested in a payroll solution which includes pay slips and much more comprehensive functionality, please refer to our Monthly Payroll template."]
[]
["How to calculate annual income tax payable"]
[]
["You can calculate your annual income tax payable on the TaxCalc sheet by simply entering values in all the cells with yellow cell backgrounds. The annual income tax payable is then automatically calculated in columns D & E based on the specified user input values and the default tax calculation variable amounts which are included on the Values sheet (including the tax brackets at the top of the sheet)."]
[]
["How to calculate your net monthly salary"]
[]
["The TaxCalc sheet also includes a section for the monthly salary calculations in columns G & H. These calculations are also based on the user input values on this sheet and the default tax brackets and other variable values on the Values sheet. If your monthly salary does not consist of the same earnings and deduction amounts each month, you can use the Monthly sheet to perform your salary calculations."]
{"$rows_left_out":89}
{"sheet":"TaxCalc","index":3,"n_rows":23,"n_cols":8,"rows_kept":23,"cut":false,"hidden":true,"merged":[]}
["Salary & Income Tax Calculator"]
["© www.excel-skills.com"]
["Monthly Salary Amounts",null,null,"Annual Income Tax Calculation",null,null,"Monthly Salary Calculation"]
[]
["Basic Monthly Salary",50000,null,"Taxable Earnings:",null,null,"Earnings:"]
[null,null,null,"Basic Salary",{"$f":"$B$5*12","v":600000},null,"Basic Salary",{"$f":"$B$5","v":50000}]
["Travel Allowance",0,null,{"$f":"\"Travel Allowance (only \"&Values!$B$32*100&\"%)\"","v":"Travel Allowance (only 80%)"},{"$f":"$B$7*12*Values!$B$32","v":0},null,"Travel Allowance",{"$f":"$B$7","v":0}]
[null,null,null,"Other Allowances",{"$f":"$B$9*12","v":0},null,"Other Allowances",{"$f":"$B$9","v":0}]
["Other Allowances",0,null,"Annual Bonus",{"$f":"$B$11","v":50000},null,"Gross Pay",{"$f":"SUM(H6:H8)","v":50000}]
[null,null,null,"Total Taxable Earnings",{"$f":"SUM(E6:E9)","v":650000}]
["Annual Bonus",50000,null,"Less: Taxable Pension",{"$f":"IF($E$10=0,0,IF($B$13*12/$E$10>Values!$B$29,MIN($E$10*Values!$B$29,Values!$B$28),MIN($B$13*12,Values!$B$28)))","v":0},null,"Deductions:"]
[null,null,null,"Taxable Income",{"$f":"E10-E11","v":650000},null,"Income Tax (PAYE)",{"$f":"MAX(0,IF($H$18<Values!$B$6,IF($H$18*Values!$C$6<0,0,$H$18*Values!$C$6),(($H$18-VLOOKUP($H$18,TaxAll,1,1))*OFFSET(Values!$C$6,MATCH($H$18,TaxBracket,1),0,1,1)+OFFSET(Values!$D$5,MATCH($H$18,TaxBracket,1),0,1,1)))-$E$15-$E$16)/12","v":11302.666666666666}]
["Pension Deduction",0,null,null,null,null,"Unemployment Insurance (UIF)",{"$f":"IF(($H$18+$E$11)>Values!$B$25,Values!$B$25*Values!$B$24,($H$18+$E$11)*Values!$B$24)/12","v":177.12}]
[null,null,null,"Total Taxation",{"$f":"IF($E$12<Values!$B$6,IF($E$12*Values!$C$6<0,0,$E$12*Values!$C$6),(($E$12-VLOOKUP($E$12,TaxAll,1,1))*OFFSET(Values!$C$6,MATCH($E$12,TaxBracket,1),0,1,1)+OFFSET(Values!$D$5,MATCH($E$12,TaxBracket,1),0,1,1)))","v":170867},null,"Pension Fund",{"$f":"$B$13","v":0}]
["Medical Dependents",0,null,"Less: Rebate",{"$f":"IF($B$17>=Values!$C$17,Values!$B$17,IF($B$17>=Values!$C$16,Values!$B$16,Values!$B$15))","v":17235},null,"Total Deductions",{"$f":"SUM(H12:H14)","v":11479.786666666667}]
[null,null,null,"Less: Medical Tax Credits",{"$f":"IF($B$15=0,0,IF($B$15<=2,Values!$B$20*$B$15,(($B$15-2)*Values!$B$21)+(2*Values!$B$20)))*12","v":0}]
["Your Age",30,null,"Annual Tax Payable",{"$f":"MAX(E14-E15-E16,0)","v":153632},null,"Net Monthly Pay",{"$f":"SUM(H9,-H15)","v":38520.213333333333}]
[null,null,null,"Income Tax %",{"$f":"IF(E12=0,0,E17/E12)","v":0.23635692307692308},null,"Annual Eqv - Monthly Pay",{"$f":"SUM(E6:E8,-E11)","v":600000}]
[null,null,null,null,null,null,"Annual Bonus Payment"]
[null,null,null,null,null,null,"Annual Bonus",{"$f":"$B$11","v":50000}]
{"$rows_left_out":4}
{"sheet":"Monthly","index":4,"n_rows":16,"n_cols":18,"rows_kept":16,"cut":false,"hidden":true,"merged":[]}
["Salary & Income Tax Calculator",null,null,null,null,"PERIOD START","AGE","MED DEPENDENTS","REBATE","MED TAX CREDIT"]
["Monthly Calculations",null,null,null,null,"2023-03-01",30,0,{"$f":"IF($G$2>=Values!$C$17,Values!$B$17,IF($G$2>=Values!$C$16,Values!$B$16,Values!$B$15))","v":17235},{"$f":"IF($H$2=0,0,IF($H$2<=2,Values!$B$20*$H$2,(($H$2-2)*Values!$B$21)+(2*Values!$B$20)))*12","v":0}]
["© www.excel-skills.com",{"$f":"SUM(B5:B16)","v":600000},{"$f":"SUM(C5:C16)","v":0},0,50000,650000,153632,2125.44,0,155757.43999999997,494242.55999999994]
["Period","Basic Monthly Salary","Travel Allowance","Other Allowances","Annual \nBonus","Gross Pay","Income Tax \n(PAYE)","Unemployment Insurance (UIF)","Pension \nFund","Total \nDeductions","Net Pay","Pay Period","Pension Tax Deduction","Annual Taxable Income","Taxable Income Monthly EQV","Tax Payable Total","Tax Payable Monthly EQV","Tax Payable Annual"]
[{"$f":"IF(ISBLANK($F$2),DATE(YEAR(TODAY()),MONTH(TODAY())+1,0),DATE(YEAR(F2),MONTH(F2)+1,0))","v":"2023-03-31"},50000,0,0,0,{"$f":"SUM(B5:E5)","v":50000},{"$f":"(($Q5/12*$L5)+$R5)-IF(ROW($A5)-ROW($A$4)-1=0,0,SUM(OFFSET($G$4,1,0,ROW($A5)-ROW($A$4)-1,1)))","v":11302.666666666666},{"$f":"IF($N5>Values!$B$25,Values!$B$25*Values!$B$24/12*$L5,($O5*Values!$B$24/12*$L5)+(SUM($E$5:$E5)*Values!$B$24))-IF(ROW($A5)-ROW($A$4)-1=0,0,SUM(OFFSET($H$4,1,0,ROW($A5)-ROW($A$4)-1,1)))","v":177.12},0,{"$f":"SUM(G5:I5)","v":11479.786666666667},{"$f":"SUM(F5,-J5)","v":38520.213333333333},{"$f":"COUNTIF($F$5:$F5,\">0\")","v":1},{"$f":"IF($L5=0,0,IF($N5=0,0,IF(SUM($I$5:$I5)/$L5*12/$N5>Values!$B$29,MIN($N5*Values!$B$29,Values!$B$28),MIN(SUM($I$5:$I5)/$L5*12,Values!$B$28))))","v":0},{"$f":"IF($L5=0,0,((SUM($B$5:$B5)+(SUM($C$5:$C5)*Values!$B$32)+SUM($D$5:$D5))/$L5*12)+SUM($E$5:$E5))","v":600000},{"$f":"IF($L5=0,0,(SUM($B$5:$B5)+(SUM($C$5:$C5)*Values!$B$32)+SUM($D$5:$D5))/$L5*12)","v":600000},{"$f":"MAX(0,IF(($N5-$M5)<Values!$B$6,IF(($N5-$M5)*Values!$C$6<0,0,($N5-$M5)*Values!$C$6),((($N5-$M5)-VLOOKUP(($N5-$M5),TaxAll,1,1))*OFFSET(Values!$C$6,MATCH(($N5-$M5),TaxBracket,1),0,1,1)+OFFSET(Values!$D$5,MATCH(($N5-$M5),TaxBracket,1),0,1,1)))-$I$2-$J$2)","v":135632},{"$f":"MAX(0,IF(($O5-$M5)<Values!$B$6,IF(($O5-$M5)*Values!$C$6<0,0,($O5-$M5)*Values!$C$6),((($O5-$M5)-VLOOKUP(($O5-$M5),TaxAll,1,1))*OFFSET(Values!$C$6,MATCH(($O5-$M5),TaxBracket,1),0,1,1)+OFFSET(Values!$D$5,MATCH(($O5-$M5),TaxBracket,1),0,1,1)))-$I$2-$J$2)","v":135632},{"$f":"P5-Q5","v":0}]
[{"$f":"DATE(YEAR(A5),MONTH(A5)+2,0)","v":"2023-04-30"},50000,0,0,0,{"$f":"SUM(B6:E6)","v":50000},{"$f":"(($Q6/12*$L6)+$R6)-IF(ROW($A6)-ROW($A$4)-1=0,0,SUM(OFFSET($G$4,1,0,ROW($A6)-ROW($A$4)-1,1)))","v":11302.666666666666},{"$f":"IF($N6>Values!$B$25,Values!$B$25*Values!$B$24/12*$L6,($O6*Values!$B$24/12*$L6)+(SUM($E$5:$E6)*Values!$B$24))-IF(ROW($A6)-ROW($A$4)-1=0,0,SUM(OFFSET($H$4,1,0,ROW($A6)-ROW($A$4)-1,1)))","v":177.12},0,{"$f":"SUM(G6:I6)","v":11479.786666666667},{"$f":"SUM(F6,-J6)","v":38520.213333333333},{"$f":"COUNTIF($F$5:$F6,\">0\")","v":2},{"$f":"IF($L6=0,0,IF($N6=0,0,IF(SUM($I$5:$I6)/$L6*12/$N6>Values!$B$29,MIN($N6*Values!$B$29,Values!$B$28),MIN(SUM($I$5:$I6)/$L6*12,Values!$B$28))))","v":0},{"$f":"IF($L6=0,0,((SUM($B$5:$B6)+(SUM($C$5:$C6)*Values!$B$32)+SUM($D$5:$D6))/$L6*12)+SUM($E$5:$E6))","v":600000},{"$f":"IF($L6=0,0,(SUM($B$5:$B6)+(SUM($C$5:$C6)*Values!$B$32)+SUM($D$5:$D6))/$L6*12)","v":600000},{"$f":"MAX(0,IF(($N6-$M6)<Values!$B$6,IF(($N6-$M6)*Values!$C$6<0,0,($N6-$M6)*Values!$C$6),((($N6-$M6)-VLOOKUP(($N6-$M6),TaxAll,1,1))*OFFSET(Values!$C$6,MATCH(($N6-$M6),TaxBracket,1),0,1,1)+OFFSET(Values!$D$5,MATCH(($N6-$M6),TaxBracket,1),0,1,1)))-$I$2-$J$2)","v":135632},{"$f":"MAX(0,IF(($O6-$M6)<Values!$B$6,IF(($O6-$M6)*Values!$C$6<0,0,($O6-$M6)*Values!$C$6),((($O6-$M6)-VLOOKUP(($O6-$M6),TaxAll,1,1))*OFFSET(Values!$C$6,MATCH(($O6-$M6),TaxBracket,1),0,1,1)+OFFSET(Values!$D$5,MATCH(($O6-$M6),TaxBracket,1),0,1,1)))-$I$2-$J$2)","v":135632},{"$f":"P6-Q6","v":0}]
[{"$f":"DATE(YEAR(A6),MONTH(A6)+2,0)","v":"2023-05-31"},50000,0,0,0,50000,11302.666666666668,{"$f":"IF($N7>Values!$B$25,Values!$B$25*Values!$B$24/12*$L7,($O7*Values!$B$24/12*$L7)+(SUM($E$5:$E7)*Values!$B$24))-IF(ROW($A7)-ROW($A$4)-1=0,0,SUM(OFFSET($H$4,1,0,ROW($A7)-ROW($A$4)-1,1)))","v":177.12},0,11479.786666666669,38520.213333333333,{"$f":"COUNTIF($F$5:$F7,\">0\")","v":3},{"$f":"IF($L7=0,0,IF($N7=0,0,IF(SUM($I$5:$I7)/$L7*12/$N7>Values!$B$29,MIN($N7*Values!$B$29,Values!$B$28),MIN(SUM($I$5:$I7)/$L7*12,Values!$B$28))))","v":0},{"$f":"IF($L7=0,0,((SUM($B$5:$B7)+(SUM($C$5:$C7)*Values!$B$32)+SUM($D$5:$D7))/$L7*12)+SUM($E$5:$E7))","v":600000},{"$f":"IF($L7=0,0,(SUM($B$5:$B7)+(SUM($C$5:$C7)*Values!$B$32)+SUM($D$5:$D7))/$L7*12)","v":600000},{"$f":"MAX(0,IF(($N7-$M7)<Values!$B$6,IF(($N7-$M7)*Values!$C$6<0,0,($N7-$M7)*Values!$C$6),((($N7-$M7)-VLOOKUP(($N7-$M7),TaxAll,1,1))*OFFSET(Values!$C$6,MATCH(($N7-$M7),TaxBracket,1),0,1,1)+OFFSET(Values!$D$5,MATCH(($N7-$M7),TaxBracket,1),0,1,1)))-$I$2-$J$2)","v":135632},{"$f":"MAX(0,IF(($O7-$M7)<Values!$B$6,IF(($O7-$M7)*Values!$C$6<0,0,($O7-$M7)*Values!$C$6),((($O7-$M7)-VLOOKUP(($O7-$M7),TaxAll,1,1))*OFFSET(Values!$C$6,MATCH(($O7-$M7),TaxBracket,1),0,1,1)+OFFSET(Values!$D$5,MATCH(($O7-$M7),TaxBracket,1),0,1,1)))-$I$2-$J$2)","v":135632},0]
["2023-06-30",50000,0,0,0,50000,11302.666666666664,{"$f":"IF($N8>Values!$B$25,Values!$B$25*Values!$B$24/12*$L8,($O8*Values!$B$24/12*$L8)+(SUM($E$5:$E8)*Values!$B$24))-IF(ROW($A8)-ROW($A$4)-1=0,0,SUM(OFFSET($H$4,1,0,ROW($A8)-ROW($A$4)-1,1)))","v":177.12},0,11479.786666666665,38520.213333333333,{"$f":"COUNTIF($F$5:$F8,\">0\")","v":4},{"$f":"IF($L8=0,0,IF($N8=0,0,IF(SUM($I$5:$I8)/$L8*12/$N8>Values!$B$29,MIN($N8*Values!$B$29,Values!$B$28),MIN(SUM($I$5:$I8)/$L8*12,Values!$B$28))))","v":0},{"$f":"IF($L8=0,0,((SUM($B$5:$B8)+(SUM($C$5:$C8)*Values!$B$32)+SUM($D$5:$D8))/$L8*12)+SUM($E$5:$E8))","v":600000},{"$f":"IF($L8=0,0,(SUM($B$5:$B8)+(SUM($C$5:$C8)*Values!$B$32)+SUM($D$5:$D8))/$L8*12)","v":600000},{"$f":"MAX(0,IF(($N8-$M8)<Values!$B$6,IF(($N8-$M8)*Values!$C$6<0,0,($N8-$M8)*Values!$C$6),((($N8-$M8)-VLOOKUP(($N8-$M8),TaxAll,1,1))*OFFSET(Values!$C$6,MATCH(($N8-$M8),TaxBracket,1),0,1,1)+OFFSET(Values!$D$5,MATCH(($N8-$M8),TaxBracket,1),0,1,1)))-$I$2-$J$2)","v":135632},{"$f":"MAX(0,IF(($O8-$M8)<Values!$B$6,IF(($O8-$M8)*Values!$C$6<0,0,($O8-$M8)*Values!$C$6),((($O8-$M8)-VLOOKUP(($O8-$M8),TaxAll,1,1))*OFFSET(Values!$C$6,MATCH(($O8-$M8),TaxBracket,1),0,1,1)+OFFSET(Values!$D$5,MATCH(($O8-$M8),TaxBracket,1),0,1,1)))-$I$2-$J$2)","v":135632},0]
["2023-07-31",50000,0,0,0,50000,11302.666666666664,{"$f":"IF($N9>Values!$B$25,Values!$B$25*Values!$B$24/12*$L9,($O9*Values!$B$24/12*$L9)+(SUM($E$5:$E9)*Values!$B$24))-IF(ROW($A9)-ROW($A$4)-1=0,0,SUM(OFFSET($H$4,1,0,ROW($A9)-ROW($A$4)-1,1)))","v":177.12},0,11479.786666666665,38520.213333333333,{"$f":"COUNTIF($F$5:$F9,\">0\")","v":5},{"$f":"IF($L9=0,0,IF($N9=0,0,IF(SUM($I$5:$I9)/$L9*12/$N9>Values!$B$29,MIN($N9*Values!$B$29,Values!$B$28),MIN(SUM($I$5:$I9)/$L9*12,Values!$B$28))))","v":0},{"$f":"IF($L9=0,0,((SUM($B$5:$B9)+(SUM($C$5:$C9)*Values!$B$32)+SUM($D$5:$D9))/$L9*12)+SUM($E$5:$E9))","v":600000},{"$f":"IF($L9=0,0,(SUM($B$5:$B9)+(SUM($C$5:$C9)*Values!$B$32)+SUM($D$5:$D9))/$L9*12)","v":600000},{"$f":"MAX(0,IF(($N9-$M9)<Values!$B$6,IF(($N9-$M9)*Values!$C$6<0,0,($N9-$M9)*Values!$C$6),((($N9-$M9)-VLOOKUP(($N9-$M9),TaxAll,1,1))*OFFSET(Values!$C$6,MATCH(($N9-$M9),TaxBracket,1),0,1,1)+OFFSET(Values!$D$5,MATCH(($N9-$M9),TaxBracket,1),0,1,1)))-$I$2-$J$2)","v":135632},{"$f":"MAX(0,IF(($O9-$M9)<Values!$B$6,IF(($O9-$M9)*Values!$C$6<0,0,($O9-$M9)*Values!$C$6),((($O9-$M9)-VLOOKUP(($O9-$M9),TaxAll,1,1))*OFFSET(Values!$C$6,MATCH(($O9-$M9),TaxBracket,1),0,1,1)+OFFSET(Values!$D$5,MATCH(($O9-$M9),TaxBracket,1),0,1,1)))-$I$2-$J$2)","v":135632},0]
["2023-08-31",50000,0,0,0,50000,11302.666666666672,{"$f":"IF($N10>Values!$B$25,Values!$B$25*Values!$B$24/12*$L10,($O10*Values!$B$24/12*$L10)+(SUM($E$5:$E10)*Values!$B$24))-IF(ROW($A10)-ROW($A$4)-1=0,0,SUM(OFFSET($H$4,1,0,ROW($A10)-ROW($A$4)-1,1)))","v":177.12},0,11479.786666666672,38520.213333333326,{"$f":"COUNTIF($F$5:$F10,\">0\")","v":6},{"$f":"IF($L10=0,0,IF($N10=0,0,IF(SUM($I$5:$I10)/$L10*12/$N10>Values!$B$29,MIN($N10*Values!$B$29,Values!$B$28),MIN(SUM($I$5:$I10)/$L10*12,Values!$B$28))))","v":0},{"$f":"IF($L10=0,0,((SUM($B$5:$B10)+(SUM($C$5:$C10)*Values!$B$32)+SUM($D$5:$D10))/$L10*12)+SUM($E$5:$E10))","v":600000},{"$f":"IF($L10=0,0,(SUM($B$5:$B10)+(SUM($C$5:$C10)*Values!$B$32)+SUM($D$5:$D10))/$L10*12)","v":600000},{"$f":"MAX(0,IF(($N10-$M10)<Values!$B$6,IF(($N10-$M10)*Values!$C$6<0,0,($N10-$M10)*Values!$C$6),((($N10-$M10)-VLOOKUP(($N10-$M10),TaxAll,1,1))*OFFSET(Values!$C$6,MATCH(($N10-$M10),TaxBracket,1),0,1,1)+OFFSET(Values!$D$5,MATCH(($N10-$M10),TaxBracket,1),0,1,1)))-$I$2-$J$2)","v":135632},{"$f":"MAX(0,IF(($O10-$M10)<Values!$B$6,IF(($O10-$M10)*Values!$C$6<0,0,($O10-$M10)*Values!$C$6),((($O10-$M10)-VLOOKUP(($O10-$M10),TaxAll,1,1))*OFFSET(Values!$C$6,MATCH(($O10-$M10),TaxBracket,1),0,1,1)+OFFSET(Values!$D$5,MATCH(($O10-$M10),TaxBracket,1),0,1,1)))-$I$2-$J$2)","v":135632},0]
["2023-09-30",50000,0,0,0,50000,11302.666666666657,{"$f":"IF($N11>Values!$B$25,Values!$B$25*Values!$B$24/12*$L11,($O11*Values!$B$24/12*$L11)+(SUM($E$5:$E11)*Values!$B$24))-IF(ROW($A11)-ROW($A$4)-1=0,0,SUM(OFFSET($H$4,1,0,ROW($A11)-ROW($A$4)-1,1)))","v":177.12000000000012},0,11479.786666666658,38520.21333333334,{"$f":"COUNTIF($F$5:$F11,\">0\")","v":7},{"$f":"IF($L11=0,0,IF($N11=0,0,IF(SUM($I$5:$I11)/$L11*12/$N11>Values!$B$29,MIN($N11*Values!$B$29,Values!$B$28),MIN(SUM($I$5:$I11)/$L11*12,Values!$B$28))))","v":0},{"$f":"IF($L11=0,0,((SUM($B$5:$B11)+(SUM($C$5:$C11)*Values!$B$32)+SUM($D$5:$D11))/$L11*12)+SUM($E$5:$E11))","v":600000},{"$f":"IF($L11=0,0,(SUM($B$5:$B11)+(SUM($C$5:$C11)*Values!$B$32)+SUM($D$5:$D11))/$L11*12)","v":600000},{"$f":"MAX(0,IF(($N11-$M11)<Values!$B$6,IF(($N11-$M11)*Values!$C$6<0,0,($N11-$M11)*Values!$C$6),((($N11-$M11)-VLOOKUP(($N11-$M11),TaxAll,1,1))*OFFSET(Values!$C$6,MATCH(($N11-$M11),TaxBracket,1),0,1,1)+OFFSET(Values!$D$5,MATCH(($N11-$M11),TaxBracket,1),0,1,1)))-$I$2-$J$2)","v":135632},{"$f":"MAX(0,IF(($O11-$M11)<Values!$B$6,IF(($O11-$M11)*Values!$C$6<0,0,($O11-$M11)*Values!$C$6),((($O11-$M11)-VLOOKUP(($O11-$M11),TaxAll,1,1))*OFFSET(Values!$C$6,MATCH(($O11-$M11),TaxBracket,1),0,1,1)+OFFSET(Values!$D$5,MATCH(($O11-$M11),TaxBracket,1),0,1,1)))-$I$2-$J$2)","v":135632},0]
["2023-10-31",50000,0,0,0,50000,11302.666666666672,{"$f":"IF($N12>Values!$B$25,Values!$B$25*Values!$B$24/12*$L12,($O12*Values!$B$24/12*$L12)+(SUM($E$5:$E12)*Values!$B$24))-IF(ROW($A12)-ROW($A$4)-1=0,0,SUM(OFFSET($H$4,1,0,ROW($A12)-ROW($A$4)-1,1)))","v":177.11999999999989},0,11479.78666666667,38520.213333333333,{"$f":"COUNTIF($F$5:$F12,\">0\")","v":8},{"$f":"IF($L12=0,0,IF($N12=0,0,IF(SUM($I$5:$I12)/$L12*12/$N12>Values!$B$29,MIN($N12*Values!$B$29,Values!$B$28),MIN(SUM($I$5:$I12)/$L12*12,Values!$B$28))))","v":0},{"$f":"IF($L12=0,0,((SUM($B$5:$B12)+(SUM($C$5:$C12)*Values!$B$32)+SUM($D$5:$D12))/$L12*12)+SUM($E$5:$E12))","v":600000},{"$f":"IF($L12=0,0,(SUM($B$5:$B12)+(SUM($C$5:$C12)*Values!$B$32)+SUM($D$5:$D12))/$L12*12)","v":600000},{"$f":"MAX(0,IF(($N12-$M12)<Values!$B$6,IF(($N12-$M12)*Values!$C$6<0,0,($N12-$M12)*Values!$C$6),((($N12-$M12)-VLOOKUP(($N12-$M12),TaxAll,1,1))*OFFSET(Values!$C$6,MATCH(($N12-$M12),TaxBracket,1),0,1,1)+OFFSET(Values!$D$5,MATCH(($N12-$M12),TaxBracket,1),0,1,1)))-$I$2-$J$2)","v":135632},{"$f":"MAX(0,IF(($O12-$M12)<Values!$B$6,IF(($O12-$M12)*Values!$C$6<0,0,($O12-$M12)*Values!$C$6),((($O12-$M12)-VLOOKUP(($O12-$M12),TaxAll,1,1))*OFFSET(Values!$C$6,MATCH(($O12-$M12),TaxBracket,1),0,1,1)+OFFSET(Values!$D$5,MATCH(($O12-$M12),TaxBracket,1),0,1,1)))-$I$2-$J$2)","v":135632},0]
["2023-11-30",50000,0,0,0,50000,11302.666666666672,{"$f":"IF($N13>Values!$B$25,Values!$B$25*Values!$B$24/12*$L13,($O13*Values!$B$24/12*$L13)+(SUM($E$5:$E13)*Values!$B$24))-IF(ROW($A13)-ROW($A$4)-1=0,0,SUM(OFFSET($H$4,1,0,ROW($A13)-ROW($A$4)-1,1)))","v":177.11999999999989},0,11479.78666666667,38520.213333333333,{"$f":"COUNTIF($F$5:$F13,\">0\")","v":9},{"$f":"IF($L13=0,0,IF($N13=0,0,IF(SUM($I$5:$I13)/$L13*12/$N13>Values!$B$29,MIN($N13*Values!$B$29,Values!$B$28),MIN(SUM($I$5:$I13)/$L13*12,Values!$B$28))))","v":0},{"$f":"IF($L13=0,0,((SUM($B$5:$B13)+(SUM($C$5:$C13)*Values!$B$32)+SUM($D$5:$D13))/$L13*12)+SUM($E$5:$E13))","v":600000},{"$f":"IF($L13=0,0,(SUM($B$5:$B13)+(SUM($C$5:$C13)*Values!$B$32)+SUM($D$5:$D13))/$L13*12)","v":600000},{"$f":"MAX(0,IF(($N13-$M13)<Values!$B$6,IF(($N13-$M13)*Values!$C$6<0,0,($N13-$M13)*Values!$C$6),((($N13-$M13)-VLOOKUP(($N13-$M13),TaxAll,1,1))*OFFSET(Values!$C$6,MATCH(($N13-$M13),TaxBracket,1),0,1,1)+OFFSET(Values!$D$5,MATCH(($N13-$M13),TaxBracket,1),0,1,1)))-$I$2-$J$2)","v":135632},{"$f":"MAX(0,IF(($O13-$M13)<Values!$B$6,IF(($O13-$M13)*Values!$C$6<0,0,($O13-$M13)*Values!$C$6),((($O13-$M13)-VLOOKUP(($O13-$M13),TaxAll,1,1))*OFFSET(Values!$C$6,MATCH(($O13-$M13),TaxBracket,1),0,1,1)+OFFSET(Values!$D$5,MATCH(($O13-$M13),TaxBracket,1),0,1,1)))-$I$2-$J$2)","v":135632},0]
["2023-12-31",50000,0,0,50000,100000,29302.666666666657,{"$f":"IF($N14>Values!$B$25,Values!$B$25*Values!$B$24/12*$L14,($O14*Values!$B$24/12*$L14)+(SUM($E$5:$E14)*Values!$B$24))-IF(ROW($A14)-ROW($A$4)-1=0,0,SUM(OFFSET($H$4,1,0,ROW($A14)-ROW($A$4)-1,1)))","v":177.12000000000012},0,29479.786666666656,70520.213333333348,{"$f":"COUNTIF($F$5:$F14,\">0\")","v":10},{"$f":"IF($L14=0,0,IF($N14=0,0,IF(SUM($I$5:$I14)/$L14*12/$N14>Values!$B$29,MIN($N14*Values!$B$29,Values!$B$28),MIN(SUM($I$5:$I14)/$L14*12,Values!$B$28))))","v":0},{"$f":"IF($L14=0,0,((SUM($B$5:$B14)+(SUM($C$5:$C14)*Values!$B$32)+SUM($D$5:$D14))/$L14*12)+SUM($E$5:$E14))","v":650000},{"$f":"IF($L14=0,0,(SUM($B$5:$B14)+(SUM($C$5:$C14)*Values!$B$32)+SUM($D$5:$D14))/$L14*12)","v":600000},{"$f":"MAX(0,IF(($N14-$M14)<Values!$B$6,IF(($N14-$M14)*Values!$C$6<0,0,($N14-$M14)*Values!$C$6),((($N14-$M14)-VLOOKUP(($N14-$M14),TaxAll,1,1))*OFFSET(Values!$C$6,MATCH(($N14-$M14),TaxBracket,1),0,1,1)+OFFSET(Values!$D$5,MATCH(($N14-$M14),TaxBracket,1),0,1,1)))-$I$2-$J$2)","v":153632},{"$f":"MAX(0,IF(($O14-$M14)<Values!$B$6,IF(($O14-$M14)*Values!$C$6<0,0,($O14-$M14)*Values!$C$6),((($O14-$M14)-VLOOKUP(($O14-$M14),TaxAll,1,1))*OFFSET(Values!$C$6,MATCH(($O14-$M14),TaxBracket,1),0,1,1)+OFFSET(Values!$D$5,MATCH(($O14-$M14),TaxBracket,1),0,1,1)))-$I$2-$J$2)","v":135632},18000]
["2024-01-31",50000,0,0,0,50000,11302.666666666657,{"$f":"IF($N15>Values!$B$25,Values!$B$25*Values!$B$24/12*$L15,($O15*Values!$B$24/12*$L15)+(SUM($E$5:$E15)*Values!$B$24))-IF(ROW($A15)-ROW($A$4)-1=0,0,SUM(OFFSET($H$4,1,0,ROW($A15)-ROW($A$4)-1,1)))","v":177.12000000000012},0,11479.786666666658,38520.21333333334,{"$f":"COUNTIF($F$5:$F15,\">0\")","v":11},{"$f":"IF($L15=0,0,IF($N15=0,0,IF(SUM($I$5:$I15)/$L15*12/$N15>Values!$B$29,MIN($N15*Values!$B$29,Values!$B$28),MIN(SUM($I$5:$I15)/$L15*12,Values!$B$28))))","v":0},{"$f":"IF($L15=0,0,((SUM($B$5:$B15)+(SUM($C$5:$C15)*Values!$B$32)+SUM($D$5:$D15))/$L15*12)+SUM($E$5:$E15))","v":650000},{"$f":"IF($L15=0,0,(SUM($B$5:$B15)+(SUM($C$5:$C15)*Values!$B$32)+SUM($D$5:$D15))/$L15*12)","v":600000},{"$f":"MAX(0,IF(($N15-$M15)<Values!$B$6,IF(($N15-$M15)*Values!$C$6<0,0,($N15-$M15)*Values!$C$6),((($N15-$M15)-VLOOKUP(($N15-$M15),TaxAll,1,1))*OFFSET(Values!$C$6,MATCH(($N15-$M15),TaxBracket,1),0,1,1)+OFFSET(Values!$D$5,MATCH(($N15-$M15),TaxBracket,1),0,1,1)))-$I$2-$J$2)","v":153632},{"$f":"MAX(0,IF(($O15-$M15)<Values!$B$6,IF(($O15-$M15)*Values!$C$6<0,0,($O15-$M15)*Values!$C$6),((($O15-$M15)-VLOOKUP(($O15-$M15),TaxAll,1,1))*OFFSET(Values!$C$6,MATCH(($O15-$M15),TaxBracket,1),0,1,1)+OFFSET(Values!$D$5,MATCH(($O15-$M15),TaxBracket,1),0,1,1)))-$I$2-$J$2)","v":135632},18000]
["2024-02-29",50000,0,0,0,50000,11302.666666666686,{"$f":"IF($N16>Values!$B$25,Values!$B$25*Values!$B$24/12*$L16,($O16*Values!$B$24/12*$L16)+(SUM($E$5:$E16)*Values!$B$24))-IF(ROW($A16)-ROW($A$4)-1=0,0,SUM(OFFSET($H$4,1,0,ROW($A16)-ROW($A$4)-1,1)))","v":177.11999999999989},0,11479.786666666685,38520.213333333319,{"$f":"COUNTIF($F$5:$F16,\">0\")","v":12},{"$f":"IF($L16=0,0,IF($N16=0,0,IF(SUM($I$5:$I16)/$L16*12/$N16>Values!$B$29,MIN($N16*Values!$B$29,Values!$B$28),MIN(SUM($I$5:$I16)/$L16*12,Values!$B$28))))","v":0},{"$f":"IF($L16=0,0,((SUM($B$5:$B16)+(SUM($C$5:$C16)*Values!$B$32)+SUM($D$5:$D16))/$L16*12)+SUM($E$5:$E16))","v":650000},{"$f":"IF($L16=0,0,(SUM($B$5:$B16)+(SUM($C$5:$C16)*Values!$B$32)+SUM($D$5:$D16))/$L16*12)","v":600000},{"$f":"MAX(0,IF(($N16-$M16)<Values!$B$6,IF(($N16-$M16)*Values!$C$6<0,0,($N16-$M16)*Values!$C$6),((($N16-$M16)-VLOOKUP(($N16-$M16),TaxAll,1,1))*OFFSET(Values!$C$6,MATCH(($N16-$M16),TaxBracket,1),0,1,1)+OFFSET(Values!$D$5,MATCH(($N16-$M16),TaxBracket,1),0,1,1)))-$I$2-$J$2)","v":153632},{"$f":"MAX(0,IF(($O16-$M16)<Values!$B$6,IF(($O16-$M16)*Values!$C$6<0,0,($O16-$M16)*Values!$C$6),((($O16-$M16)-VLOOKUP(($O16-$M16),TaxAll,1,1))*OFFSET(Values!$C$6,MATCH(($O16-$M16),TaxBracket,1),0,1,1)+OFFSET(Values!$D$5,MATCH(($O16-$M16),TaxBracket,1),0,1,1)))-$I$2-$J$2)","v":135632},18000]

{"sheet":"Values","index":5,"n_rows":32,"n_cols":5,"rows_kept":32,"cut":false,"hidden":true,"merged":[]}
["Income Tax Calculator Variables"]
["© www.excel-skills.com"]
["Income Tax Rates"]
[]
["Income Tax Brackets","Tax Bracket Value","Tax \nRate","Equivalent \nValue","Effective \nRate"]
[{"$f":"\"From 0 to \"&FIXED(B6,0,0)","v":"From 0 to 237,100"},237100,0.18,{"$f":"B6*C6","v":42678},{"$f":"IF(B6=0,0,D6/B6)","v":0.18}]
[{"$f":"\"From \"&FIXED(OFFSET($A$5,ROW(B7)-ROW(B$5)-1,1,1,1),0,0)&\" to \"&FIXED(B7,0,0)","v":"From 237,100 to 370,500"},370500,0.26,{"$f":"((B7-OFFSET($B$5,ROW(B7)-ROW(B$5)-1,0,1,1))*C7)+OFFSET($D$5,ROW(B7)-ROW(B$5)-1,0,1,1)","v":77362},0.20880431848852901]
[{"$f":"\"From \"&FIXED(OFFSET($A$5,ROW(B8)-ROW(B$5)-1,1,1,1),0,0)&\" to \"&FIXED(B8,0,0)","v":"From 370,500 to 512,800"},512800,0.31,{"$f":"((B8-OFFSET($B$5,ROW(B8)-ROW(B$5)-1,0,1,1))*C8)+OFFSET($D$5,ROW(B8)-ROW(B$5)-1,0,1,1)","v":121475},0.23688572542901717]
[{"$f":"\"From \"&FIXED(OFFSET($A$5,ROW(B9)-ROW(B$5)-1,1,1,1),0,0)&\" to \"&FIXED(B9,0,0)","v":"From 512,800 to 673,000"},673000,0.36,{"$f":"((B9-OFFSET($B$5,ROW(B9)-ROW(B$5)-1,0,1,1))*C9)+OFFSET($D$5,ROW(B9)-ROW(B$5)-1,0,1,1)","v":179147},0.26619167904903418]
[{"$f":"\"From \"&FIXED(OFFSET($A$5,ROW(B10)-ROW(B$5)-1,1,1,1),0,0)&\" to \"&FIXED(B10,0,0)","v":"From 673,000 to 857,900"},857900,0.39,{"$f":"((B10-OFFSET($B$5,ROW(B10)-ROW(B$5)-1,0,1,1))*C10)+OFFSET($D$5,ROW(B10)-ROW(B$5)-1,0,1,1)","v":251258},0.29287562652989857]
[{"$f":"\"From \"&FIXED(OFFSET($A$5,ROW(B11)-ROW(B$5)-1,1,1,1),0,0)&\" to \"&FIXED(B11,0,0)","v":"From 857,900 to 1,817,000"},1817000,0.41,{"$f":"((B11-OFFSET($B$5,ROW(B11)-ROW(B$5)-1,0,1,1))*C11)+OFFSET($D$5,ROW(B11)-ROW(B$5)-1,0,1,1)","v":644489},0.35469950467804073]
[{"$f":"\"From \"&FIXED(OFFSET($A$5,ROW(B12)-ROW(B$5)-1,1,1,1),0,0)&\" and above\"","v":"From 1,817,000 and above"},null,0.45]
[]
["Rebates","Amount","Min Age"]
["Primary",17235,0]
["Secondary",26679,65]
["Tertiary",29824,75]
[]
["Medical Aid Tax Credits"]
["Tax payer & first dependent",364]
{"$rows_left_out":12}