{"text_format":"1","workbook":"xlsx","n_sheets":7,"sheets":["Info","Trial","Instructions","Sources","Accounts","Transactions","Report"],"not_rendered":{"charts":0,"images":2,"macros":1,"external_links":0,"defined_names":13,"comments":0,"pivot_tables":0},"unopened":[],"bounds":{"document_bytes":16777216,"sheet_cells":100000,"rows_first":2000,"rows_last":500,"rows_between":2000,"halvings":0,"cell_chars":16384,"cell_head_chars":4096},"cells_cut":0,"cells_raw":0,"read":"whole","date_system":"1900"}

{"sheet":"Info","index":0,"n_rows":0,"n_cols":0,"rows_kept":0,"cut":false,"hidden":false,"merged":[]}

{"sheet":"Trial","index":1,"n_rows":0,"n_cols":0,"rows_kept":0,"cut":false,"hidden":true,"merged":[]}

{"sheet":"Instructions","index":2,"n_rows":167,"n_cols":1,"rows_kept":167,"cut":false,"hidden":true,"merged":[]}
["Excel Skills | Personal Finance Template"]
["Instructions"]
["www.excel-skills.com"]
[]
["This template enables users to record their personal income & expenses and to generate a comprehensive personal finance report for any user defined 12 month period. Transactions can be recorded from an unlimited number of transaction sources like bank accounts and credit cards and the functionality that has been included in the template enables users to easily reconcile the reports to bank account or credit card statements. This template is the ideal solution for measuring household income and expenditure."]
[]
["The template consists of the following sheets:"]
["Sources - create a unique source code for each transaction source. This sheet also includes transaction totals that can be calculated by simply entering the appropriate Start Date and End Date. The reporting periods that are included in the 12 month personal finance report is also defined on this sheet by simply entering the appropriate Start Date in cell C2."]
["Accounts - this sheet includes the default accounts list and can be used to edit account descriptions and to add additional accounts to the default accounts list."]
["Transactions - all personal income and expense transactions should be recorded on this sheet and allocated to the appropriate account by selecting an account code from the list box in column G. Transactions can be recorded by entering the data or copying the data from a bank or credit card statement before pasting the data into the appropriate columns. Income should be recorded as positive values and expenses as negative values."]
["Report - this sheet includes a 12 month personal income & expenses report. All the calculations on this sheet are automated and the only user input that is required is to ensure that all the accounts that have been added to the Accounts sheet are included on the report. Reporting periods can be amended by simply changing the Start Date in cell C2 on the Sources sheet."]
[]
["Transaction Sources"]
[]
["As we mentioned before, an unlimited number of bank accounts and credit cards can be included in the template by simply creating a unique transaction source code for each account. The source codes that are created on this sheet are then selected when recording transactions on the Transactions sheet."]
[]
["We recommend using an alphanumeric code when creating the required source codes and to use descriptive codes that make it easy to distinguish between different transaction sources. The template includes four default source codes but additional source codes can be created by simply entering a new source code in the first empty cell below the Excel table - the table will be extended automatically to include the new source code."]
[]
["After entering a new transaction source code, users should also enter a unique description of the source code in column B. All the columns with a light blue column heading contain formulas that are automatically copied when a new row is added to the table. The formulas in these columns calculate the opening balance, total income & receipts, total expenses & payments, total contra transactions and the closing balance for each transaction source based on the date range that is defined by entering the appropriate Start Date and End Date."]
[]
{"$rows_left_out":148}
{"sheet":"Sources","index":3,"n_rows":9,"n_cols":8,"rows_kept":9,"cut":false,"hidden":true,"merged":[[1,3,1,4]]}
["Transaction Sources",null,"Start Date",null,null,null,null,"End Date"]
["Bank and Credit Card Accounts",null,"2020-03-01",{"$f":"IF(ISBLANK(C2)=TRUE,\"Start Date cannot be blank!\",\"\")","v":""}]
["© www.excel-skills.com"]
[null,null,{"$f":"SUBTOTAL(109,Source[[#Data],[Opening Balance]])","v":3771.6000000000004},{"$f":"SUBTOTAL(109,Source[[#Data],[Income & Receipts]])","v":490315},{"$f":"SUBTOTAL(109,Source[[#Data],[Expenses & Payments]])","v":-472385.07000000012},{"$f":"SUBTOTAL(109,Source[[#Data],[Contra Transactions]])","v":0},{"$f":"SUBTOTAL(109,Source[[#Data],[Net Account Movement]])","v":17929.929999999869},{"$f":"SUBTOTAL(109,Source[[#Data],[Closing Balance]])","v":21701.529999999868}]
["Source Code","Description","Opening Balance","Income & Receipts","Expenses & Payments","Contra Transactions","Net Account Movement","Closing Balance"]
["CACC1","FNB Current Account",{"$f":"SUMPRODUCT((TrnSource=$A6)*(PayDate<$C$2)*(TrnAmount))","v":9120.5},{"$f":"IF(ISBLANK($H$2)=TRUE,SUMPRODUCT((PayDate>=$C$2)*(TrnSource=$A6)*(TrnAcc<>999)*(TrnAmount>0)*(TrnAmount)),SUMPRODUCT((PayDate>=$C$2)*(PayDate<=$H$2)*(TrnSource=$A6)*(TrnAcc<>999)*(TrnAmount>0)*(TrnAmount)))","v":490315},{"$f":"IF(ISBLANK($H$2)=TRUE,SUMPRODUCT((PayDate>=$C$2)*(TrnSource=$A6)*(TrnAcc<>999)*(TrnAmount<0)*(TrnAmount)),SUMPRODUCT((PayDate>=$C$2)*(PayDate<=$H$2)*(TrnSource=$A6)*(TrnAcc<>999)*(TrnAmount<0)*(TrnAmount)))","v":-326119.45000000013},{"$f":"IF(ISBLANK($H$2)=TRUE,SUMPRODUCT((PayDate>=$C$2)*(TrnSource=$A6)*(TrnAcc=999)*(TrnAmount)),SUMPRODUCT((PayDate>=$C$2)*(PayDate<=$H$2)*(TrnSource=$A6)*(TrnAcc=999)*(TrnAmount)))","v":-161200},{"$f":"SUM(D6:F6)","v":2995.5499999998719},{"$f":"SUM(C6,G6)","v":12116.049999999872}]
["CACC2","ABSA Cheque Account",{"$f":"SUMPRODUCT((TrnSource=$A7)*(PayDate<$C$2)*(TrnAmount))","v":3897.25},{"$f":"IF(ISBLANK($H$2)=TRUE,SUMPRODUCT((PayDate>=$C$2)*(TrnSource=$A7)*(TrnAcc<>999)*(TrnAmount>0)*(TrnAmount)),SUMPRODUCT((PayDate>=$C$2)*(PayDate<=$H$2)*(TrnSource=$A7)*(TrnAcc<>999)*(TrnAmount>0)*(TrnAmount)))","v":0},{"$f":"IF(ISBLANK($H$2)=TRUE,SUMPRODUCT((PayDate>=$C$2)*(TrnSource=$A7)*(TrnAcc<>999)*(TrnAmount<0)*(TrnAmount)),SUMPRODUCT((PayDate>=$C$2)*(PayDate<=$H$2)*(TrnSource=$A7)*(TrnAcc<>999)*(TrnAmount<0)*(TrnAmount)))","v":-14500},{"$f":"IF(ISBLANK($H$2)=TRUE,SUMPRODUCT((PayDate>=$C$2)*(TrnSource=$A7)*(TrnAcc=999)*(TrnAmount)),SUMPRODUCT((PayDate>=$C$2)*(PayDate<=$H$2)*(TrnSource=$A7)*(TrnAcc=999)*(TrnAmount)))","v":13000},{"$f":"SUM(D7:F7)","v":-1500},{"$f":"SUM(C7,G7)","v":2397.25}]
["AMXCC1","American Express Credit Card",{"$f":"SUMPRODUCT((TrnSource=$A8)*(PayDate<$C$2)*(TrnAmount))","v":-523},{"$f":"IF(ISBLANK($H$2)=TRUE,SUMPRODUCT((PayDate>=$C$2)*(TrnSource=$A8)*(TrnAcc<>999)*(TrnAmount>0)*(TrnAmount)),SUMPRODUCT((PayDate>=$C$2)*(PayDate<=$H$2)*(TrnSource=$A8)*(TrnAcc<>999)*(TrnAmount>0)*(TrnAmount)))","v":0},{"$f":"IF(ISBLANK($H$2)=TRUE,SUMPRODUCT((PayDate>=$C$2)*(TrnSource=$A8)*(TrnAcc<>999)*(TrnAmount<0)*(TrnAmount)),SUMPRODUCT((PayDate>=$C$2)*(PayDate<=$H$2)*(TrnSource=$A8)*(TrnAcc<>999)*(TrnAmount<0)*(TrnAmount)))","v":-111602.58},{"$f":"IF(ISBLANK($H$2)=TRUE,SUMPRODUCT((PayDate>=$C$2)*(TrnSource=$A8)*(TrnAcc=999)*(TrnAmount)),SUMPRODUCT((PayDate>=$C$2)*(PayDate<=$H$2)*(TrnSource=$A8)*(TrnAcc=999)*(TrnAmount)))","v":122400},10797.419999999998,10274.419999999998]
["MASCC2","MasterCard Credit Card",{"$f":"SUMPRODUCT((TrnSource=$A9)*(PayDate<$C$2)*(TrnAmount))","v":-8723.15},{"$f":"IF(ISBLANK($H$2)=TRUE,SUMPRODUCT((PayDate>=$C$2)*(TrnSource=$A9)*(TrnAcc<>999)*(TrnAmount>0)*(TrnAmount)),SUMPRODUCT((PayDate>=$C$2)*(PayDate<=$H$2)*(TrnSource=$A9)*(TrnAcc<>999)*(TrnAmount>0)*(TrnAmount)))","v":0},{"$f":"IF(ISBLANK($H$2)=TRUE,SUMPRODUCT((PayDate>=$C$2)*(TrnSource=$A9)*(TrnAcc<>999)*(TrnAmount<0)*(TrnAmount)),SUMPRODUCT((PayDate>=$C$2)*(PayDate<=$H$2)*(TrnSource=$A9)*(TrnAcc<>999)*(TrnAmount<0)*(TrnAmount)))","v":-20163.04},{"$f":"IF(ISBLANK($H$2)=TRUE,SUMPRODUCT((PayDate>=$C$2)*(TrnSource=$A9)*(TrnAcc=999)*(TrnAmount)),SUMPRODUCT((PayDate>=$C$2)*(PayDate<=$H$2)*(TrnSource=$A9)*(TrnAcc=999)*(TrnAmount)))","v":25800},5636.9599999999991,-3086.1900000000005]

{"sheet":"Accounts","index":4,"n_rows":68,"n_cols":5,"rows_kept":68,"cut":false,"hidden":true,"merged":[[3,3,3,5],[8,4,8,5],[9,4,9,5],[10,4,10,5],[11,4,11,5],[4,4,4,5],[5,4,5,5],[6,4,6,5],[7,4,7,5]]}
["Accounts Set-up"]
["© www.excel-skills.com"]
["Account Number","Account Description"]
[101,"Gross Remuneration",null,"Account Groups"]
[105,"Commission Received",null,100,"Remuneration"]
[110,"Total Allowances",null,200,"Deductions"]
[115,"Subsidies Received",null,300,"Other Income & Receipts"]
[190,"Other Remuneration",null,400,"Expenses"]
[201,"Income Tax",null,500,"Financing Costs & Bank Charges"]
[205,"Pension Fund",null,600,"Investments & Assets"]
[210,"Medical Aid",null,700,"Entertainment & Leisure Costs"]
[215,"Unemployment Insurance",null,999,"Contra Account"]
[220,"Retirement Annuities"]
[290,"Other Deductions"]
[301,"Dividend Income"]
[305,"Interest Received"]
[310,"Income from Pension"]
[315,"Income from Annuities"]
[350,"Loans Received"]
[390,"Other Income"]
{"$rows_left_out":49}
{"sheet":"Transactions","index":5,"n_rows":396,"n_cols":9,"rows_kept":396,"cut":false,"hidden":true,"merged":[]}
["Transactions"]
["© www.excel-skills.com",null,null,null,null,{"$f":"SUBTOTAL(109,Trans[[#Data],[Amount]])","v":21701.530000000028}]
["Document Date","Source","Customer / Supplier","Reference","Description","Amount","Account","Payment Date","Account Description"]
["2020-02-28","CACC1","Opening Balance","Bank Statement","Opening Balance",9120.5,999,"2020-02-28",{"$f":"IF(ISNA(VLOOKUP(G4,Accounts,2,0))=TRUE,\"Account does not exist\",VLOOKUP(G4,Accounts,2,0))","v":"Contra Account"}]
["2020-02-28","CACC2","Opening Balance","Bank Statement","Opening Balance",3897.25,999,"2020-02-28","Contra Account"]
["2020-02-28","AMXCC1","Opening Balance","C/C Statement","Opening Balance",-523,999,"2020-02-28","Contra Account"]
["2020-02-28","MASCC2","Opening Balance","C/C Statement","Opening Balance",-8723.15,999,"2020-02-28","Contra Account"]
["2020-03-01","CACC1","Landlord XY","Debit Order","Rent - March",-6100,401,"2020-03-01","Rent Paid"]
["2020-03-01","CACC1","Mutual & Federal","Debit Order","Insurance",-152,425,"2020-03-01","Insurance - Short Term"]
["2020-03-01","CACC1","Liberty International","Debit Order","Life Insurance",-561,428,"2020-03-01","Insurance - Life"]
["2020-03-01","CACC1","Multichoice","Debit Order","DSTV Subscription",-573,443,"2020-03-01","Television Subscription"]
["2020-03-01","MASCC2","ABSA","C/C Statement","Interest",-92.56,535,"2020-03-01","Interest Paid"]
["2020-03-02","AMXCC1","SPAR","Statement","SPAR",-832,458,"2020-03-02","Groceries"]
["2020-03-08","MASCC2","Engen","Statement","Fuel",-432,440,"2020-03-08","Fuel & Vehicle Maintenance"]
["2020-03-09","AMXCC1","La Salla","Statement","La Salla",-332,701,"2020-03-09","Entertainment - Restaurants"]
["2020-03-12","CACC1","FNB","Bank Statement","Cash Withdrawal Fee",-10.7,540,"2020-03-12","Cash Withdrawal Fees"]
["2020-03-17","AMXCC1","PicknPay","Statement","PicknPay",-810,458,"2020-03-17","Groceries"]
["2020-03-19","MASCC2","Sasol","Statement","Fuel",-410,440,"2020-03-19","Fuel & Vehicle Maintenance"]
["2020-03-22","AMXCC1","Pigato's","Statement","Pigato's",-310,701,"2020-03-22","Entertainment - Restaurants"]
["2020-03-23","CACC1","FNB","Bank Statement","C/C Repayment",-10200,999,"2020-03-23","Contra Account"]
{"$rows_left_out":377}
{"sheet":"Report","index":6,"n_rows":79,"n_cols":16,"rows_kept":79,"cut":false,"hidden":true,"merged":[]}
["Personal Finance Report",null,"Source",null,null,null,null,null,null,null,null,null,null,null,"From"]
["Monthly Income & Expenses",null,null,{"$f":"IF(ISBLANK(C2)=TRUE,\"All Transactions\",VLOOKUP(C2,SourceAll,2,0))","v":"All Transactions"},null,null,null,null,null,null,null,null,null,null,"To"]
["© www.excel-skills.com"]
["Account Number","Description",{"$f":"DATE(YEAR(Sources!$C$2),MONTH(Sources!$C$2)+1,0)","v":"2020-03-31"},{"$f":"DATE(YEAR(C4),MONTH(C4)+2,0)","v":"2020-04-30"},{"$f":"DATE(YEAR(D4),MONTH(D4)+2,0)","v":"2020-05-31"},"2020-06-30","2020-07-31","2020-08-31","2020-09-30","2020-10-31","2020-11-30","2020-12-31","2021-01-31","2021-02-28",null,"Total"]
[101,{"$f":"IF(ISNA(VLOOKUP($A5,Accounts,2,0))=TRUE,\"Does Not Exist\",VLOOKUP($A5,Accounts,2,0))","v":"Gross Remuneration"},{"$f":"IF(ISBLANK($C$2)=TRUE,SUMPRODUCT((DocDate>=DATE(YEAR(C$4),MONTH(C$4),1))*(DocDate<=C$4)*(TrnAcc=$A5)*(TrnAmount)),SUMPRODUCT((DocDate>=DATE(YEAR(C$4),MONTH(C$4),1))*(DocDate<=C$4)*(TrnAcc=$A5)*(TrnSource=$C$2)*(TrnAmount)))","v":36500},36500,36500,36500,36500,36500,39200,39200,39200,39200,39200,39200,null,{"$f":"IF(ISBLANK($P$1)=TRUE,IF(ISBLANK($P$2)=TRUE,SUM($C5:$N5),IF(ISBLANK($C$2)=TRUE,SUMPRODUCT((DocDate>=DATE(YEAR($C$4),MONTH($C$4),1))*(DocDate<=$P$2)*(TrnAcc=$A5)*(TrnAmount)),SUMPRODUCT((DocDate>=DATE(YEAR($C$4),MONTH($C$4),1))*(DocDate<=$P$2)*(TrnAcc=$A5)*(TrnSource=$C$2)*(TrnAmount)))),IF(ISBLANK($P$2)=TRUE,IF(ISBLANK($C$2)=TRUE,SUMPRODUCT((DocDate>=$P$1)*(TrnAcc=$A5)*(TrnAmount)),SUMPRODUCT((DocDate>=$P$1)*(TrnAcc=$A5)*(TrnSource=$C$2)*(TrnAmount))),IF(ISBLANK($C$2)=TRUE,SUMPRODUCT((DocDate>=$P$1)*(DocDate<=$P$2)*(TrnAcc=$A5)*(TrnAmount)),SUMPRODUCT((DocDate>=$P$1)*(DocDate<=$P$2)*(TrnAcc=$A5)*(TrnSource=$C$2)*(TrnAmount)))))","v":454200}]
[105,{"$f":"IF(ISNA(VLOOKUP($A6,Accounts,2,0))=TRUE,\"Does Not Exist\",VLOOKUP($A6,Accounts,2,0))","v":"Commission Received"},0,0,0,0,0,0,0,0,0,0,0,0,null,{"$f":"IF(ISBLANK($P$1)=TRUE,IF(ISBLANK($P$2)=TRUE,SUM($C6:$N6),IF(ISBLANK($C$2)=TRUE,SUMPRODUCT((DocDate>=DATE(YEAR($C$4),MONTH($C$4),1))*(DocDate<=$P$2)*(TrnAcc=$A6)*(TrnAmount)),SUMPRODUCT((DocDate>=DATE(YEAR($C$4),MONTH($C$4),1))*(DocDate<=$P$2)*(TrnAcc=$A6)*(TrnSource=$C$2)*(TrnAmount)))),IF(ISBLANK($P$2)=TRUE,IF(ISBLANK($C$2)=TRUE,SUMPRODUCT((DocDate>=$P$1)*(TrnAcc=$A6)*(TrnAmount)),SUMPRODUCT((DocDate>=$P$1)*(TrnAcc=$A6)*(TrnSource=$C$2)*(TrnAmount))),IF(ISBLANK($C$2)=TRUE,SUMPRODUCT((DocDate>=$P$1)*(DocDate<=$P$2)*(TrnAcc=$A6)*(TrnAmount)),SUMPRODUCT((DocDate>=$P$1)*(DocDate<=$P$2)*(TrnAcc=$A6)*(TrnSource=$C$2)*(TrnAmount)))))","v":0}]
[110,{"$f":"IF(ISNA(VLOOKUP($A7,Accounts,2,0))=TRUE,\"Does Not Exist\",VLOOKUP($A7,Accounts,2,0))","v":"Total Allowances"},0,0,0,0,0,0,0,0,0,0,0,0,null,{"$f":"IF(ISBLANK($P$1)=TRUE,IF(ISBLANK($P$2)=TRUE,SUM($C7:$N7),IF(ISBLANK($C$2)=TRUE,SUMPRODUCT((DocDate>=DATE(YEAR($C$4),MONTH($C$4),1))*(DocDate<=$P$2)*(TrnAcc=$A7)*(TrnAmount)),SUMPRODUCT((DocDate>=DATE(YEAR($C$4),MONTH($C$4),1))*(DocDate<=$P$2)*(TrnAcc=$A7)*(TrnSource=$C$2)*(TrnAmount)))),IF(ISBLANK($P$2)=TRUE,IF(ISBLANK($C$2)=TRUE,SUMPRODUCT((DocDate>=$P$1)*(TrnAcc=$A7)*(TrnAmount)),SUMPRODUCT((DocDate>=$P$1)*(TrnAcc=$A7)*(TrnSource=$C$2)*(TrnAmount))),IF(ISBLANK($C$2)=TRUE,SUMPRODUCT((DocDate>=$P$1)*(DocDate<=$P$2)*(TrnAcc=$A7)*(TrnAmount)),SUMPRODUCT((DocDate>=$P$1)*(DocDate<=$P$2)*(TrnAcc=$A7)*(TrnSource=$C$2)*(TrnAmount)))))","v":0}]
[115,{"$f":"IF(ISNA(VLOOKUP($A8,Accounts,2,0))=TRUE,\"Does Not Exist\",VLOOKUP($A8,Accounts,2,0))","v":"Subsidies Received"},0,0,0,0,0,0,0,0,0,15000,0,0,null,{"$f":"IF(ISBLANK($P$1)=TRUE,IF(ISBLANK($P$2)=TRUE,SUM($C8:$N8),IF(ISBLANK($C$2)=TRUE,SUMPRODUCT((DocDate>=DATE(YEAR($C$4),MONTH($C$4),1))*(DocDate<=$P$2)*(TrnAcc=$A8)*(TrnAmount)),SUMPRODUCT((DocDate>=DATE(YEAR($C$4),MONTH($C$4),1))*(DocDate<=$P$2)*(TrnAcc=$A8)*(TrnSource=$C$2)*(TrnAmount)))),IF(ISBLANK($P$2)=TRUE,IF(ISBLANK($C$2)=TRUE,SUMPRODUCT((DocDate>=$P$1)*(TrnAcc=$A8)*(TrnAmount)),SUMPRODUCT((DocDate>=$P$1)*(TrnAcc=$A8)*(TrnSource=$C$2)*(TrnAmount))),IF(ISBLANK($C$2)=TRUE,SUMPRODUCT((DocDate>=$P$1)*(DocDate<=$P$2)*(TrnAcc=$A8)*(TrnAmount)),SUMPRODUCT((DocDate>=$P$1)*(DocDate<=$P$2)*(TrnAcc=$A8)*(TrnSource=$C$2)*(TrnAmount)))))","v":15000}]
[190,{"$f":"IF(ISNA(VLOOKUP($A9,Accounts,2,0))=TRUE,\"Does Not Exist\",VLOOKUP($A9,Accounts,2,0))","v":"Other Remuneration"},0,0,0,0,0,0,0,0,0,0,0,0,null,{"$f":"IF(ISBLANK($P$1)=TRUE,IF(ISBLANK($P$2)=TRUE,SUM($C9:$N9),IF(ISBLANK($C$2)=TRUE,SUMPRODUCT((DocDate>=DATE(YEAR($C$4),MONTH($C$4),1))*(DocDate<=$P$2)*(TrnAcc=$A9)*(TrnAmount)),SUMPRODUCT((DocDate>=DATE(YEAR($C$4),MONTH($C$4),1))*(DocDate<=$P$2)*(TrnAcc=$A9)*(TrnSource=$C$2)*(TrnAmount)))),IF(ISBLANK($P$2)=TRUE,IF(ISBLANK($C$2)=TRUE,SUMPRODUCT((DocDate>=$P$1)*(TrnAcc=$A9)*(TrnAmount)),SUMPRODUCT((DocDate>=$P$1)*(TrnAcc=$A9)*(TrnSource=$C$2)*(TrnAmount))),IF(ISBLANK($C$2)=TRUE,SUMPRODUCT((DocDate>=$P$1)*(DocDate<=$P$2)*(TrnAcc=$A9)*(TrnAmount)),SUMPRODUCT((DocDate>=$P$1)*(DocDate<=$P$2)*(TrnAcc=$A9)*(TrnSource=$C$2)*(TrnAmount)))))","v":0}]
[null,"Total Remuneration",{"$f":"SUM(OFFSET(C$4,1,0,ROW($B$10)-ROW($B$4)-1,1))","v":36500},{"$f":"SUM(OFFSET(D$4,1,0,ROW($B$10)-ROW($B$4)-1,1))","v":36500},36500,36500,36500,36500,39200,39200,39200,54200,39200,39200,null,469200]
[201,{"$f":"IF(ISNA(VLOOKUP($A11,Accounts,2,0))=TRUE,\"Does Not Exist\",VLOOKUP($A11,Accounts,2,0))","v":"Income Tax"},{"$f":"IF(ISBLANK($C$2)=TRUE,SUMPRODUCT((DocDate>=DATE(YEAR(C$4),MONTH(C$4),1))*(DocDate<=C$4)*(TrnAcc=$A11)*(TrnAmount)),SUMPRODUCT((DocDate>=DATE(YEAR(C$4),MONTH(C$4),1))*(DocDate<=C$4)*(TrnAcc=$A11)*(TrnSource=$C$2)*(TrnAmount)))","v":-9178.67},-9178.67,-9178.67,-9178.67,-9178.67,-9178.67,-10204.67,-10204.67,-10204.67,-10204.67,-10204.67,-10204.67,null,{"$f":"IF(ISBLANK($P$1)=TRUE,IF(ISBLANK($P$2)=TRUE,SUM($C11:$N11),IF(ISBLANK($C$2)=TRUE,SUMPRODUCT((DocDate>=DATE(YEAR($C$4),MONTH($C$4),1))*(DocDate<=$P$2)*(TrnAcc=$A11)*(TrnAmount)),SUMPRODUCT((DocDate>=DATE(YEAR($C$4),MONTH($C$4),1))*(DocDate<=$P$2)*(TrnAcc=$A11)*(TrnSource=$C$2)*(TrnAmount)))),IF(ISBLANK($P$2)=TRUE,IF(ISBLANK($C$2)=TRUE,SUMPRODUCT((DocDate>=$P$1)*(TrnAcc=$A11)*(TrnAmount)),SUMPRODUCT((DocDate>=$P$1)*(TrnAcc=$A11)*(TrnSource=$C$2)*(TrnAmount))),IF(ISBLANK($C$2)=TRUE,SUMPRODUCT((DocDate>=$P$1)*(DocDate<=$P$2)*(TrnAcc=$A11)*(TrnAmount)),SUMPRODUCT((DocDate>=$P$1)*(DocDate<=$P$2)*(TrnAcc=$A11)*(TrnSource=$C$2)*(TrnAmount)))))","v":-116300.04}]
[205,"Pension Fund",-2737.5,-2737.5,-2737.5,-2737.5,-2737.5,-2737.5,-2940,-2940,-2940,-2940,-2940,-2940,null,-34065]
[210,"Medical Aid",-877,-877,-877,-877,-877,-877,-877,-877,-877,-877,-906,-906,null,-10582]
[215,"Unemployment Insurance",-182.5,-182.5,-182.5,-182.5,-182.5,-182.5,-196,-196,-196,-196,-196,-196,null,-2271]
[220,"Retirement Annuities",0,0,0,0,0,0,0,0,0,0,0,0,null,0]
[290,"Other Deductions",0,0,0,0,0,0,0,0,0,0,0,0,null,0]
[null,"Total Deductions",{"$f":"SUM(OFFSET(C$10,1,0,ROW($B$17)-ROW($B$10)-1,1))","v":-12975.67},-12975.67,-12975.67,-12975.67,-12975.67,-12975.67,-14217.67,-14217.67,-14217.67,-14217.67,-14246.67,-14246.67,null,-163218.03999999998]
[null,"Net Remuneration",{"$f":"SUM(C10,C17)","v":23524.33},23524.33,23524.33,23524.33,23524.33,23524.33,24982.33,24982.33,24982.33,39982.33,24953.33,24953.33,null,{"$f":"SUM(P10,P17)","v":305981.96000000002}]
[301,{"$f":"IF(ISNA(VLOOKUP($A19,Accounts,2,0))=TRUE,\"Does Not Exist\",VLOOKUP($A19,Accounts,2,0))","v":"Dividend Income"},{"$f":"IF(ISBLANK($C$2)=TRUE,SUMPRODUCT((DocDate>=DATE(YEAR(C$4),MONTH(C$4),1))*(DocDate<=C$4)*(TrnAcc=$A19)*(TrnAmount)),SUMPRODUCT((DocDate>=DATE(YEAR(C$4),MONTH(C$4),1))*(DocDate<=C$4)*(TrnAcc=$A19)*(TrnSource=$C$2)*(TrnAmount)))","v":0},0,12865,0,0,0,0,0,0,0,0,0,null,{"$f":"IF(ISBLANK($P$1)=TRUE,IF(ISBLANK($P$2)=TRUE,SUM($C19:$N19),IF(ISBLANK($C$2)=TRUE,SUMPRODUCT((DocDate>=DATE(YEAR($C$4),MONTH($C$4),1))*(DocDate<=$P$2)*(TrnAcc=$A19)*(TrnAmount)),SUMPRODUCT((DocDate>=DATE(YEAR($C$4),MONTH($C$4),1))*(DocDate<=$P$2)*(TrnAcc=$A19)*(TrnSource=$C$2)*(TrnAmount)))),IF(ISBLANK($P$2)=TRUE,IF(ISBLANK($C$2)=TRUE,SUMPRODUCT((DocDate>=$P$1)*(TrnAcc=$A19)*(TrnAmount)),SUMPRODUCT((DocDate>=$P$1)*(TrnAcc=$A19)*(TrnSource=$C$2)*(TrnAmount))),IF(ISBLANK($C$2)=TRUE,SUMPRODUCT((DocDate>=$P$1)*(DocDate<=$P$2)*(TrnAcc=$A19)*(TrnAmount)),SUMPRODUCT((DocDate>=$P$1)*(DocDate<=$P$2)*(TrnAcc=$A19)*(TrnSource=$C$2)*(TrnAmount)))))","v":12865}]
[305,"Interest Received",0,0,0,0,0,0,0,0,0,0,0,0,null,0]
{"$rows_left_out":59}