{"text_format":"1","workbook":"xlsx","n_sheets":10,"sheets":["Info","Trial","Instructions","Input","PrimeRate","AdHoc","MonthAmort","CashFlow","Results","Variables"],"not_rendered":{"charts":0,"images":2,"macros":1,"external_links":0,"defined_names":13,"comments":0,"pivot_tables":0},"unopened":[],"bounds":{"document_bytes":16777216,"sheet_cells":100000,"rows_first":2000,"rows_last":500,"rows_between":2000,"halvings":0,"cell_chars":16384,"cell_head_chars":4096},"cells_cut":0,"cells_raw":0,"read":"whole","date_system":"1900"}

{"sheet":"Info","index":0,"n_rows":0,"n_cols":0,"rows_kept":0,"cut":false,"hidden":false,"merged":[]}

{"sheet":"Trial","index":1,"n_rows":0,"n_cols":0,"rows_kept":0,"cut":false,"hidden":true,"merged":[]}

{"sheet":"Instructions","index":2,"n_rows":342,"n_cols":1,"rows_kept":342,"cut":false,"hidden":true,"merged":[]}
["Excel Skills | Property Investment Forecast Template"]
["Instructions"]
["www.excel-skills.com"]
[]
["This template enables users to calculate a comprehensive residential property investment forecast for any property investment or primary residence over any investment period between 1 month and 20 years. The functionality that has been included in the template is comparable to any property software solution - in fact, we guarantee that you will not find a more practical and comprehensive residential property forecast solution anywhere else. Users are required to specify input values for a comprehensive series of property variables and the template automatically calculates a comprehensive, accurate investment return forecast on an annual and cumulative basis."]
[]
["This template is provided courtesy of Property Reality. The template forms part of the unique range of innovative residential property templates that are available on the Property Reality website (www.propertyreality.co.za). We highly recommend that you visit Property Reality in order to view samples of all the templates that are included in their comprehensive template subscription! If you are only interested in a residential property investment forecast template, you can buy this template by using our shopping cart."]
[]
["Note: We highly recommend using this template in conjunction with Property Reality's unique buy to let and primary residence property investment templates. The property investment forecast template enables users to compile an accurate investment forecast and the buy to let and primary residence property investment templates enable users to compile an accurate analysis of the actual investment return that is achieved. By comparing the results that are produced by these templates, users are able to measure actual investment return against initial expectations."]
[]
{"$rows_left_out":333}
{"sheet":"Input","index":3,"n_rows":43,"n_cols":6,"rows_kept":43,"cut":false,"hidden":true,"merged":[]}
["Residential Property Investment Forecast"]
["Input Variables"]
["© www.excel-skills.com"]
["Property & Bond Details"]
["Property Purchase Date","2023-04-01"]
["Property Purchase Price",2200000,null,null,false,{"$f":"IF(E$6=TRUE,$B$6/(1+Variables!$C$62),$B$6)","v":2200000}]
["Deposit Amount",200000]
["Bond Period (in years)",20]
["VAT Registered"]
["Initial Renovation Costs",0]
{"$rows_left_out":34}
{"sheet":"PrimeRate","index":4,"n_rows":976,"n_cols":2,"rows_kept":976,"cut":false,"hidden":true,"merged":[]}
["Residential Property Investment Forecast"]
["Prime Interest Rates"]
["© www.excel-skills.com"]
["Month","Prime Rate"]
["2000-01-31",14.5]
["2000-02-29",14.5]
["2000-03-31",14.5]
["2000-04-30",14.5]
["2000-05-31",14.5]
["2000-06-30",14.5]
{"$rows_left_out":967}
{"sheet":"AdHoc","index":5,"n_rows":976,"n_cols":2,"rows_kept":976,"cut":false,"hidden":true,"merged":[]}
["Residential Property Investment Forecast"]
["Ad Hoc Bond Repayments"]
["© www.excel-skills.com"]
["Month","Ad Hoc Repayment"]
["2000-01-31",0]
[{"$f":"DATE(YEAR(A5),MONTH(A5)+2,1-1)","v":"2000-02-29"},0]
[{"$f":"DATE(YEAR(A6),MONTH(A6)+2,1-1)","v":"2000-03-31"},0]
["2000-04-30",0]
["2000-05-31",0]
["2000-06-30",0]
{"$rows_left_out":967}
{"sheet":"MonthAmort","index":6,"n_rows":370,"n_cols":10,"rows_kept":370,"cut":false,"hidden":true,"merged":[[7,0,7,1],[3,0,3,1],[4,0,4,1],[5,0,5,1],[6,0,6,1]]}
["Residential Property Investment Forecast"]
["Amortization Table"]
["© www.excel-skills.com"]
["Purchase Price",null,{"$f":"Input!B6","v":2200000},null,"Purchase Date",{"$f":"Input!B5","v":"2023-04-01"}]
["Annual Bond Interest Rate",null,{"$f":"$J$11","v":9.75},"%"]
["Bond Period in Years",null,{"$f":"Input!B8","v":20},null,"Rate Discount",1,"%"]
["Original Monthly Bond Repayment",null,{"$f":"PMT(C5/100/12,C6*12,-$C$4+$C$8,0,0)","v":18970.33701152233}]
["Deposit Amount",null,{"$f":"Input!B7","v":200000}]
[]
["Repayment Month","Repayment Number","Opening Balance","Bond Repayment","Ad Hoc Repayment","Interest Charged","Capital \nRepaid","Closing Balance","Outstanding Capital %","Interest \nRate"]
{"$rows_left_out":361}
{"sheet":"CashFlow","index":7,"n_rows":31,"n_cols":22,"rows_kept":31,"cut":false,"hidden":true,"merged":[]}
["Property Investment"]
["Cash Flow Calculation"]
["© www.excel-skills.com"]
["Annual Capital Growth Rate",null,6,6,10,10,10,10,10,10,10,10,10,10,10,10,10,10,10,10,10,10]
["Market Value",null,{"$f":"IF(C$8=0,0,Input!$B$6*(1+(C$4/100)))","v":2332000},{"$f":"IF(D$8=0,0,C5*(1+(D$4/100)))","v":2471920},{"$f":"IF(E$8=0,0,D5*(1+(E$4/100)))","v":2719112},2991023.2,3290125.5200000005,3619138.0720000006,3981051.8792000008,4379157.0671200017,4817072.7738320027,5298780.0512152035,5828658.0563367242,6411523.8619703967,7052676.2481674366,7757943.8729841812,8533738.2602826003,9387112.0863108616,10325823.294941949,11358405.624436144,12494246.18687976,13743670.805567736]
["Outstanding Bond Amount",null,{"$f":"IF(C8=0,0,OFFSET(MonthAmort!$H$10,(B$8*12)+C9,0,1,1))","v":1965856.9347482249},{"$f":"IF(D8=0,0,OFFSET(MonthAmort!$H$10,(C$8*12)+D9,0,1,1))","v":1928232.0546289263},{"$f":"IF(E8=0,0,OFFSET(MonthAmort!$H$10,(D$8*12)+E9,0,1,1))","v":1886770.2938422901},{"$f":"IF(F8=0,0,OFFSET(MonthAmort!$H$10,(E$8*12)+F9,0,1,1))","v":1841080.3779654154},{"$f":"IF(G8=0,0,OFFSET(MonthAmort!$H$10,(F$8*12)+G9,0,1,1))","v":1790731.131497602},{"$f":"IF(H8=0,0,OFFSET(MonthAmort!$H$10,(G$8*12)+H9,0,1,1))","v":1735247.4088593705},{"$f":"IF(I8=0,0,OFFSET(MonthAmort!$H$10,(H$8*12)+I9,0,1,1))","v":1674105.6104460787},{"$f":"IF(J8=0,0,OFFSET(MonthAmort!$H$10,(I$8*12)+J9,0,1,1))","v":1606728.7414211505},{"$f":"IF(K8=0,0,OFFSET(MonthAmort!$H$10,(J$8*12)+K9,0,1,1))","v":1532480.966618774},{"$f":"IF(L8=0,0,OFFSET(MonthAmort!$H$10,(K$8*12)+L9,0,1,1))","v":1450661.6101707206},{"$f":"IF(M8=0,0,OFFSET(MonthAmort!$H$10,(L$8*12)+M9,0,1,1))","v":1360498.5432317862},{"$f":"IF(N8=0,0,OFFSET(MonthAmort!$H$10,(M$8*12)+N9,0,1,1))","v":1261140.8974038574},{"$f":"IF(O8=0,0,OFFSET(MonthAmort!$H$10,(N$8*12)+O9,0,1,1))","v":1151651.0350952223},{"$f":"IF(P8=0,0,OFFSET(MonthAmort!$H$10,(O$8*12)+P9,0,1,1))","v":1030995.7010394506},{"$f":"IF(Q8=0,0,OFFSET(MonthAmort!$H$10,(P$8*12)+Q9,0,1,1))","v":898036.27147076582},{"$f":"IF(R8=0,0,OFFSET(MonthAmort!$H$10,(Q$8*12)+R9,0,1,1))","v":751518.00893743732},{"$f":"IF(S8=0,0,OFFSET(MonthAmort!$H$10,(R$8*12)+S9,0,1,1))","v":590058.22135091235},{"$f":"IF(T8=0,0,OFFSET(MonthAmort!$H$10,(S$8*12)+T9,0,1,1))","v":412133.21352770145},{"$f":"IF(U8=0,0,OFFSET(MonthAmort!$H$10,(T$8*12)+U9,0,1,1))","v":216063.90808578266},{"$f":"IF(V8=0,0,OFFSET(MonthAmort!$H$10,(U$8*12)+V9,0,1,1))","v":0}]
["Equity 1",null,{"$f":"C5-C6","v":366143.06525177509},{"$f":"D5-D6","v":543687.94537107367},832341.70615770994,1149942.8220345848,1499394.3885023985,1883890.6631406301,2306946.2687539221,2772428.3256988511,3284591.8072132287,3848118.4410444829,4468159.513104938,5150382.964566539,5901025.2130722143,6726948.1719447309,7635701.9888118347,8635594.0773734245,9735765.0735910367,10946272.410908442,12278182.278793978,13743670.805567736]
["Year Number",0,{"$f":"IF(Input!$B$42<=((COLUMN(B8)-COLUMN($B$8))*12),0,COLUMN(B8)-2+1)","v":1},{"$f":"IF(Input!$B$42<=((COLUMN(C8)-COLUMN($B$8))*12),0,COLUMN(C8)-2+1)","v":2},{"$f":"IF(Input!$B$42<=((COLUMN(D8)-COLUMN($B$8))*12),0,COLUMN(D8)-2+1)","v":3},{"$f":"IF(Input!$B$42<=((COLUMN(E8)-COLUMN($B$8))*12),0,COLUMN(E8)-2+1)","v":4},{"$f":"IF(Input!$B$42<=((COLUMN(F8)-COLUMN($B$8))*12),0,COLUMN(F8)-2+1)","v":5},{"$f":"IF(Input!$B$42<=((COLUMN(G8)-COLUMN($B$8))*12),0,COLUMN(G8)-2+1)","v":6},{"$f":"IF(Input!$B$42<=((COLUMN(H8)-COLUMN($B$8))*12),0,COLUMN(H8)-2+1)","v":7},{"$f":"IF(Input!$B$42<=((COLUMN(I8)-COLUMN($B$8))*12),0,COLUMN(I8)-2+1)","v":8},{"$f":"IF(Input!$B$42<=((COLUMN(J8)-COLUMN($B$8))*12),0,COLUMN(J8)-2+1)","v":9},{"$f":"IF(Input!$B$42<=((COLUMN(K8)-COLUMN($B$8))*12),0,COLUMN(K8)-2+1)","v":10},{"$f":"IF(Input!$B$42<=((COLUMN(L8)-COLUMN($B$8))*12),0,COLUMN(L8)-2+1)","v":11},{"$f":"IF(Input!$B$42<=((COLUMN(M8)-COLUMN($B$8))*12),0,COLUMN(M8)-2+1)","v":12},{"$f":"IF(Input!$B$42<=((COLUMN(N8)-COLUMN($B$8))*12),0,COLUMN(N8)-2+1)","v":13},{"$f":"IF(Input!$B$42<=((COLUMN(O8)-COLUMN($B$8))*12),0,COLUMN(O8)-2+1)","v":14},{"$f":"IF(Input!$B$42<=((COLUMN(P8)-COLUMN($B$8))*12),0,COLUMN(P8)-2+1)","v":15},{"$f":"IF(Input!$B$42<=((COLUMN(Q8)-COLUMN($B$8))*12),0,COLUMN(Q8)-2+1)","v":16},{"$f":"IF(Input!$B$42<=((COLUMN(R8)-COLUMN($B$8))*12),0,COLUMN(R8)-2+1)","v":17},{"$f":"IF(Input!$B$42<=((COLUMN(S8)-COLUMN($B$8))*12),0,COLUMN(S8)-2+1)","v":18},{"$f":"IF(Input!$B$42<=((COLUMN(T8)-COLUMN($B$8))*12),0,COLUMN(T8)-2+1)","v":19},{"$f":"IF(Input!$B$42<=((COLUMN(U8)-COLUMN($B$8))*12),0,COLUMN(U8)-2+1)","v":20}]
["Months in Year",0,{"$f":"IF(Input!$B$42<=((COLUMN(B8)-COLUMN($B$8))*12),0,IF(AND(Input!$B$42>(B8*12),Input!$B$42<=(C8*12))=TRUE,Input!$B$42-(B8*12),12))","v":12},{"$f":"IF(Input!$B$42<=((COLUMN(C8)-COLUMN($B$8))*12),0,IF(AND(Input!$B$42>(C8*12),Input!$B$42<=(D8*12))=TRUE,Input!$B$42-(C8*12),12))","v":12},{"$f":"IF(Input!$B$42<=((COLUMN(D8)-COLUMN($B$8))*12),0,IF(AND(Input!$B$42>(D8*12),Input!$B$42<=(E8*12))=TRUE,Input!$B$42-(D8*12),12))","v":12},{"$f":"IF(Input!$B$42<=((COLUMN(E8)-COLUMN($B$8))*12),0,IF(AND(Input!$B$42>(E8*12),Input!$B$42<=(F8*12))=TRUE,Input!$B$42-(E8*12),12))","v":12},{"$f":"IF(Input!$B$42<=((COLUMN(F8)-COLUMN($B$8))*12),0,IF(AND(Input!$B$42>(F8*12),Input!$B$42<=(G8*12))=TRUE,Input!$B$42-(F8*12),12))","v":12},{"$f":"IF(Input!$B$42<=((COLUMN(G8)-COLUMN($B$8))*12),0,IF(AND(Input!$B$42>(G8*12),Input!$B$42<=(H8*12))=TRUE,Input!$B$42-(G8*12),12))","v":12},{"$f":"IF(Input!$B$42<=((COLUMN(H8)-COLUMN($B$8))*12),0,IF(AND(Input!$B$42>(H8*12),Input!$B$42<=(I8*12))=TRUE,Input!$B$42-(H8*12),12))","v":12},{"$f":"IF(Input!$B$42<=((COLUMN(I8)-COLUMN($B$8))*12),0,IF(AND(Input!$B$42>(I8*12),Input!$B$42<=(J8*12))=TRUE,Input!$B$42-(I8*12),12))","v":12},{"$f":"IF(Input!$B$42<=((COLUMN(J8)-COLUMN($B$8))*12),0,IF(AND(Input!$B$42>(J8*12),Input!$B$42<=(K8*12))=TRUE,Input!$B$42-(J8*12),12))","v":12},{"$f":"IF(Input!$B$42<=((COLUMN(K8)-COLUMN($B$8))*12),0,IF(AND(Input!$B$42>(K8*12),Input!$B$42<=(L8*12))=TRUE,Input!$B$42-(K8*12),12))","v":12},{"$f":"IF(Input!$B$42<=((COLUMN(L8)-COLUMN($B$8))*12),0,IF(AND(Input!$B$42>(L8*12),Input!$B$42<=(M8*12))=TRUE,Input!$B$42-(L8*12),12))","v":12},{"$f":"IF(Input!$B$42<=((COLUMN(M8)-COLUMN($B$8))*12),0,IF(AND(Input!$B$42>(M8*12),Input!$B$42<=(N8*12))=TRUE,Input!$B$42-(M8*12),12))","v":12},{"$f":"IF(Input!$B$42<=((COLUMN(N8)-COLUMN($B$8))*12),0,IF(AND(Input!$B$42>(N8*12),Input!$B$42<=(O8*12))=TRUE,Input!$B$42-(N8*12),12))","v":12},{"$f":"IF(Input!$B$42<=((COLUMN(O8)-COLUMN($B$8))*12),0,IF(AND(Input!$B$42>(O8*12),Input!$B$42<=(P8*12))=TRUE,Input!$B$42-(O8*12),12))","v":12},{"$f":"IF(Input!$B$42<=((COLUMN(P8)-COLUMN($B$8))*12),0,IF(AND(Input!$B$42>(P8*12),Input!$B$42<=(Q8*12))=TRUE,Input!$B$42-(P8*12),12))","v":12},{"$f":"IF(Input!$B$42<=((COLUMN(Q8)-COLUMN($B$8))*12),0,IF(AND(Input!$B$42>(Q8*12),Input!$B$42<=(R8*12))=TRUE,Input!$B$42-(Q8*12),12))","v":12},{"$f":"IF(Input!$B$42<=((COLUMN(R8)-COLUMN($B$8))*12),0,IF(AND(Input!$B$42>(R8*12),Input!$B$42<=(S8*12))=TRUE,Input!$B$42-(R8*12),12))","v":12},{"$f":"IF(Input!$B$42<=((COLUMN(S8)-COLUMN($B$8))*12),0,IF(AND(Input!$B$42>(S8*12),Input!$B$42<=(T8*12))=TRUE,Input!$B$42-(S8*12),12))","v":12},{"$f":"IF(Input!$B$42<=((COLUMN(T8)-COLUMN($B$8))*12),0,IF(AND(Input!$B$42>(T8*12),Input!$B$42<=(U8*12))=TRUE,Input!$B$42-(T8*12),12))","v":12},{"$f":"IF(Input!$B$42<=((COLUMN(U8)-COLUMN($B$8))*12),0,IF(AND(Input!$B$42>(U8*12),Input!$B$42<=(V8*12))=TRUE,Input!$B$42-(U8*12),12))","v":12}]
[null,{"$f":"DATE(YEAR(Input!$B$5),MONTH(Input!$B$5)+1,0)","v":"2023-04-30"},{"$f":"IF(C8=0,0,DATE(YEAR(B10),MONTH(B10)+C9,DAY(B10)))","v":"2024-04-30"},{"$f":"IF(D8=0,0,DATE(YEAR(C10),MONTH(C10)+D9,DAY(C10)))","v":"2025-04-30"},"2026-04-30","2027-04-30","2028-04-30","2029-04-30","2030-04-30","2031-04-30","2032-04-30","2033-04-30",{"$f":"IF(M8=0,0,DATE(YEAR(L10),MONTH(L10)+M9,DAY(L10)))","v":"2034-04-30"},"2035-04-30","2036-04-30","2037-04-30","2038-04-30","2039-04-30","2040-04-30","2041-04-30","2042-04-30","2043-04-30"]
{"$rows_left_out":22}
{"sheet":"Results","index":8,"n_rows":71,"n_cols":22,"rows_kept":71,"cut":false,"hidden":true,"merged":[]}
["Property Investment"]
["Calculation Results"]
["Year Number",{"$f":"CashFlow!B8","v":0},{"$f":"CashFlow!C8","v":1},{"$f":"CashFlow!D8","v":2},{"$f":"CashFlow!E8","v":3},{"$f":"CashFlow!F8","v":4},{"$f":"CashFlow!G8","v":5},{"$f":"CashFlow!H8","v":6},{"$f":"CashFlow!I8","v":7},{"$f":"CashFlow!J8","v":8},{"$f":"CashFlow!K8","v":9},{"$f":"CashFlow!L8","v":10},{"$f":"CashFlow!M8","v":11},{"$f":"CashFlow!N8","v":12},{"$f":"CashFlow!O8","v":13},{"$f":"CashFlow!P8","v":14},{"$f":"CashFlow!Q8","v":15},{"$f":"CashFlow!R8","v":16},{"$f":"CashFlow!S8","v":17},{"$f":"CashFlow!T8","v":18},{"$f":"CashFlow!U8","v":19},{"$f":"CashFlow!V8","v":20}]
["Months in Year",{"$f":"CashFlow!B9","v":0},{"$f":"CashFlow!C9","v":12},{"$f":"CashFlow!D9","v":12},{"$f":"CashFlow!E9","v":12},{"$f":"CashFlow!F9","v":12},{"$f":"CashFlow!G9","v":12},{"$f":"CashFlow!H9","v":12},{"$f":"CashFlow!I9","v":12},{"$f":"CashFlow!J9","v":12},{"$f":"CashFlow!K9","v":12},{"$f":"CashFlow!L9","v":12},{"$f":"CashFlow!M9","v":12},{"$f":"CashFlow!N9","v":12},{"$f":"CashFlow!O9","v":12},{"$f":"CashFlow!P9","v":12},{"$f":"CashFlow!Q9","v":12},{"$f":"CashFlow!R9","v":12},{"$f":"CashFlow!S9","v":12},{"$f":"CashFlow!T9","v":12},{"$f":"CashFlow!U9","v":12},{"$f":"CashFlow!V9","v":12}]
[null,{"$f":"CashFlow!B10","v":"2023-04-30"},{"$f":"CashFlow!C10","v":"2024-04-30"},{"$f":"CashFlow!D10","v":"2025-04-30"},{"$f":"CashFlow!E10","v":"2026-04-30"},{"$f":"CashFlow!F10","v":"2027-04-30"},{"$f":"CashFlow!G10","v":"2028-04-30"},{"$f":"CashFlow!H10","v":"2029-04-30"},{"$f":"CashFlow!I10","v":"2030-04-30"},{"$f":"CashFlow!J10","v":"2031-04-30"},{"$f":"CashFlow!K10","v":"2032-04-30"},{"$f":"CashFlow!L10","v":"2033-04-30"},{"$f":"CashFlow!M10","v":"2034-04-30"},{"$f":"CashFlow!N10","v":"2035-04-30"},{"$f":"CashFlow!O10","v":"2036-04-30"},{"$f":"CashFlow!P10","v":"2037-04-30"},{"$f":"CashFlow!Q10","v":"2038-04-30"},{"$f":"CashFlow!R10","v":"2039-04-30"},{"$f":"CashFlow!S10","v":"2040-04-30"},{"$f":"CashFlow!T10","v":"2041-04-30"},{"$f":"CashFlow!U10","v":"2042-04-30"},{"$f":"CashFlow!V10","v":"2043-04-30"}]
["Net Operational Cash Flow - Annual",{"$f":"SUM(CashFlow!B11:B23)+Control","v":-341494.5},{"$f":"SUM(CashFlow!C11:C23)","v":-85845.750472319953},{"$f":"SUM(CashFlow!D11:D23)","v":-77490.694932577084},{"$f":"SUM(CashFlow!E11:E23)","v":-68240.711132778379},{"$f":"SUM(CashFlow!F11:F23)","v":-58002.827579849807},{"$f":"SUM(CashFlow!G11:G23)","v":-46674.575752331526},{"$f":"SUM(CashFlow!H11:H23)","v":-34143.029306368815},{"$f":"SUM(CashFlow!I11:I23)","v":-20283.746628773573},{"$f":"SUM(CashFlow!J11:J23)","v":-4959.6070468245598},{"$f":"SUM(CashFlow!K11:K23)","v":11980.469965099473},{"$f":"SUM(CashFlow!L11:L23)","v":30702.93430843571},{"$f":"SUM(CashFlow!M11:M23)","v":51391.156412321259},{"$f":"SUM(CashFlow!N11:N23)","v":74247.134204118978},{"$f":"SUM(CashFlow!O11:O23)","v":99493.37150741776},{"$f":"SUM(CashFlow!P11:P23)","v":127374.94503729319},{"$f":"SUM(CashFlow!Q11:Q23)","v":158161.77887949813},{"$f":"SUM(CashFlow!R11:R23)","v":192151.1472286511},{"$f":"SUM(CashFlow!S11:S23)","v":229670.42823752455},{"$f":"SUM(CashFlow!T11:T23)","v":271080.13411401166},{"$f":"SUM(CashFlow!U11:U23)","v":316777.24511502951},{"$f":"SUM(CashFlow!V11:V23)","v":367198.87785021472}]
["Net Operational Cash Flow - Cumulative",{"$f":"SUM($B$6:B6)","v":-341494.5},{"$f":"IF(C3=0,0,SUM($B$6:C6))","v":-427340.25047231995},{"$f":"IF(D3=0,0,SUM($B$6:D6))","v":-504830.94540489704},{"$f":"IF(E3=0,0,SUM($B$6:E6))","v":-573071.65653767542},{"$f":"IF(F3=0,0,SUM($B$6:F6))","v":-631074.48411752516},{"$f":"IF(G3=0,0,SUM($B$6:G6))","v":-677749.05986985669},{"$f":"IF(H3=0,0,SUM($B$6:H6))","v":-711892.08917622548},{"$f":"IF(I3=0,0,SUM($B$6:I6))","v":-732175.83580499911},{"$f":"IF(J3=0,0,SUM($B$6:J6))","v":-737135.44285182364},{"$f":"IF(K3=0,0,SUM($B$6:K6))","v":-725154.97288672416},{"$f":"IF(L3=0,0,SUM($B$6:L6))","v":-694452.0385782884},{"$f":"IF(M3=0,0,SUM($B$6:M6))","v":-643060.88216596714},{"$f":"IF(N3=0,0,SUM($B$6:N6))","v":-568813.74796184816},{"$f":"IF(O3=0,0,SUM($B$6:O6))","v":-469320.3764544304},{"$f":"IF(P3=0,0,SUM($B$6:P6))","v":-341945.43141713721},{"$f":"IF(Q3=0,0,SUM($B$6:Q6))","v":-183783.65253763908},{"$f":"IF(R3=0,0,SUM($B$6:R6))","v":8367.4946910120198},{"$f":"IF(S3=0,0,SUM($B$6:S6))","v":238037.92292853657},{"$f":"IF(T3=0,0,SUM($B$6:T6))","v":509118.0570425482},{"$f":"IF(U3=0,0,SUM($B$6:U6))","v":825895.30215757771},{"$f":"IF(V3=0,0,SUM($B$6:V6))","v":1193094.1800077925}]
["Equity Calculation"]
["Market Value",{"$f":"Input!$B$6+Control","v":2200000},{"$f":"CashFlow!C$5","v":2332000},{"$f":"CashFlow!D$5","v":2471920},{"$f":"CashFlow!E$5","v":2719112},{"$f":"CashFlow!F$5","v":2991023.2},{"$f":"CashFlow!G$5","v":3290125.5200000005},{"$f":"CashFlow!H$5","v":3619138.0720000006},{"$f":"CashFlow!I$5","v":3981051.8792000008},{"$f":"CashFlow!J$5","v":4379157.0671200017},{"$f":"CashFlow!K$5","v":4817072.7738320027},{"$f":"CashFlow!L$5","v":5298780.0512152035},{"$f":"CashFlow!M$5","v":5828658.0563367242},{"$f":"CashFlow!N$5","v":6411523.8619703967},{"$f":"CashFlow!O$5","v":7052676.2481674366},{"$f":"CashFlow!P$5","v":7757943.8729841812},{"$f":"CashFlow!Q$5","v":8533738.2602826003},{"$f":"CashFlow!R$5","v":9387112.0863108616},{"$f":"CashFlow!S$5","v":10325823.294941949},{"$f":"CashFlow!T$5","v":11358405.624436144},{"$f":"CashFlow!U$5","v":12494246.18687976},{"$f":"CashFlow!V$5","v":13743670.805567736}]
["Outstanding Bond Amount",{"$f":"-(Input!$B$6-Input!$B$7)","v":-2000000},{"$f":"-CashFlow!C6","v":-1965856.9347482249},{"$f":"-CashFlow!D6","v":-1928232.0546289263},{"$f":"-CashFlow!E6","v":-1886770.2938422901},{"$f":"-CashFlow!F6","v":-1841080.3779654154},{"$f":"-CashFlow!G6","v":-1790731.131497602},{"$f":"-CashFlow!H6","v":-1735247.4088593705},{"$f":"-CashFlow!I6","v":-1674105.6104460787},{"$f":"-CashFlow!J6","v":-1606728.7414211505},{"$f":"-CashFlow!K6","v":-1532480.966618774},{"$f":"-CashFlow!L6","v":-1450661.6101707206},{"$f":"-CashFlow!M6","v":-1360498.5432317862},{"$f":"-CashFlow!N6","v":-1261140.8974038574},{"$f":"-CashFlow!O6","v":-1151651.0350952223},{"$f":"-CashFlow!P6","v":-1030995.7010394506},{"$f":"-CashFlow!Q6","v":-898036.27147076582},{"$f":"-CashFlow!R6","v":-751518.00893743732},{"$f":"-CashFlow!S6","v":-590058.22135091235},{"$f":"-CashFlow!T6","v":-412133.21352770145},{"$f":"-CashFlow!U6","v":-216063.90808578266},{"$f":"-CashFlow!V6","v":0}]
{"$rows_left_out":62}
{"sheet":"Variables","index":9,"n_rows":75,"n_cols":5,"rows_kept":75,"cut":false,"hidden":true,"merged":[]}
["Residential Property Investment Forecast"]
["Default Calculation Variables"]
["© www.excel-skills.com"]
["Transfer Duty"]
[]
["Property Value Brackets","Value","Rate","Equivalent Value"]
[{"$f":"\"From 0 to \"&FIXED(B7,0,0)","v":"From 0 to 1,100,000"},1100000,0,{"$f":"B7*C7","v":0}]
[{"$f":"\"From \"&FIXED(OFFSET($A$6,ROW(B8)-ROW(B$6)-1,1,1,1),0,0)&\" to \"&FIXED(B8,0,0)","v":"From 1,100,000 to 1,512,500"},1512500,0.03,{"$f":"((B8-OFFSET($B$6,ROW(B8)-ROW(B$6)-1,0,1,1))*C8)+OFFSET($D$6,ROW(B8)-ROW(B$6)-1,0,1,1)","v":12375}]
[{"$f":"\"From \"&FIXED(OFFSET($A$6,ROW(B9)-ROW(B$6)-1,1,1,1),0,0)&\" to \"&FIXED(B9,0,0)","v":"From 1,512,500 to 2,117,500"},2117500,0.06,{"$f":"((B9-OFFSET($B$6,ROW(B9)-ROW(B$6)-1,0,1,1))*C9)+OFFSET($D$6,ROW(B9)-ROW(B$6)-1,0,1,1)","v":48675}]
[{"$f":"\"From \"&FIXED(OFFSET($A$6,ROW(B10)-ROW(B$6)-1,1,1,1),0,0)&\" to \"&FIXED(B10,0,0)","v":"From 2,117,500 to 2,722,500"},2722500,0.08,{"$f":"((B10-OFFSET($B$6,ROW(B10)-ROW(B$6)-1,0,1,1))*C10)+OFFSET($D$6,ROW(B10)-ROW(B$6)-1,0,1,1)","v":97075}]
{"$rows_left_out":65}