{"text_format":"1","workbook":"xlsx","n_sheets":7,"sheets":["Info","Trial","Instructions","Logbook","Clients","Vehicles","Form"],"not_rendered":{"charts":0,"images":2,"macros":1,"external_links":0,"defined_names":23,"comments":0,"pivot_tables":0},"unopened":[],"bounds":{"document_bytes":16777216,"sheet_cells":100000,"rows_first":2000,"rows_last":500,"rows_between":2000,"halvings":0,"cell_chars":16384,"cell_head_chars":4096},"cells_cut":0,"cells_raw":0,"read":"whole","date_system":"1900"}

{"sheet":"Info","index":0,"n_rows":0,"n_cols":0,"rows_kept":0,"cut":false,"hidden":false,"merged":[]}

{"sheet":"Trial","index":1,"n_rows":0,"n_cols":0,"rows_kept":0,"cut":false,"hidden":true,"merged":[]}

{"sheet":"Instructions","index":2,"n_rows":141,"n_cols":1,"rows_kept":141,"cut":false,"hidden":true,"merged":[]}
["Excel Skills | Vehicle Logbook Template"]
["Instructions"]
["www.excel-skills.com"]
[]
["This unique template enables users to compile a complete vehicle logbook for all business and private travel. The template accommodates multiple vehicles and can also be used to calculate travel charges for invoicing to clients. The template is suitable for individuals who need to compile a vehicle logbook for income tax purposes and for businesses that need to manage a fleet of vehicles, calculate amounts that need to be charged to clients, manage pool cars and analyse business & private use of vehicles."]
[]
["The template includes the following sheets:"]
["Logbook - this sheet can be used to compile a comprehensive vehicle logbook for multiple vehicles. The vehicle registration number and client code selections are based on the contents of the Vehicles and Clients sheets. The travel distance is calculated based on the opening & closing odometer readings and is compared to the standard distance for the selected client which is defined on the Clients sheet."]
["Clients - create client codes for all clients on this sheet and enter a client name & standard travel distance. The calculations on this sheet can be used to calculate the amounts that need to be charged to clients based on any user defined date range & vehicle selection. The sheet also contains calculations which can be used to analyse the travel that is charged to clients on a monthly basis."]
["Vehicles - add vehicle registration numbers for all vehicles and enter a vehicle description. The calculations on this sheet can be used to calculate the business & private mileage of each vehicle based on any user defined date range & client selection. The sheet also contains a monthly analysis of the total mileage, business travel % and number of business trips over a three month period."]
["Form - this sheet contains a form which can be printed and supplied to all drivers in order to record all business & private trip details. The trip details that are recorded on these forms can then be entered on the Logbook sheet in order to compile a comprehensive logbook for each vehicle."]
[]
["Vehicle Logbook Details"]
[]
["All business & private trip details for each of the vehicles that are included in this template need to be recorded on the Logbook sheet. All the columns with yellow column headings require user input while the columns with light blue column headings contain formulas which are automatically copied for all the new rows that are added to this sheet."]
[]
["Note: The contents on the Logbook sheet have been included in an Excel data table. All the columns on the Logbook sheet with yellow column headings require user input. The columns with light blue column headings contain formulas that are automatically copied for all new entries that are added to the table. Entries can be added to the table by simply entering a travel date in the first empty cell in column A - the table will be extended automatically to include the new entry."]
[]
["The Logbook sheet contains the following user input columns (columns with yellow column headings):"]
["Travel Date - enter the date of the trip in this column. All dates must be entered in accordance with the regional date settings that are specified in your System Control Panel."]
{"$rows_left_out":122}
{"sheet":"Logbook","index":3,"n_rows":215,"n_cols":18,"rows_kept":215,"cut":false,"hidden":true,"merged":[]}
["Vehicle Logbook Entries"]
["© www.excel-skills.com",null,null,null,null,null,null,null,null,null,null,null,null,{"$f":"SUBTOTAL(109,LogDistance)","v":17910},{"$f":"SUBTOTAL(109,LogCost)","v":40134}]
["Travel Date","Travel Time","Form Number","Vehicle Reg Number","Odometer Opening","Odometer Closing","Travel Type","Client Code","From","To","Purpose","Rate","Driver","Total Trip Distance","Total Trip Charges","Standard Distance","Distance Variance","Error Code"]
["2020-01-06","08:00:00","TL0001","EXS111WC",50415,50515,"Business","ENE01","Work","Client","Client Consultation",3,"A Smith",{"$f":"F4-E4","v":100},{"$f":"N4*L4","v":300},{"$f":"IF(ISNA(VLOOKUP($H4,ClientAll,COLUMN(Clients!$C$8),0))=TRUE,0,VLOOKUP($H4,ClientAll,COLUMN(Clients!$C$8),0))","v":100},{"$f":"IF(G4=\"Private\",0,N4-P4)","v":0},{"$f":"IF(ISNA(VLOOKUP($D4,VehicleID,COLUMN(Vehicles!$A$8),0))=TRUE,\"E1\",IF(ISNA(VLOOKUP($H4,ClientID,COLUMN(Vehicles!$A$8),0))=TRUE,\"E2\",IF(AND($G4<>\"Business\",$H4<>\"XXX01\"),\"E3\",IF(AND($G4=\"Business\",$H4=\"XXX01\"),\"E4\",\"-\"))))","v":"-"}]
["2020-01-06","08:00:00","TL0002","EXS222WC",33215,33365,"Business","PTY01","Work","Client","Client Consultation",3,"C Wilson",150,450,{"$f":"IF(ISNA(VLOOKUP($H5,ClientAll,COLUMN(Clients!$C$8),0))=TRUE,0,VLOOKUP($H5,ClientAll,COLUMN(Clients!$C$8),0))","v":150},0,{"$f":"IF(ISNA(VLOOKUP($D5,VehicleID,COLUMN(Vehicles!$A$8),0))=TRUE,\"E1\",IF(ISNA(VLOOKUP($H5,ClientID,COLUMN(Vehicles!$A$8),0))=TRUE,\"E2\",IF(AND($G5<>\"Business\",$H5<>\"XXX01\"),\"E3\",IF(AND($G5=\"Business\",$H5=\"XXX01\"),\"E4\",\"-\"))))","v":"-"}]
["2020-01-06",null,"TL0001","EXS111WC",50515,50545,"Private","XXX01","Various Private","Various Private","Private Travel",0,"A Smith",30,0,{"$f":"IF(ISNA(VLOOKUP($H6,ClientAll,COLUMN(Clients!$C$8),0))=TRUE,0,VLOOKUP($H6,ClientAll,COLUMN(Clients!$C$8),0))","v":0},0,{"$f":"IF(ISNA(VLOOKUP($D6,VehicleID,COLUMN(Vehicles!$A$8),0))=TRUE,\"E1\",IF(ISNA(VLOOKUP($H6,ClientID,COLUMN(Vehicles!$A$8),0))=TRUE,\"E2\",IF(AND($G6<>\"Business\",$H6<>\"XXX01\"),\"E3\",IF(AND($G6=\"Business\",$H6=\"XXX01\"),\"E4\",\"-\"))))","v":"-"}]
["2020-01-06",null,"TL0002","EXS222WC",33365,33375,"Private","XXX01","Various Private","Various Private","Private Travel",0,"C Wilson",10,0,{"$f":"IF(ISNA(VLOOKUP($H7,ClientAll,COLUMN(Clients!$C$8),0))=TRUE,0,VLOOKUP($H7,ClientAll,COLUMN(Clients!$C$8),0))","v":0},0,{"$f":"IF(ISNA(VLOOKUP($D7,VehicleID,COLUMN(Vehicles!$A$8),0))=TRUE,\"E1\",IF(ISNA(VLOOKUP($H7,ClientID,COLUMN(Vehicles!$A$8),0))=TRUE,\"E2\",IF(AND($G7<>\"Business\",$H7<>\"XXX01\"),\"E3\",IF(AND($G7=\"Business\",$H7=\"XXX01\"),\"E4\",\"-\"))))","v":"-"}]
["2020-01-07","08:00:00","TL0001","EXS111WC",50545,50645,"Business","ENE01","Work","Client","Client Consultation",3,"A Smith",100,300,{"$f":"IF(ISNA(VLOOKUP($H8,ClientAll,COLUMN(Clients!$C$8),0))=TRUE,0,VLOOKUP($H8,ClientAll,COLUMN(Clients!$C$8),0))","v":100},0,{"$f":"IF(ISNA(VLOOKUP($D8,VehicleID,COLUMN(Vehicles!$A$8),0))=TRUE,\"E1\",IF(ISNA(VLOOKUP($H8,ClientID,COLUMN(Vehicles!$A$8),0))=TRUE,\"E2\",IF(AND($G8<>\"Business\",$H8<>\"XXX01\"),\"E3\",IF(AND($G8=\"Business\",$H8=\"XXX01\"),\"E4\",\"-\"))))","v":"-"}]
["2020-01-07","08:30:00","TL0002","EXS222WC",33375,33525,"Business","PTY01","Work","Client","Client Consultation",3,"C Wilson",150,450,{"$f":"IF(ISNA(VLOOKUP($H9,ClientAll,COLUMN(Clients!$C$8),0))=TRUE,0,VLOOKUP($H9,ClientAll,COLUMN(Clients!$C$8),0))","v":150},0,{"$f":"IF(ISNA(VLOOKUP($D9,VehicleID,COLUMN(Vehicles!$A$8),0))=TRUE,\"E1\",IF(ISNA(VLOOKUP($H9,ClientID,COLUMN(Vehicles!$A$8),0))=TRUE,\"E2\",IF(AND($G9<>\"Business\",$H9<>\"XXX01\"),\"E3\",IF(AND($G9=\"Business\",$H9=\"XXX01\"),\"E4\",\"-\"))))","v":"-"}]
["2020-01-07",null,"TL0001","EXS111WC",50645,50795,"Private","XXX01","Various Private","Various Private","Private Travel",0,"A Smith",150,0,{"$f":"IF(ISNA(VLOOKUP($H10,ClientAll,COLUMN(Clients!$C$8),0))=TRUE,0,VLOOKUP($H10,ClientAll,COLUMN(Clients!$C$8),0))","v":0},0,{"$f":"IF(ISNA(VLOOKUP($D10,VehicleID,COLUMN(Vehicles!$A$8),0))=TRUE,\"E1\",IF(ISNA(VLOOKUP($H10,ClientID,COLUMN(Vehicles!$A$8),0))=TRUE,\"E2\",IF(AND($G10<>\"Business\",$H10<>\"XXX01\"),\"E3\",IF(AND($G10=\"Business\",$H10=\"XXX01\"),\"E4\",\"-\"))))","v":"-"}]
["2020-01-07",null,"TL0002","EXS222WC",33525,33525,"Private","XXX01","Various Private","Various Private","Private Travel",0,"C Wilson",0,0,{"$f":"IF(ISNA(VLOOKUP($H11,ClientAll,COLUMN(Clients!$C$8),0))=TRUE,0,VLOOKUP($H11,ClientAll,COLUMN(Clients!$C$8),0))","v":0},0,{"$f":"IF(ISNA(VLOOKUP($D11,VehicleID,COLUMN(Vehicles!$A$8),0))=TRUE,\"E1\",IF(ISNA(VLOOKUP($H11,ClientID,COLUMN(Vehicles!$A$8),0))=TRUE,\"E2\",IF(AND($G11<>\"Business\",$H11<>\"XXX01\"),\"E3\",IF(AND($G11=\"Business\",$H11=\"XXX01\"),\"E4\",\"-\"))))","v":"-"}]
["2020-01-08","08:00:00","TL0001","EXS111WC",50795,50895,"Business","ENE01","Work","Client","Client Consultation",3,"A Smith",100,300,{"$f":"IF(ISNA(VLOOKUP($H12,ClientAll,COLUMN(Clients!$C$8),0))=TRUE,0,VLOOKUP($H12,ClientAll,COLUMN(Clients!$C$8),0))","v":100},0,{"$f":"IF(ISNA(VLOOKUP($D12,VehicleID,COLUMN(Vehicles!$A$8),0))=TRUE,\"E1\",IF(ISNA(VLOOKUP($H12,ClientID,COLUMN(Vehicles!$A$8),0))=TRUE,\"E2\",IF(AND($G12<>\"Business\",$H12<>\"XXX01\"),\"E3\",IF(AND($G12=\"Business\",$H12=\"XXX01\"),\"E4\",\"-\"))))","v":"-"}]
["2020-01-08","08:00:00","TL0002","EXS222WC",33525,33675,"Business","PTY01","Work","Client","Client Consultation",3,"C Wilson",150,450,{"$f":"IF(ISNA(VLOOKUP($H13,ClientAll,COLUMN(Clients!$C$8),0))=TRUE,0,VLOOKUP($H13,ClientAll,COLUMN(Clients!$C$8),0))","v":150},0,{"$f":"IF(ISNA(VLOOKUP($D13,VehicleID,COLUMN(Vehicles!$A$8),0))=TRUE,\"E1\",IF(ISNA(VLOOKUP($H13,ClientID,COLUMN(Vehicles!$A$8),0))=TRUE,\"E2\",IF(AND($G13<>\"Business\",$H13<>\"XXX01\"),\"E3\",IF(AND($G13=\"Business\",$H13=\"XXX01\"),\"E4\",\"-\"))))","v":"-"}]
["2020-01-08",null,"TL0001","EXS111WC",50895,50915,"Private","XXX01","Various Private","Various Private","Private Travel",0,"A Smith",20,0,{"$f":"IF(ISNA(VLOOKUP($H14,ClientAll,COLUMN(Clients!$C$8),0))=TRUE,0,VLOOKUP($H14,ClientAll,COLUMN(Clients!$C$8),0))","v":0},0,{"$f":"IF(ISNA(VLOOKUP($D14,VehicleID,COLUMN(Vehicles!$A$8),0))=TRUE,\"E1\",IF(ISNA(VLOOKUP($H14,ClientID,COLUMN(Vehicles!$A$8),0))=TRUE,\"E2\",IF(AND($G14<>\"Business\",$H14<>\"XXX01\"),\"E3\",IF(AND($G14=\"Business\",$H14=\"XXX01\"),\"E4\",\"-\"))))","v":"-"}]
["2020-01-08",null,"TL0002","EXS222WC",33675,33700,"Private","XXX01","Various Private","Various Private","Private Travel",0,"C Wilson",25,0,{"$f":"IF(ISNA(VLOOKUP($H15,ClientAll,COLUMN(Clients!$C$8),0))=TRUE,0,VLOOKUP($H15,ClientAll,COLUMN(Clients!$C$8),0))","v":0},0,{"$f":"IF(ISNA(VLOOKUP($D15,VehicleID,COLUMN(Vehicles!$A$8),0))=TRUE,\"E1\",IF(ISNA(VLOOKUP($H15,ClientID,COLUMN(Vehicles!$A$8),0))=TRUE,\"E2\",IF(AND($G15<>\"Business\",$H15<>\"XXX01\"),\"E3\",IF(AND($G15=\"Business\",$H15=\"XXX01\"),\"E4\",\"-\"))))","v":"-"}]
["2020-01-09","08:00:00","TL0001","EXS111WC",50915,50975,"Business","CCS01","Work","Client","Client Consultation",3,"A Smith",60,180,{"$f":"IF(ISNA(VLOOKUP($H16,ClientAll,COLUMN(Clients!$C$8),0))=TRUE,0,VLOOKUP($H16,ClientAll,COLUMN(Clients!$C$8),0))","v":60},0,{"$f":"IF(ISNA(VLOOKUP($D16,VehicleID,COLUMN(Vehicles!$A$8),0))=TRUE,\"E1\",IF(ISNA(VLOOKUP($H16,ClientID,COLUMN(Vehicles!$A$8),0))=TRUE,\"E2\",IF(AND($G16<>\"Business\",$H16<>\"XXX01\"),\"E3\",IF(AND($G16=\"Business\",$H16=\"XXX01\"),\"E4\",\"-\"))))","v":"-"}]
["2020-01-09","08:00:00","TL0002","EXS222WC",33700,33850,"Business","PTY01","Work","Client","Client Consultation",3,"C Wilson",150,450,{"$f":"IF(ISNA(VLOOKUP($H17,ClientAll,COLUMN(Clients!$C$8),0))=TRUE,0,VLOOKUP($H17,ClientAll,COLUMN(Clients!$C$8),0))","v":150},0,{"$f":"IF(ISNA(VLOOKUP($D17,VehicleID,COLUMN(Vehicles!$A$8),0))=TRUE,\"E1\",IF(ISNA(VLOOKUP($H17,ClientID,COLUMN(Vehicles!$A$8),0))=TRUE,\"E2\",IF(AND($G17<>\"Business\",$H17<>\"XXX01\"),\"E3\",IF(AND($G17=\"Business\",$H17=\"XXX01\"),\"E4\",\"-\"))))","v":"-"}]
["2020-01-10",null,"TL0001","EXS111WC",50975,51010,"Private","XXX01","Various Private","Various Private","Private Travel",0,"A Smith",35,0,{"$f":"IF(ISNA(VLOOKUP($H18,ClientAll,COLUMN(Clients!$C$8),0))=TRUE,0,VLOOKUP($H18,ClientAll,COLUMN(Clients!$C$8),0))","v":0},0,{"$f":"IF(ISNA(VLOOKUP($D18,VehicleID,COLUMN(Vehicles!$A$8),0))=TRUE,\"E1\",IF(ISNA(VLOOKUP($H18,ClientID,COLUMN(Vehicles!$A$8),0))=TRUE,\"E2\",IF(AND($G18<>\"Business\",$H18<>\"XXX01\"),\"E3\",IF(AND($G18=\"Business\",$H18=\"XXX01\"),\"E4\",\"-\"))))","v":"-"}]
["2020-01-10",null,"TL0002","EXS222WC",33850,33886,"Private","XXX01","Various Private","Various Private","Private Travel",0,"C Wilson",36,0,{"$f":"IF(ISNA(VLOOKUP($H19,ClientAll,COLUMN(Clients!$C$8),0))=TRUE,0,VLOOKUP($H19,ClientAll,COLUMN(Clients!$C$8),0))","v":0},0,{"$f":"IF(ISNA(VLOOKUP($D19,VehicleID,COLUMN(Vehicles!$A$8),0))=TRUE,\"E1\",IF(ISNA(VLOOKUP($H19,ClientID,COLUMN(Vehicles!$A$8),0))=TRUE,\"E2\",IF(AND($G19<>\"Business\",$H19<>\"XXX01\"),\"E3\",IF(AND($G19=\"Business\",$H19=\"XXX01\"),\"E4\",\"-\"))))","v":"-"}]
["2020-01-13","08:00:00","TL0001","EXS111WC",51010,51110,"Business","ENE01","Work","Client","Client Consultation",3,"A Smith",100,300,{"$f":"IF(ISNA(VLOOKUP($H20,ClientAll,COLUMN(Clients!$C$8),0))=TRUE,0,VLOOKUP($H20,ClientAll,COLUMN(Clients!$C$8),0))","v":100},0,{"$f":"IF(ISNA(VLOOKUP($D20,VehicleID,COLUMN(Vehicles!$A$8),0))=TRUE,\"E1\",IF(ISNA(VLOOKUP($H20,ClientID,COLUMN(Vehicles!$A$8),0))=TRUE,\"E2\",IF(AND($G20<>\"Business\",$H20<>\"XXX01\"),\"E3\",IF(AND($G20=\"Business\",$H20=\"XXX01\"),\"E4\",\"-\"))))","v":"-"}]
{"$rows_left_out":196}
{"sheet":"Clients","index":4,"n_rows":28,"n_cols":15,"rows_kept":28,"cut":false,"hidden":true,"merged":[[6,12,6,14],[6,9,6,11],[3,11,3,13]]}
["Client Charge Sheet"]
["© www.excel-skills.com"]
[null,"Total Business Trip Mileage",{"$f":"IF($K$5=\"All\",SUMPRODUCT((LogDate>=$G$5)*(LogDate<=$I$5)*(LogType=\"Business\")*(LogDistance)),SUMPRODUCT((LogDate>=$G$5)*(LogDate<=$I$5)*(LogVehicle=$K$5)*(LogType=\"Business\")*(LogDistance)))","v":14308},{"$f":"IF(C$5=0,0,C3/C$5)","v":0.79888330541596875},null,"Filter Selections:"]
[null,"Total Private Trip Mileage",{"$f":"IF($K$5=\"All\",SUMPRODUCT((LogDate>=$G$5)*(LogDate<=$I$5)*(LogType<>\"Business\")*(LogDistance)),SUMPRODUCT((LogDate>=$G$5)*(LogDate<=$I$5)*(LogVehicle=$K$5)*(LogType<>\"Business\")*(LogDistance)))","v":3602},{"$f":"IF(C$5=0,0,C4/C$5)","v":0.20111669458403128},null,"From Date:","2020-01-01","To Date:","2020-03-31","Vehicle:",null,{"$f":"IF($K$5=\"All\",\"All vehicles\",VLOOKUP($K$4,VehicleAll,COLUMN(Vehicles!$B$8),0))","v":"All vehicles"}]
[null,"Total All Trip Mileage",{"$f":"SUM(C3:C4)","v":17910},null,null,null,{"$f":"IF(ISBLANK($G4)=TRUE,DATE(YEAR(TODAY())-5,1,1),$G4)","v":"2020-01-01"},null,{"$f":"IF(ISBLANK($I4)=TRUE,DATE(YEAR(TODAY()),MONTH(TODAY())+1,0),$I4)","v":"2020-03-31"},null,{"$f":"IF(ISBLANK($K4)=TRUE,\"All\",$K4)","v":"All"}]
[]
[null,null,null,{"$f":"SUBTOTAL(109,OFFSET(D$8,1,0,ClientCount,1))","v":17910},{"$f":"SUBTOTAL(109,OFFSET(E$8,1,0,ClientCount,1))","v":40134},null,null,null,null,"Total Mileage",null,null,"Number of Trips"]
["Client Code","Client Name","Travel Distance","Total \nMileage","Total \nCharges","Rate \nCharged","Number of Trips","Average Distance","Distance Variance",{"$f":"DATE(YEAR($I$5),MONTH($I$5)+1,0)","v":"2020-03-31"},{"$f":"DATE(YEAR(J8),MONTH(J8),0)","v":"2020-02-29"},{"$f":"DATE(YEAR(J8),MONTH(J8)-1,0)","v":"2020-01-31"},{"$f":"DATE(YEAR($I$5),MONTH($I$5)+1,0)","v":"2020-03-31"},{"$f":"DATE(YEAR(M8),MONTH(M8),0)","v":"2020-02-29"},{"$f":"DATE(YEAR(M8),MONTH(M8)-1,0)","v":"2020-01-31"}]
["ABC01","ABC Limited",75,{"$f":"IF($K$5=\"All\",SUMPRODUCT((LogDate>=$G$5)*(LogDate<=$I$5)*(LogClient=$A9)*(LogDistance)),SUMPRODUCT((LogDate>=$G$5)*(LogDate<=$I$5)*(LogVehicle=$K$5)*(LogClient=$A9)*(LogDistance)))","v":750},{"$f":"IF($K$5=\"All\",SUMPRODUCT((LogDate>=$G$5)*(LogDate<=$I$5)*(LogClient=$A9)*(LogCost)),SUMPRODUCT((LogDate>=$G$5)*(LogDate<=$I$5)*(LogVehicle=$K$5)*(LogClient=$A9)*(LogCost)))","v":2250},{"$f":"IF(D9=0,0,E9/D9)","v":3},{"$f":"IF($K$5=\"All\",SUMPRODUCT((LogDate>=$G$5)*(LogDate<=$I$5)*(LogClient=$A9)*(1)),SUMPRODUCT((LogDate>=$G$5)*(LogDate<=$I$5)*(LogVehicle=$K$5)*(LogClient=$A9)*(1)))","v":10},{"$f":"IF(G9=0,0,D9/G9)","v":75},{"$f":"IF(OR(H9=0,C9=0),0,H9-C9)","v":0},{"$f":"IF($K$5=\"All\",SUMPRODUCT((LogDate>=DATE(YEAR(J$8),MONTH(J$8),1))*(LogDate<=J$8)*(LogClient=$A9)*(LogDistance)),SUMPRODUCT((LogDate>=DATE(YEAR(J$8),MONTH(J$8),1))*(LogDate<=J$8)*(LogVehicle=$K$5)*(LogClient=$A9)*(LogDistance)))","v":225},525,0,{"$f":"IF($K$5=\"All\",SUMPRODUCT((LogDate>=DATE(YEAR(M$8),MONTH(M$8),1))*(LogDate<=M$8)*(LogClient=$A9)*(1)),SUMPRODUCT((LogDate>=DATE(YEAR(M$8),MONTH(M$8),1))*(LogDate<=M$8)*(LogVehicle=$K$5)*(LogClient=$A9)*(1)))","v":3},7,0]
["CCS01","CC Supplies",60,120,360,{"$f":"IF(D10=0,0,E10/D10)","v":3},2,{"$f":"IF(G10=0,0,D10/G10)","v":60},{"$f":"IF(OR(H10=0,C10=0),0,H10-C10)","v":0},0,60,60,0,1,1]
["DFM01","DF Manufacturing",30,90,270,3,3,30,0,30,60,0,1,2,0]
["DIG01","Digicom",88,616,1848,3,7,88,0,88,88,440,1,1,5]
["ECE01","EC Estate Agents",45,45,135,3,1,45,0,45,0,0,1,0,0]
["ENE01","Energy Incorporated",100,2400,7200,3,24,100,0,600,500,1300,6,5,13]
["FSF01","FS Financial Services",75,525,1575,3,7,75,0,450,75,0,6,1,0]
["GPA01","GP Accountants",120,0,0,0,0,0,0,0,0,0,0,0,0]
["INS01","Insurance Solutions",280,560,1400,2.5,2,280,0,560,0,0,2,0,0]
["ITS01","IT Solutions",415,1660,4150,2.5,4,415,0,0,0,1660,0,0,4]
["KZB01","KZN Bonds",420,3360,8400,2.5,8,420,0,0,3360,0,0,8,0]
["PTY01","PTY Consultants",150,2700,8100,3,18,150,0,750,450,1500,5,3,10]
{"$rows_left_out":9}
{"sheet":"Vehicles","index":5,"n_rows":11,"n_cols":17,"rows_kept":11,"cut":false,"hidden":true,"merged":[[3,11,3,13],[6,8,6,10],[6,11,6,13],[6,14,6,16]]}
["Vehicle Charge Sheet"]
["© www.excel-skills.com"]
[null,"Total Business Trip Mileage",{"$f":"IF($K$5=\"All\",SUMPRODUCT((LogDate>=$G$5)*(LogDate<=$I$5)*(LogType=\"Business\")*(LogDistance)),SUMPRODUCT((LogDate>=$G$5)*(LogDate<=$I$5)*(LogVehicle=$K$5)*(LogType=\"Business\")*(LogDistance)))","v":14308},{"$f":"IF(C$5=0,0,C3/C$5)","v":0.79888330541596875},null,"Filter Selections:"]
[null,"Total Private Trip Mileage",{"$f":"IF($K$5=\"All\",SUMPRODUCT((LogDate>=$G$5)*(LogDate<=$I$5)*(LogType<>\"Business\")*(LogDistance)),SUMPRODUCT((LogDate>=$G$5)*(LogDate<=$I$5)*(LogVehicle=$K$5)*(LogType<>\"Business\")*(LogDistance)))","v":3602},{"$f":"IF(C$5=0,0,C4/C$5)","v":0.20111669458403128},null,"From Date:","2020-01-01","To Date:","2020-03-31","Client:",null,{"$f":"IF($K$5=\"All\",\"All clients\",VLOOKUP($K$4,ClientAll,COLUMN(Clients!$B$8),0))","v":"All clients"}]
[null,"Total All Trip Mileage",{"$f":"SUM(C3:C4)","v":17910},null,null,null,{"$f":"IF(ISBLANK($G4)=TRUE,DATE(YEAR(TODAY())-5,1,1),$G4)","v":"2020-01-01"},null,{"$f":"IF(ISBLANK($I4)=TRUE,DATE(YEAR(TODAY()),MONTH(TODAY())+1,0),$I4)","v":"2020-03-31"},null,{"$f":"IF(ISBLANK($K4)=TRUE,\"All\",$K4)","v":"All"}]
[]
[null,null,{"$f":"SUBTOTAL(109,OFFSET(C$8,1,0,ClientCount,1))","v":17910},{"$f":"SUBTOTAL(109,OFFSET(D$8,1,0,ClientCount,1))","v":40134},null,null,null,null,"Total Mileage",null,null,"Business %",null,null,"Number of Business Trips"]
["Vehicle Reg Number","Vehicle Description","Total Mileage","Total Charges","Business Mileage","Business Travel %","Rate Charged","Business \nTrips",{"$f":"DATE(YEAR($I$5),MONTH($I$5)+1,0)","v":"2020-03-31"},{"$f":"DATE(YEAR(I8),MONTH(I8),0)","v":"2020-02-29"},{"$f":"DATE(YEAR(I8),MONTH(I8)-1,0)","v":"2020-01-31"},{"$f":"DATE(YEAR($I$5),MONTH($I$5)+1,0)","v":"2020-03-31"},{"$f":"DATE(YEAR(L8),MONTH(L8),0)","v":"2020-02-29"},{"$f":"DATE(YEAR(L8),MONTH(L8)-1,0)","v":"2020-01-31"},{"$f":"DATE(YEAR($I$5),MONTH($I$5)+1,0)","v":"2020-03-31"},{"$f":"DATE(YEAR(O8),MONTH(O8),0)","v":"2020-02-29"},{"$f":"DATE(YEAR(O8),MONTH(O8)-1,0)","v":"2020-01-31"}]
["EXS111WC","BMW - A Smith",{"$f":"IF($K$5=\"All\",SUMPRODUCT((LogDate>=$G$5)*(LogDate<=$I$5)*(LogVehicle=$A9)*(LogDistance)),SUMPRODUCT((LogDate>=$G$5)*(LogDate<=$I$5)*(LogClient=$K$5)*(LogVehicle=$A9)*(LogDistance)))","v":6709},{"$f":"IF($K$5=\"All\",SUMPRODUCT((LogDate>=$G$5)*(LogDate<=$I$5)*(LogVehicle=$A9)*(LogCost)),SUMPRODUCT((LogDate>=$G$5)*(LogDate<=$I$5)*(LogClient=$K$5)*(LogVehicle=$A9)*(LogCost)))","v":12513},{"$f":"IF($K$5=\"All\",SUMPRODUCT((LogDate>=$G$5)*(LogDate<=$I$5)*(LogType=\"Business\")*(LogVehicle=$A9)*(LogDistance)),SUMPRODUCT((LogDate>=$G$5)*(LogDate<=$I$5)*(LogType=\"Business\")*(LogClient=$K$5)*(LogVehicle=$A9)*(LogDistance)))","v":4171},{"$f":"IF(C9=0,0,E9/C9)","v":0.62170219108660008},{"$f":"IF(E9=0,0,D9/E9)","v":3},{"$f":"IF($K$5=\"All\",SUMPRODUCT((LogDate>=$G$5)*(LogDate<=$I$5)*(LogType=\"Business\")*(LogVehicle=$A9)*(1)),SUMPRODUCT((LogDate>=$G$5)*(LogDate<=$I$5)*(LogType=\"Business\")*(LogClient=$K$5)*(LogVehicle=$A9)*(1)))","v":50},{"$f":"IF($K$5=\"All\",SUMPRODUCT((LogDate>=DATE(YEAR(I$8),MONTH(I$8),1))*(LogDate<=I$8)*(LogVehicle=$A9)*(LogDistance)),SUMPRODUCT((LogDate>=DATE(YEAR(I$8),MONTH(I$8),1))*(LogDate<=I$8)*(LogClient=$K$5)*(LogVehicle=$A9)*(LogDistance)))","v":1873},1859,2977,{"$f":"IF($K$5=\"All\",IF(SUMPRODUCT((LogDate>=DATE(YEAR(I$8),MONTH(I$8),1))*(LogDate<=I$8)*(LogVehicle=$A9)*(LogDistance))=0,0,SUMPRODUCT((LogDate>=DATE(YEAR(I$8),MONTH(I$8),1))*(LogDate<=I$8)*(LogType=\"Business\")*(LogVehicle=$A9)*(LogDistance))/SUMPRODUCT((LogDate>=DATE(YEAR(I$8),MONTH(I$8),1))*(LogDate<=I$8)*(LogVehicle=$A9)*(LogDistance))),IF(SUMPRODUCT((LogDate>=DATE(YEAR(I$8),MONTH(I$8),1))*(LogDate<=I$8)*(LogClient=$K$5)*(LogVehicle=$A9)*(LogDistance))=0,0,SUMPRODUCT((LogDate>=DATE(YEAR(I$8),MONTH(I$8),1))*(LogDate<=I$8)*(LogType=\"Business\")*(LogClient=$K$5)*(LogVehicle=$A9)*(LogDistance))/SUMPRODUCT((LogDate>=DATE(YEAR(I$8),MONTH(I$8),1))*(LogDate<=I$8)*(LogClient=$K$5)*(LogVehicle=$A9)*(LogDistance))))","v":0.72770955686065131},0.6498117267348037,0.53745381256298286,{"$f":"IF($K$5=\"All\",SUMPRODUCT((LogDate>=DATE(YEAR(I$8),MONTH(I$8),1))*(LogDate<=I$8)*(LogType=\"Business\")*(LogVehicle=$A9)*(1)),SUMPRODUCT((LogDate>=DATE(YEAR(I$8),MONTH(I$8),1))*(LogDate<=I$8)*(LogType=\"Business\")*(LogClient=$K$5)*(LogVehicle=$A9)*(1)))","v":17},16,17]
["EXS222WC","Toyota - C Wilson",{"$f":"IF($K$5=\"All\",SUMPRODUCT((LogDate>=$G$5)*(LogDate<=$I$5)*(LogVehicle=$A10)*(LogDistance)),SUMPRODUCT((LogDate>=$G$5)*(LogDate<=$I$5)*(LogClient=$K$5)*(LogVehicle=$A10)*(LogDistance)))","v":5621},{"$f":"IF($K$5=\"All\",SUMPRODUCT((LogDate>=$G$5)*(LogDate<=$I$5)*(LogVehicle=$A10)*(LogCost)),SUMPRODUCT((LogDate>=$G$5)*(LogDate<=$I$5)*(LogClient=$K$5)*(LogVehicle=$A10)*(LogCost)))","v":13671},{"$f":"IF($K$5=\"All\",SUMPRODUCT((LogDate>=$G$5)*(LogDate<=$I$5)*(LogType=\"Business\")*(LogVehicle=$A10)*(LogDistance)),SUMPRODUCT((LogDate>=$G$5)*(LogDate<=$I$5)*(LogType=\"Business\")*(LogClient=$K$5)*(LogVehicle=$A10)*(LogDistance)))","v":4557},{"$f":"IF(C10=0,0,E10/C10)","v":0.8107098381070984},{"$f":"IF(E10=0,0,D10/E10)","v":3},{"$f":"IF($K$5=\"All\",SUMPRODUCT((LogDate>=$G$5)*(LogDate<=$I$5)*(LogType=\"Business\")*(LogVehicle=$A10)*(1)),SUMPRODUCT((LogDate>=$G$5)*(LogDate<=$I$5)*(LogType=\"Business\")*(LogClient=$K$5)*(LogVehicle=$A10)*(1)))","v":50},2059,1341,2221,0.84992714910150557,0.71364653243847875,0.8329581269698334,17,16,17]
["EXS333WC","Ford - Pool Car",{"$f":"IF($K$5=\"All\",SUMPRODUCT((LogDate>=$G$5)*(LogDate<=$I$5)*(LogVehicle=$A11)*(LogDistance)),SUMPRODUCT((LogDate>=$G$5)*(LogDate<=$I$5)*(LogClient=$K$5)*(LogVehicle=$A11)*(LogDistance)))","v":5580},{"$f":"IF($K$5=\"All\",SUMPRODUCT((LogDate>=$G$5)*(LogDate<=$I$5)*(LogVehicle=$A11)*(LogCost)),SUMPRODUCT((LogDate>=$G$5)*(LogDate<=$I$5)*(LogClient=$K$5)*(LogVehicle=$A11)*(LogCost)))","v":13950},{"$f":"IF($K$5=\"All\",SUMPRODUCT((LogDate>=$G$5)*(LogDate<=$I$5)*(LogType=\"Business\")*(LogVehicle=$A11)*(LogDistance)),SUMPRODUCT((LogDate>=$G$5)*(LogDate<=$I$5)*(LogType=\"Business\")*(LogClient=$K$5)*(LogVehicle=$A11)*(LogDistance)))","v":5580},{"$f":"IF(C11=0,0,E11/C11)","v":1},{"$f":"IF(E11=0,0,D11/E11)","v":2.5},{"$f":"IF($K$5=\"All\",SUMPRODUCT((LogDate>=$G$5)*(LogDate<=$I$5)*(LogType=\"Business\")*(LogVehicle=$A11)*(1)),SUMPRODUCT((LogDate>=$G$5)*(LogDate<=$I$5)*(LogType=\"Business\")*(LogClient=$K$5)*(LogVehicle=$A11)*(1)))","v":14},560,3360,1660,1,1,1,2,8,4]

{"sheet":"Form","index":6,"n_rows":6,"n_cols":12,"rows_kept":6,"cut":false,"hidden":true,"merged":[]}
[]
[null,"Vehicle Logbook Form",null,null,null,null,null,null,null,"Vehicle Registration Number:"]
[null,"© www.excel-skills.com",null,null,null,null,null,null,null,null,"Form Number:","TL00001"]
[]
[null,"Travel Date","Travel Time","Odometer Opening","Odometer Closing","Travel Type","Client Code","From","To","Purpose","Driver","Signature"]
[null,{"$f":"TODAY()","v":"2021-01-27"},"08:00:00",31520,31620,"Business","AAA001","Work","Client","Client Consulation","A Smith","XXXXXXXXXXXXXXXXXXXXXXX"]