{"text_format":"1","workbook":"xlsx","n_sheets":9,"sheets":["Info","Trial","Instructions","Setup","Classes","TB","FinInfo","AFS","TBImport"],"not_rendered":{"charts":0,"images":2,"macros":0,"external_links":0,"defined_names":30,"comments":0,"pivot_tables":0},"unopened":[],"bounds":{"document_bytes":16777216,"sheet_cells":100000,"rows_first":2000,"rows_last":500,"rows_between":2000,"halvings":0,"cell_chars":16384,"cell_head_chars":4096},"cells_cut":0,"cells_raw":0,"read":"whole","date_system":"1900"}

{"sheet":"Info","index":0,"n_rows":0,"n_cols":0,"rows_kept":0,"cut":false,"hidden":false,"merged":[]}

{"sheet":"Trial","index":1,"n_rows":0,"n_cols":0,"rows_kept":0,"cut":false,"hidden":false,"merged":[]}

{"sheet":"Instructions","index":2,"n_rows":575,"n_cols":1,"rows_kept":575,"cut":false,"hidden":false,"merged":[]}
["Excel Skills | Financial Statements Template - Non-Profit Organization"]
["Instructions"]
["www.excel-skills.com"]
[]
["This template enables users to compile comprehensive non-profit organization (NPO) financial statements in accordance with International Financial Reporting Standards for Small & Medium Enterprises (IFRS for SME's) based on any trial balance regardless of the account structure. The financial statements are compiled by linking each account in the trial balance to a pre-defined financial statement reporting class and all the amounts on the financial statements are automatically calculated based on the linked reporting classes. The template also facilitates including financial information which is not derived from a trial balance and can easily be rolled forward or back by simply changing the reporting year in a single input cell."]
[]
["Disclaimer: The aim of this template is to assist users in compiling a standard set of annual financial statements and we can therefore not guarantee that all the annual financial statement disclosures which are required for the particular business will be accommodated in the template design. The user therefore remains solely responsible for ensuring the accuracy and completeness of financial statement disclosure."]
[]
["Note: This template has been designed for non-profit organizations - we also provide separate versions of the template for sole practitioners, trusts, companies and closed corporations."]
[]
["The template includes the following sheets:"]
["Setup - enter your business name, add a currency symbol and specify the financial year-end month and the reporting year. The reporting year that is specified determines which annual periods will be included in the current and comparative periods on the financial statements."]
["Classes - this sheet contains all the pre-defined financial statement reporting classes which should be used to link the accounts on the trial balance to the calculations on the financial statements. The class descriptions included on this sheet are displayed on the financial statements and the sheet also includes error checking in the columns with light blue column headings which highlights errors in the linking of the reporting classes."]
["TB - a complete trial balance for each annual period should be included on this sheet and each account in the trial balance should be linked to the appropriate financial statement reporting class by entering or copying the class code into column B. The amounts that are included on the financial statements are automatically updated based on the classes specified on this sheet."]
["FinInfo - this sheet contains financial statement information which is incorporated in the financial statements but not derived from the trial balance. Users are therefore required to enter the appropriate values for each annual period which is included in the template. The values specified on this sheet are automatically included on the financial statements based on the pre-defined code which included in column B."]
["AFS - this sheet includes a complete set of financial statements which is automatically compiled based on the reporting year selected on the Setup sheet, the account balances included on the TB sheet and the financial information included on the FinInfo sheet. The reporting class codes which are used to populate each line item are included in column A."]
["TBImport - the calculations on this sheet enables users to review the sequence of trial balance accounts before copying the account balances to the TB sheet. The sequence of accounts can be amended until no errors are reflected and the calculations in column E round all trial balance amounts to the nearest integer value thereby ensuring that all the totals on the annual financial statements are accurate."]
[]
["In order to start using the template, you basically need to complete the following steps:"]
["■ Change the default settings in the cells with yellow cell backgrounds on the Setup sheet."]
{"$rows_left_out":556}
{"sheet":"Setup","index":3,"n_rows":29,"n_cols":6,"rows_kept":29,"cut":false,"hidden":false,"merged":[[11,1,11,2],[3,1,3,3]]}
[{"$f":"IF(ISBLANK($B$4),\"Example (Pty) Limited\",$B$4)","v":"Example NPC"}]
["Set-up"]
["© www.excel-skills.com"]
["Business Name","Example NPC"]
[]
["Currency Symbol","R",{"$f":"IF(ISBLANK($B$6)=TRUE,\"CU\",$B$6)","v":"R"}]
[]
["Year End Month","2018-02-01"]
[]
["Reporting Year",2024]
[null,null,null,"First Day","Last Day","Last Day Text"]
["Year End Reporting Date",{"$f":"IF(ISBLANK($B$10),IF(ISBLANK($B$8),DATE(YEAR(TODAY()),MONTH(TODAY())+1,0),DATE(YEAR(TODAY()),MONTH($B$8)+1,0)),IF(ISBLANK($B$8),DATE($B$10,MONTH(TODAY())+1,0),DATE($B$10,MONTH($B$8)+1,0)))","v":"2024-02-29"},null,{"$f":"DATE(YEAR($B$12)-1,MONTH($B$12)+1,1)","v":"2023-03-01"},{"$f":"DATE(YEAR(Setup!$B$12),MONTH(Setup!$B$12)+1,0)","v":"2024-02-29"},{"$f":"TEXT($E$12,\"dd mmmm yyyy\")","v":"29 February 2024"}]
[]
["Total Number of Pages",16]
[]
["Date of Approval",null,{"$f":"IF(ISBLANK($B$16),DATE(YEAR($B$12),MONTH($B$12)+3,0),$B$16)","v":"2024-04-30"}]
[]
[null,{"$f":"DATE(YEAR(TODAY()),1,1)","v":"2024-01-01"}]
[null,{"$f":"DATE(YEAR(TODAY()),2,1)","v":"2024-02-01"}]
[null,{"$f":"DATE(YEAR(TODAY()),3,1)","v":"2024-03-01"}]
{"$rows_left_out":10}
{"sheet":"Classes","index":4,"n_rows":89,"n_cols":6,"rows_kept":89,"cut":false,"hidden":false,"merged":[]}
[{"$f":"IF(ISBLANK(Setup!$B$4),\"Example (Pty) Limited\",Setup!$B$4)","v":"Example NPC"}]
["Financial Statement Reporting Classes"]
["© www.excel-skills.com"]
["Class","Description","Code Status","TB Status","AFS Status","Error Status"]
["Income Statement"]
["I-01G","Revenue",{"$f":"IF(OR(LEFT($A6,1)=\"I\",LEFT($A6,1)=\"B\")=FALSE,\"error!\",IF(RIGHT($A6,1)<>\"G\",\"error!\",\"ok\"))","v":"ok"},{"$f":"IF(ISNA(VLOOKUP($A6,TBData,COLUMN(TB!$B$4),0)),\"-\",\"ok\")","v":"-"},{"$f":"IF(ISNA(VLOOKUP($A6,AFSClass,1,0)),\"-\",\"ok\")","v":"-"},{"$f":"IF(AND(D6=\"ok\",E6<>\"ok\"),\"add!\",\"ok\")","v":"ok"}]
["I-0101G","Donations","ok",{"$f":"IF(ISNA(VLOOKUP($A7,TBData,COLUMN(TB!$B$4),0)),\"-\",\"ok\")","v":"ok"},"ok",{"$f":"IF(AND(D7=\"ok\",E7<>\"ok\"),\"add!\",\"ok\")","v":"ok"}]
["I-0102G","Fund raising","ok",{"$f":"IF(ISNA(VLOOKUP($A8,TBData,COLUMN(TB!$B$4),0)),\"-\",\"ok\")","v":"ok"},"ok","ok"]
["I-0103G","Government grants","ok",{"$f":"IF(ISNA(VLOOKUP($A9,TBData,COLUMN(TB!$B$4),0)),\"-\",\"ok\")","v":"ok"},"ok",{"$f":"IF(AND(D9=\"ok\",E9<>\"ok\"),\"add!\",\"ok\")","v":"ok"}]
["I-0104G","Other grants","ok",{"$f":"IF(ISNA(VLOOKUP($A10,TBData,COLUMN(TB!$B$4),0)),\"-\",\"ok\")","v":"ok"},"ok","ok"]
["I-03G","Operating expenses","ok",{"$f":"IF(ISNA(VLOOKUP($A11,TBData,COLUMN(TB!$B$4),0)),\"-\",\"ok\")","v":"-"},"-","ok"]
["I-0301G","Accounting fees","ok",{"$f":"IF(ISNA(VLOOKUP($A12,TBData,COLUMN(TB!$B$4),0)),\"-\",\"ok\")","v":"ok"},"ok","ok"]
["I-0302G","Advertising & marketing","ok",{"$f":"IF(ISNA(VLOOKUP($A13,TBData,COLUMN(TB!$B$4),0)),\"-\",\"ok\")","v":"ok"},"ok","ok"]
["I-0303G","Bank charges","ok",{"$f":"IF(ISNA(VLOOKUP($A14,TBData,COLUMN(TB!$B$4),0)),\"-\",\"ok\")","v":"ok"},"ok","ok"]
["I-0304G","Commission","ok",{"$f":"IF(ISNA(VLOOKUP($A15,TBData,COLUMN(TB!$B$4),0)),\"-\",\"ok\")","v":"ok"},"ok","ok"]
["I-0305G","Computer expenses","ok",{"$f":"IF(ISNA(VLOOKUP($A16,TBData,COLUMN(TB!$B$4),0)),\"-\",\"ok\")","v":"ok"},"ok","ok"]
["I-0306G","Consumables & cleaning","ok",{"$f":"IF(ISNA(VLOOKUP($A17,TBData,COLUMN(TB!$B$4),0)),\"-\",\"ok\")","v":"ok"},"ok","ok"]
["I-0307G","Entertainment","ok",{"$f":"IF(ISNA(VLOOKUP($A18,TBData,COLUMN(TB!$B$4),0)),\"-\",\"ok\")","v":"ok"},"ok","ok"]
["I-0308G","Insurance","ok",{"$f":"IF(ISNA(VLOOKUP($A19,TBData,COLUMN(TB!$B$4),0)),\"-\",\"ok\")","v":"ok"},"ok","ok"]
["I-0309G","Office expenses","ok",{"$f":"IF(ISNA(VLOOKUP($A20,TBData,COLUMN(TB!$B$4),0)),\"-\",\"ok\")","v":"ok"},"ok","ok"]
{"$rows_left_out":70}
{"sheet":"TB","index":5,"n_rows":80,"n_cols":12,"rows_kept":80,"cut":false,"hidden":false,"merged":[]}
[{"$f":"IF(ISBLANK(Setup!$B$4),\"Example (Pty) Limited\",Setup!$B$4)","v":"Example NPC"}]
["Trial Balance"]
["© www.excel-skills.com",null,null,null,{"$f":"SUBTOTAL(9,OFFSET(E$4,1,0,TBRowCount,1))","v":0},{"$f":"SUBTOTAL(9,OFFSET(F$4,1,0,TBRowCount,1))","v":0},{"$f":"SUBTOTAL(9,OFFSET(G$4,1,0,TBRowCount,1))","v":0},{"$f":"SUBTOTAL(9,OFFSET(H$4,1,0,TBRowCount,1))","v":0},{"$f":"SUBTOTAL(9,OFFSET(I$4,1,0,TBRowCount,1))","v":0},{"$f":"SUBTOTAL(9,OFFSET(J$4,1,0,TBRowCount,1))","v":0},{"$f":"SUBTOTAL(9,OFFSET(K$4,1,0,TBRowCount,1))","v":0},{"$f":"SUBTOTAL(9,OFFSET(L$4,1,0,TBRowCount,1))","v":0}]
["Status","Class","Acc No","Account Description",2022,2023,2024,2025,2026,2027,2028,2029]
[{"$f":"IF(ISNA(VLOOKUP($B5,ClassCode,1,0)),\"class!\",IF(ISNA(VLOOKUP($B5,AFSClass,1,0)),\"add!\",\"ok\"))","v":"ok"},"B-0001G","BS-0005","Land & Buildings - Cost",2500000,2500000,2400000,0,0,0,0,0]
["ok","B-0002G","BS-0010","Plant & Equipment - Cost",1246045,1316045,1546045,0,0,0,0,0]
["ok","B-0003G","BS-0015","Furniture & Fittings - Cost",300000,350000,410000,0,0,0,0,0]
["ok","B-0004G","BS-0020","Office Equipment - Cost",225000,240000,240000,0,0,0,0,0]
["ok","B-0005G","BS-0025","Computer Equipment - Cost",120750,150500,165500,0,0,0,0,0]
["ok","B-0006G","BS-0030","Motor Vehicles - Cost",318000,318000,452000,0,0,0,0,0]
["ok","B-0101G","BS-0105","Land & Buildings - Accum Depreciation",0,0,0,0,0,0,0,0]
["ok","B-0102G","BS-0110","Plant & Equipment - Accum Depreciation",-498418,-712418,-1051018,0,0,0,0,0]
["ok","B-0103G","BS-0115","Furniture & Fittings - Accum Depreciation",-100000,-158300,-224700,0,0,0,0,0]
["ok","B-0104G","BS-0120","Office Equipment -  Accum Depreciation",-91500,-139850,-186980,0,0,0,0,0]
["ok","B-0105G","BS-0125","Computer Equipment -  Accum Depreciation",-80500,-130650,-145550,0,0,0,0,0]
["ok","B-0106G","BS-0130","Motor Vehicles -  Accum Depreciation",-159000,-238500,-56500,0,0,0,0,0]
["ok","B-0401G","BS-0400","Fixed Deposit - Bank One",0,250000,300000,0,0,0,0,0]
["ok","B-0402G","BS-0405","Fixed Deposit - Bank Two",300000,350000,350000,0,0,0,0,0]
["ok","B-05G","BS-0500","Loans & Advances",30220,145079,199836,0,0,0,0,0]
["ok","B-07G","BS-0700","Cash On Hand",0,0,0,0,0,0,0,0]
{"$rows_left_out":61}
{"sheet":"FinInfo","index":6,"n_rows":75,"n_cols":11,"rows_kept":75,"cut":false,"hidden":false,"merged":[]}
[{"$f":"IF(ISBLANK(Setup!$B$4),\"Example (Pty) Limited\",Setup!$B$4)","v":"Example NPC"}]
["Financial Statement Information (orange classes require negative values)"]
["© www.excel-skills.com"]
["Status","Class","Description",2022,2023,2024,2025,2026,2027,2028,2029]
[null,"Items with descriptions that are based on specific TB reporting classes (as per Classes sheet or this sheet)"]
[{"$f":"IF(ISNA(VLOOKUP(\"B\"&MID($B6,2,LEN($B6)-2)&\"G\",ClassAll,COLUMN(Classes!$B$4),0)),\"error!\",\"ok\")","v":"ok"},"F-0001R",{"$f":"\"Depreciation Rate - \"&IF(ISNA(VLOOKUP(\"B\"&MID($B6,2,LEN($B6)-2)&\"G\",ClassAll,COLUMN(Classes!$B$4),0)),\"PPE Class\",VLOOKUP(\"B\"&MID($B6,2,LEN($B6)-2)&\"G\",ClassAll,COLUMN(Classes!$B$4),0))","v":"Depreciation Rate - Land & buildings"},0,0,0,0,0,0,0,0]
[{"$f":"IF(ISNA(VLOOKUP(\"B\"&MID($B7,2,LEN($B7)-2)&\"G\",ClassAll,COLUMN(Classes!$B$4),0)),\"error!\",\"ok\")","v":"ok"},"F-0002R",{"$f":"\"Depreciation Rate - \"&IF(ISNA(VLOOKUP(\"B\"&MID($B7,2,LEN($B7)-2)&\"G\",ClassAll,COLUMN(Classes!$B$4),0)),\"PPE Class\",VLOOKUP(\"B\"&MID($B7,2,LEN($B7)-2)&\"G\",ClassAll,COLUMN(Classes!$B$4),0))","v":"Depreciation Rate - Plant & equipment"},0.2,0.2,0.2,0.2,0.2,0.2,0.2,0.2]
[{"$f":"IF(ISNA(VLOOKUP(\"B\"&MID($B8,2,LEN($B8)-2)&\"G\",ClassAll,COLUMN(Classes!$B$4),0)),\"error!\",\"ok\")","v":"ok"},"F-0003R",{"$f":"\"Depreciation Rate - \"&IF(ISNA(VLOOKUP(\"B\"&MID($B8,2,LEN($B8)-2)&\"G\",ClassAll,COLUMN(Classes!$B$4),0)),\"PPE Class\",VLOOKUP(\"B\"&MID($B8,2,LEN($B8)-2)&\"G\",ClassAll,COLUMN(Classes!$B$4),0))","v":"Depreciation Rate - Furniture & fittings"},0.16700000000000001,0.16700000000000001,0.16700000000000001,0.16700000000000001,0.16700000000000001,0.16700000000000001,0.16700000000000001,0.16700000000000001]
[{"$f":"IF(ISNA(VLOOKUP(\"B\"&MID($B9,2,LEN($B9)-2)&\"G\",ClassAll,COLUMN(Classes!$B$4),0)),\"error!\",\"ok\")","v":"ok"},"F-0004R",{"$f":"\"Depreciation Rate - \"&IF(ISNA(VLOOKUP(\"B\"&MID($B9,2,LEN($B9)-2)&\"G\",ClassAll,COLUMN(Classes!$B$4),0)),\"PPE Class\",VLOOKUP(\"B\"&MID($B9,2,LEN($B9)-2)&\"G\",ClassAll,COLUMN(Classes!$B$4),0))","v":"Depreciation Rate - Office equipment"},0.2,0.2,0.2,0.2,0.2,0.2,0.2,0.2]
[{"$f":"IF(ISNA(VLOOKUP(\"B\"&MID($B10,2,LEN($B10)-2)&\"G\",ClassAll,COLUMN(Classes!$B$4),0)),\"error!\",\"ok\")","v":"ok"},"F-0005R",{"$f":"\"Depreciation Rate - \"&IF(ISNA(VLOOKUP(\"B\"&MID($B10,2,LEN($B10)-2)&\"G\",ClassAll,COLUMN(Classes!$B$4),0)),\"PPE Class\",VLOOKUP(\"B\"&MID($B10,2,LEN($B10)-2)&\"G\",ClassAll,COLUMN(Classes!$B$4),0))","v":"Depreciation Rate - Computer equipment"},0.33300000000000002,0.33300000000000002,0.33300000000000002,0.33300000000000002,0.33300000000000002,0.33300000000000002,0.33300000000000002,0.33300000000000002]
[{"$f":"IF(ISNA(VLOOKUP(\"B\"&MID($B11,2,LEN($B11)-2)&\"G\",ClassAll,COLUMN(Classes!$B$4),0)),\"error!\",\"ok\")","v":"ok"},"F-0006R",{"$f":"\"Depreciation Rate - \"&IF(ISNA(VLOOKUP(\"B\"&MID($B11,2,LEN($B11)-2)&\"G\",ClassAll,COLUMN(Classes!$B$4),0)),\"PPE Class\",VLOOKUP(\"B\"&MID($B11,2,LEN($B11)-2)&\"G\",ClassAll,COLUMN(Classes!$B$4),0))","v":"Depreciation Rate - Motor vehicles"},0.25,0.25,0.25,0.25,0.25,0.25,0.25,0.25]
[{"$f":"IF(ISNA(VLOOKUP(\"B\"&MID($B12,2,LEN($B12)-2)&\"G\",ClassAll,COLUMN(Classes!$B$4),0)),\"error!\",\"ok\")","v":"ok"},"F-0001D",{"$f":"\"Disposals - Cost - \"&IF(ISNA(VLOOKUP(\"B\"&MID($B12,2,LEN($B12)-2)&\"G\",ClassAll,COLUMN(Classes!$B$4),0)),\"PPE Class\",VLOOKUP(\"B\"&MID($B12,2,LEN($B12)-2)&\"G\",ClassAll,COLUMN(Classes!$B$4),0))","v":"Disposals - Cost - Land & buildings"},0,0,0,0,0,0,0,0]
[{"$f":"IF(ISNA(VLOOKUP(\"B\"&MID($B13,2,LEN($B13)-2)&\"G\",ClassAll,COLUMN(Classes!$B$4),0)),\"error!\",\"ok\")","v":"ok"},"F-0002D",{"$f":"\"Disposals - Cost - \"&IF(ISNA(VLOOKUP(\"B\"&MID($B13,2,LEN($B13)-2)&\"G\",ClassAll,COLUMN(Classes!$B$4),0)),\"PPE Class\",VLOOKUP(\"B\"&MID($B13,2,LEN($B13)-2)&\"G\",ClassAll,COLUMN(Classes!$B$4),0))","v":"Disposals - Cost - Plant & equipment"},0,-110000,0,0,0,0,0,0]
[{"$f":"IF(ISNA(VLOOKUP(\"B\"&MID($B14,2,LEN($B14)-2)&\"G\",ClassAll,COLUMN(Classes!$B$4),0)),\"error!\",\"ok\")","v":"ok"},"F-0003D",{"$f":"\"Disposals - Cost - \"&IF(ISNA(VLOOKUP(\"B\"&MID($B14,2,LEN($B14)-2)&\"G\",ClassAll,COLUMN(Classes!$B$4),0)),\"PPE Class\",VLOOKUP(\"B\"&MID($B14,2,LEN($B14)-2)&\"G\",ClassAll,COLUMN(Classes!$B$4),0))","v":"Disposals - Cost - Furniture & fittings"},0,0,0,0,0,0,0,0]
[{"$f":"IF(ISNA(VLOOKUP(\"B\"&MID($B15,2,LEN($B15)-2)&\"G\",ClassAll,COLUMN(Classes!$B$4),0)),\"error!\",\"ok\")","v":"ok"},"F-0004D",{"$f":"\"Disposals - Cost - \"&IF(ISNA(VLOOKUP(\"B\"&MID($B15,2,LEN($B15)-2)&\"G\",ClassAll,COLUMN(Classes!$B$4),0)),\"PPE Class\",VLOOKUP(\"B\"&MID($B15,2,LEN($B15)-2)&\"G\",ClassAll,COLUMN(Classes!$B$4),0))","v":"Disposals - Cost - Office equipment"},0,0,0,0,0,0,0,0]
[{"$f":"IF(ISNA(VLOOKUP(\"B\"&MID($B16,2,LEN($B16)-2)&\"G\",ClassAll,COLUMN(Classes!$B$4),0)),\"error!\",\"ok\")","v":"ok"},"F-0005D",{"$f":"\"Disposals - Cost - \"&IF(ISNA(VLOOKUP(\"B\"&MID($B16,2,LEN($B16)-2)&\"G\",ClassAll,COLUMN(Classes!$B$4),0)),\"PPE Class\",VLOOKUP(\"B\"&MID($B16,2,LEN($B16)-2)&\"G\",ClassAll,COLUMN(Classes!$B$4),0))","v":"Disposals - Cost - Computer equipment"},0,0,0,0,0,0,0,0]
[{"$f":"IF(ISNA(VLOOKUP(\"B\"&MID($B17,2,LEN($B17)-2)&\"G\",ClassAll,COLUMN(Classes!$B$4),0)),\"error!\",\"ok\")","v":"ok"},"F-0006D",{"$f":"\"Disposals - Cost - \"&IF(ISNA(VLOOKUP(\"B\"&MID($B17,2,LEN($B17)-2)&\"G\",ClassAll,COLUMN(Classes!$B$4),0)),\"PPE Class\",VLOOKUP(\"B\"&MID($B17,2,LEN($B17)-2)&\"G\",ClassAll,COLUMN(Classes!$B$4),0))","v":"Disposals - Cost - Motor vehicles"},0,0,-318000,0,0,0,0,0]
[{"$f":"IF(ISNA(VLOOKUP(\"B\"&MID($B18,2,LEN($B18)-2)&\"G\",ClassAll,COLUMN(Classes!$B$4),0)),\"error!\",\"ok\")","v":"ok"},"F-0001I",{"$f":"\"Impairment - Cost - \"&IF(ISNA(VLOOKUP(\"B\"&MID($B18,2,LEN($B18)-2)&\"G\",ClassAll,COLUMN(Classes!$B$4),0)),\"PPE Class\",VLOOKUP(\"B\"&MID($B18,2,LEN($B18)-2)&\"G\",ClassAll,COLUMN(Classes!$B$4),0))","v":"Impairment - Cost - Land & buildings"},0,0,-100000,0,0,0,0,0]
[{"$f":"IF(ISNA(VLOOKUP(\"B\"&MID($B19,2,LEN($B19)-2)&\"G\",ClassAll,COLUMN(Classes!$B$4),0)),\"error!\",\"ok\")","v":"ok"},"F-0002I",{"$f":"\"Impairment - Cost - \"&IF(ISNA(VLOOKUP(\"B\"&MID($B19,2,LEN($B19)-2)&\"G\",ClassAll,COLUMN(Classes!$B$4),0)),\"PPE Class\",VLOOKUP(\"B\"&MID($B19,2,LEN($B19)-2)&\"G\",ClassAll,COLUMN(Classes!$B$4),0))","v":"Impairment - Cost - Plant & equipment"},0,0,0,0,0,0,0,0]
[{"$f":"IF(ISNA(VLOOKUP(\"B\"&MID($B20,2,LEN($B20)-2)&\"G\",ClassAll,COLUMN(Classes!$B$4),0)),\"error!\",\"ok\")","v":"ok"},"F-0003I",{"$f":"\"Impairment - Cost - \"&IF(ISNA(VLOOKUP(\"B\"&MID($B20,2,LEN($B20)-2)&\"G\",ClassAll,COLUMN(Classes!$B$4),0)),\"PPE Class\",VLOOKUP(\"B\"&MID($B20,2,LEN($B20)-2)&\"G\",ClassAll,COLUMN(Classes!$B$4),0))","v":"Impairment - Cost - Furniture & fittings"},0,0,0,0,0,0,0,0]
{"$rows_left_out":56}
{"sheet":"AFS","index":7,"n_rows":606,"n_cols":16,"rows_kept":606,"cut":false,"hidden":false,"merged":[[372,1,372,9],[374,1,374,9],[376,1,376,9],[390,1,390,9],[392,1,392,9],[378,1,378,9],[380,1,380,9],[386,1,386,9],[388,1,388,9],[462,1,462,9],[464,1,464,9],[605,1,605,9],[509,1,509,9],[516,1,516,9],[534,1,534,9],[554,1,554,9],[559,1,559,9],[593,1,593,9],[597,1,597,9],[589,1,589,9],[370,1,370,9],[356,1,356,9],[360,1,360,9],[362,1,362,9],[364,1,364,9],[153,1,153,9],[327,1,327,9],[329,1,329,9],[346,1,346,9],[368,1,368,9],[354,1,354,9],[9,1,9,9],[366,1,366,9],[358,1,358,9],[344,1,344,9],[143,1,143,9],[147,1,147,9],[151,1,151,9],[348,1,348,9],[101,1,101,9],[105,1,105,9],[331,1,331,9],[333,1,333,9],[342,1,342,9],[321,1,321,9],[145,1,145,9],[149,1,149,9],[4,1,4,9],[5,1,5,9],[10,1,10,9],[325,1,325,9],[319,1,319,9],[323,1,323,9],[111,1,111,9],[132,1,132,9],[97,1,97,9],[99,1,99,9],[103,1,103,9],[107,1,107,9],[109,1,109,9],[128,1,128,9],[130,1,130,9],[134,1,134,9]]}
[null,null,null,null,null,null,null,null,null,null,"NOTE: Print area is only from column B to J."]
[]
[]
[]
[null,{"$f":"Setup!$A$1","v":"Example NPC"}]
[null,{"$f":"\"(Registration Number: \"&IF(ISBLANK($E$88),\"0000 000000 00\",$E$88)&\")\"","v":"(Registration Number: 999 000 000)"}]
[]
[]
[]
[null,"Financial statements"]
[null,{"$f":"\"for the year ended \"&Setup!$F$12","v":"for the year ended 29 February 2024"}]
[]
[]
[]
[]
[]
[]
[]
[]
[]
{"$rows_left_out":587}
{"sheet":"TBImport","index":8,"n_rows":80,"n_cols":6,"rows_kept":80,"cut":false,"hidden":false,"merged":[]}
[{"$f":"IF(ISBLANK(Setup!$B$4),\"Example (Pty) Limited\",Setup!$B$4)","v":"Example NPC"}]
["Trial Balance Sequence & Rounding"]
["© www.excel-skills.com",null,null,null,{"$f":"SUBTOTAL(9,OFFSET($E$4,1,0,1000,1))","v":0},{"$f":"IF(E3<>0,\"Error! Rounded TB values in column E do not balance.\",\"ok\")","v":"ok"}]
["Acc No","Account Description","Amount","Check","Amount"]
["BS-0005","Land & Buildings - Cost",2400000,{"$f":"IF(OFFSET(TB!$C$4,ROW($A5)-ROW($A$4),0,1,1)=$A5,\"ok\",\"error!\")","v":"ok"},{"$f":"ROUND(C5,0)","v":2400000}]
["BS-0010","Plant & Equipment - Cost",1546045,{"$f":"IF(OFFSET(TB!$C$4,ROW($A6)-ROW($A$4),0,1,1)=$A6,\"ok\",\"error!\")","v":"ok"},{"$f":"ROUND(C6,0)","v":1546045}]
["BS-0015","Furniture & Fittings - Cost",410000,{"$f":"IF(OFFSET(TB!$C$4,ROW($A7)-ROW($A$4),0,1,1)=$A7,\"ok\",\"error!\")","v":"ok"},410000]
["BS-0020","Office Equipment - Cost",240000,{"$f":"IF(OFFSET(TB!$C$4,ROW($A8)-ROW($A$4),0,1,1)=$A8,\"ok\",\"error!\")","v":"ok"},240000]
["BS-0025","Computer Equipment - Cost",165500,{"$f":"IF(OFFSET(TB!$C$4,ROW($A9)-ROW($A$4),0,1,1)=$A9,\"ok\",\"error!\")","v":"ok"},165500]
["BS-0030","Motor Vehicles - Cost",452000,{"$f":"IF(OFFSET(TB!$C$4,ROW($A10)-ROW($A$4),0,1,1)=$A10,\"ok\",\"error!\")","v":"ok"},452000]
["BS-0105","Land & Buildings - Accum Depreciation",0,{"$f":"IF(OFFSET(TB!$C$4,ROW($A11)-ROW($A$4),0,1,1)=$A11,\"ok\",\"error!\")","v":"ok"},0]
["BS-0110","Plant & Equipment - Accum Depreciation",-1051018,{"$f":"IF(OFFSET(TB!$C$4,ROW($A12)-ROW($A$4),0,1,1)=$A12,\"ok\",\"error!\")","v":"ok"},-1051018]
["BS-0115","Furniture & Fittings - Accum Depreciation",-224700,{"$f":"IF(OFFSET(TB!$C$4,ROW($A13)-ROW($A$4),0,1,1)=$A13,\"ok\",\"error!\")","v":"ok"},-224700]
["BS-0120","Office Equipment -  Accum Depreciation",-186980,{"$f":"IF(OFFSET(TB!$C$4,ROW($A14)-ROW($A$4),0,1,1)=$A14,\"ok\",\"error!\")","v":"ok"},-186980]
["BS-0125","Computer Equipment -  Accum Depreciation",-145550,{"$f":"IF(OFFSET(TB!$C$4,ROW($A15)-ROW($A$4),0,1,1)=$A15,\"ok\",\"error!\")","v":"ok"},-145550]
["BS-0130","Motor Vehicles -  Accum Depreciation",-56500,{"$f":"IF(OFFSET(TB!$C$4,ROW($A16)-ROW($A$4),0,1,1)=$A16,\"ok\",\"error!\")","v":"ok"},-56500]
["BS-0400","Fixed Deposit - Bank One",300000,{"$f":"IF(OFFSET(TB!$C$4,ROW($A17)-ROW($A$4),0,1,1)=$A17,\"ok\",\"error!\")","v":"ok"},300000]
["BS-0405","Fixed Deposit - Bank Two",350000,{"$f":"IF(OFFSET(TB!$C$4,ROW($A18)-ROW($A$4),0,1,1)=$A18,\"ok\",\"error!\")","v":"ok"},350000]
["BS-0500","Loans & Advances",199836,{"$f":"IF(OFFSET(TB!$C$4,ROW($A19)-ROW($A$4),0,1,1)=$A19,\"ok\",\"error!\")","v":"ok"},199836]
["BS-0700","Cash On Hand",0,{"$f":"IF(OFFSET(TB!$C$4,ROW($A20)-ROW($A$4),0,1,1)=$A20,\"ok\",\"error!\")","v":"ok"},0]
{"$rows_left_out":60}