{"text_format":"3","workbook":"xlsx","n_sheets":5,"sheets":["Invoice","Customers","Employees","Products","Stores"],"not_rendered":{"images":1,"defined_names":2,"comments":1},"read":"whole","date_system":"1900"}

{"sheet":"Invoice","index":0,"n_rows":30,"n_cols":14,"rows_kept":30,"merged":[[8,1,8,4],[8,7,8,12],[9,1,9,4],[9,7,9,12],[11,1,11,4],[11,7,11,12],[12,1,12,4],[12,7,12,12],[13,1,13,4],[13,7,13,10],[16,1,16,2],[16,3,16,4],[16,5,16,6],[16,7,16,8],[16,9,16,10],[16,11,16,12],[17,1,17,2],[17,3,17,4],[17,5,17,6],[17,7,17,8],[17,9,17,10],[17,11,17,12],[20,2,20,5],[20,6,20,7],[20,8,20,9],[20,10,20,12],[21,2,21,5],[21,6,21,7],[21,8,21,9],[21,10,21,12],[22,2,22,5],[22,6,22,7],[22,8,22,9],[22,10,22,12],[23,2,23,5],[23,6,23,7],[23,8,23,9],[23,10,23,12],[24,2,24,5],[24,6,24,7],[24,8,24,9],[24,10,24,12],[25,2,25,5],[25,6,25,9],[25,10,25,12],[26,6,26,9],[26,10,26,12],[27,6,27,9],[27,10,27,12],[30,1,33,5]]}
[]
[]
[]
[null,"2017-04-06"]
[null,"INVOICE #",234621]
[]
[]
[]
[null,"BILLING ADDRESS",{"$nulls":5},"SHIPPING ADDRESS"]
[null,"Tom's Club",{"$nulls":5},{"$f":"B10","v":"Tom's Club"}]
[null,{"$f":"VLOOKUP(B10,CustomersTable[],2,FALSE)","v":"41B0A894-60E6-E311-A609-080027D10434"}]
[null,"Home Office",{"$nulls":5},"San Diego"]
[null,{"$f":"VLOOKUP(B10,CustomersTable[],3,FALSE)","v":"999 Lake Drive"},{"$nulls":5},{"$f":"DGET(StoresTable[#All], \"Address_Line\", Stores!$B$1:$C$2)","v":"2345 Fenton Pkwy"}]
[null,{"$f":"CONCATENATE(VLOOKUP(B10,CustomersTable[],4,FALSE),\", \",VLOOKUP(B10,CustomersTable[],5,FALSE),\" \",VLOOKUP(B10,CustomersTable[],6,FALSE))","v":"Issaquah, WA 98027"},{"$nulls":5},{"$f":"CONCATENATE(H12,\", \",DGET(StoresTable[#All], \"Address_State\", Stores!$B$1:$C$2),\" \",DGET(StoresTable[#All], \"Address_ZipCode\", Stores!$B$1:$C$2))","v":"San Diego, CA 92108"}]
[]
[]
[null,"Sales Rep.",null,"PO #",null,"Ship Date",null,"Ship Via",null,"FOB",null,"Terms"]
[null,"Ed Holmes",null,119844,null,"2016-05-21",null,"Ground",{"$nulls":3},{"v":15,"d":"15 Days"}]
[]
[]
[null,"Quantity","Description",{"$nulls":3},"Unit Price",null,"Discount",null,"Total"]
[null,10,"HD Video Player",{"$nulls":3},{"$f":"VLOOKUP(C22,Products!$B$2:$I$20,8,FALSE)","v":{"v":220,"d":"$220.00"}},null,{"v":200,"d":"$200.00"},null,{"$f":"B22*G22-I22","v":{"v":2000,"d":"$2,000.00"}},null,null," "]
[null,5,"SuperLED 50",{"$nulls":3},{"$f":"VLOOKUP(C23,Products!$B$2:$I$20,8,FALSE)","v":{"v":1100,"d":"$1,100.00"}},null,{"v":500,"d":"$500.00"},null,{"$f":"B23*G23-I23","v":{"v":5000,"d":"$5,000.00"}},null,null," "]
[null,2,"SuperLED 42",{"$nulls":3},{"$f":"VLOOKUP(C24,Products!$B$2:$I$20,8,FALSE)","v":{"v":1050,"d":"$1,050.00"}},null,{"v":50,"d":"$50.00"},null,{"v":2050,"d":"$2,050.00"},null,null," "]
[null,5,"Projector PlusHD",{"$nulls":3},{"$f":"VLOOKUP(C25,Products!$B$2:$I$20,8,FALSE)","v":{"v":600,"d":"$600.00"}},null,{"v":250,"d":"$250.00"},null,{"v":2750,"d":"$2,750.00"},null,null," "]
[null,null," ",{"$nulls":3},"SUB TOTAL",{"$nulls":3},{"$f":"SUM(K22:M25)","v":{"v":11800,"d":"$11,800.00"}}]
[{"$nulls":6},"SHIPPING",{"$nulls":3},{"v":375,"d":"$375.00"}]
[{"$nulls":6},"TOTAL DUE",{"$nulls":3},{"$f":"SUM(K26:M27)","v":{"v":12175,"d":"$12,175.00"}}]
[]
[null,"COMMENTS"]
{"$rows_left_out":1}
{"sheet":"Customers","index":1,"n_rows":21,"n_cols":16,"rows_kept":21,"hidden":true}
["Name","Id","HomeOffice_Line","HomeOffice_City","HomeOffice_State","HomeOffice_ZipCode","BillingAddress_Line","BillingAddress_City","BillingAddress_State","BillingAddress_ZipCode","Phone","Fax","Website","TotalStores","TotalEmployees","Status"]
["Super Mart of the West","3EB0A894-60E6-E311-A609-080027D10434","702 SW 8th Street","Bentonville","AR",72716,"P O Box 5342427","Bentonville","AR",72716,"(800) 555-2797","(800) 555-2171","http://www.nowebsitesupermart.com",25,11000,0]
["Electronics Depot","3FB0A894-60E6-E311-A609-080027D10434","2455 Paces Ferry Road NW","Atlanta","GA",30339,"P O Box 6593265","Atlanta","GA",30339,"(800) 595-3232","(800) 595-3231","http://www.nowebsitedepot.com",20,5000,0]
["K&S Music","40B0A894-60E6-E311-A609-080027D10434","1000 Nicllet Mall","Minneapolis","MN",55403,"P O Box 8596565","Minneapolis","MN",55403,"(612) 304-6073","(612) 304-6074","http://www.nowebsitemusic.com",28,19000,0]
["Tom's Club","41B0A894-60E6-E311-A609-080027D10434","999 Lake Drive","Issaquah","WA",98027,"P O Box 3433125","Issaquah","WA",98124,"(800) 955-2292","(800) 955-2293","http://www.nowebsitetomsclub.com",33,3000,0]
["E-Mart","42B0A894-60E6-E311-A609-080027D10434","3333 Beverly Rd","Hoffman Estates","IL",60179,"P O Box 2424569","Hoffman Estates","IL",60179,"(847) 286-2500","(847) 286-2501","http://www.nowebsiteemart.com",31,4000,0]
["Walters","43B0A894-60E6-E311-A609-080027D10434","200 Wilmot Rd","Deerfield","IL",60015,"P O Box 3885696","Deerfield","IL",60015,"(847) 940-2500","(847) 940-2501","http://www.nowebsitewalters.com",28,19000,0]
["StereoShack","44B0A894-60E6-E311-A609-080027D10434","400 Commerce S","Fort Worth","TX",76102,"P O Box 7814522","Fort Worth","TX",76102,"(817) 820-0741","(817) 820-0742","http://www.nowebsiteshack.com",33,11000,0]
["Circuit Town","45B0A894-60E6-E311-A609-080027D10434","2200 Kensington Court","Oak Brook","IL",60523,"P O Box 3996325","Oak Brook","IL",60523,"(800) 955-2929","(800) 955-9392","http://www.nowebsitecircuittown.com",24,5000,0]
["Premier Buy","46B0A894-60E6-E311-A609-080027D10434","7601 Penn Avenue South","Richfield","MN",55423,"P O Box 4141288","Richfield","MN",55423,"(612) 291-1000","(612) 291-2001","http://www.nowebsitepremierbuy.com",24,16000,0]
["ElectrixMax","47B0A894-60E6-E311-A609-080027D10434","263 Shuman Blvd","Naperville","IL",60563,"P O Box 6386854","Naperville","IL",60563,"(630) 438-7800","(630) 438-7801","http://www.nowebsiteelectrixmax.com",23,12000,0]
["Video Emporium","48B0A894-60E6-E311-A609-080027D10434","1201 Elm Street","Dallas","TX",75270,"P O Box 8578756","Dallas","TX",75270,"(214) 854-3000","(214) 854-3001","http://www.nowebsitevideoemporium.com",25,10000,0]
["Screen Shop","49B0A894-60E6-E311-A609-080027D10434","1000 Lowes Blvd","Mooresville","NC",28117,"P O Box 5622247","Mooresville","NC",28117,"(800) 445-6937","(800) 445-6938","http://www.nowebsitescreenshop.com",24,12000,0]
["Braeburn","4AB0A894-60E6-E311-A609-080027D10434","1 Infinite Loop","Cupertino","CA",95014,"P O Box 7487436","Cupertino","CA",95014,"(408) 996-1010","(408) 996-1012","http://www.nowebsitebraeburn.com",31,15000,0]
["PriceCo","4BB0A894-60E6-E311-A609-080027D10434","30 Hunter Lane","Camp Hill","PA",17011,"P O Box 8452277","Camp Hill","PA",17011,"(717) 761-2633","(717) 761-2334","http://www.nowebsitepriceco.com",23,15000,0]
["Ultimate Gadget","4CB0A894-60E6-E311-A609-080027D10434","1557 Watson Blvd","Warner Robbins","GA",31093,"P O Box 2653499","Warner Robbins","GA",31093,"(995) 623-6785","(995) 623-6786","http://www.nowebsiteultimategadget.com",29,9000,0]
["EZ Stop","4DB0A894-60E6-E311-A609-080027D10434","618 Michillinda Ave.","Arcadia","CA",91007,"P O Box 5623325","Arcadia","CA",91007,"(626) 265-8632","(626) 265-8633","http://www.nowebsiteezstop.com",34,18000,0]
["Clicker","4EB0A894-60E6-E311-A609-080027D10434","1100 W. Artesia Blvd.","Compton","CA",90220,"P O Box 8547888","Compton","CA",90220,"(310) 884-9000","(310) 884-9001","http://www.nowebsiteclicker.com",28,3000,0]
["Store of America","4FB0A894-60E6-E311-A609-080027D10434","2401 Utah Ave. South","Seattle","WA",98134,"P O Box 7887265","Seattle","WA",98134,"(206) 447-1575","(206) 447-1576","http://www.nowebsiteamerica.com",22,16000,0]
["Zone Toys","50B0A894-60E6-E311-A609-080027D10434","1945 S Cienega Boulevard","Los Angeles","CA",90034,"P O Box 7215423","Los Angeles","CA",90034,"(310) 237-5642","(310) 237-5643","http://www.nowebsitezonetoys.com",27,9000,0]
["ACME","51B0A894-60E6-E311-A609-080027D10434","2525 E El Segundo Blvd","El Segundo","CA",90245,"P O Box 2412433","El Segundo","CA",90245,"(310) 536-0611","(310) 536-0612","http://www.nowebsiteacme.com",24,8000,0]

{"sheet":"Employees","index":2,"n_rows":52,"n_cols":19,"rows_kept":52,"hidden":true}
["Id","Department","Title","Status","HireDate","Order","FirstName","LastName","FullName","Prefix","HomePhone","MobilePhone","Email","Skype","BirthDate","Address_Line","Address_City","Address_State","Address_ZipCode"]
["E5AFA894-60E6-E311-A609-080027D10434",2,"Support Assistant",0,"2009-03-17",46,"Jack","Garmin","Jackie Garmin",1,"(213) 555-2828","(213) 555-1824","jackg@dx-email.com","jackg_DX_skype","1988-09-11","807 West Paseo Del Mar","Los Angeles","CA",90731]
["E6AFA894-60E6-E311-A609-080027D10434",1,"Sales Assistant",0,"2012-05-11",47,"Lincoln","Bartlett","Lincoln Bartlett",1,"(213) 555-2587","(213) 555-8272","lincolnb@dx-email.com","lincoln_DX_skype","1990-08-02","800 N Alameda St","Los Angeles","CA",90012]
["E7AFA894-60E6-E311-A609-080027D10434",6,"CEO",0,"1995-01-15",1,"John","Heart","John Heart",1,"(213) 555-9208","(213) 555-9392","jheart@dx-email.com","jheart_DX_skype","1964-03-16","351 S Hill St.","Los Angeles","CA",90013]
["E8AFA894-60E6-E311-A609-080027D10434",6,"COO",0,"2004-05-24",2,"Samantha","Bright","Samantha Bright",0,"(213) 555-0288","(213) 555-2858","samanthab@dx-email.com","samanthab_DX_skype","1966-05-02","5801 Wilshire Blvd.","Los Angeles","CA",90036]
["E9AFA894-60E6-E311-A609-080027D10434",6,"CTO",0,"2007-12-18",3,"Arthur","Miller","Arthur Miller",1,"(310) 555-6542","(310) 555-8583","arthurm@dx-email.com","arthurm_DX_skype","1972-07-11","3800 Homer St.","Los Angeles","CA",90031]
["EAAFA894-60E6-E311-A609-080027D10434",6,"CMO",0,"2002-11-08",4,"Robert","Reagan","Robert Reagan",1,"(818) 555-2438","(818) 555-2387","robertr@dx-email.com","robertr_DX_skype","1974-09-07","4 Westmoreland Pl.","Pasadena","CA",91103]
["EBAFA894-60E6-E311-A609-080027D10434",5,"HR Manager",2,"1998-04-23",5,"Greta","Sims","Greta Sims",2,"(818) 555-0976","(818) 555-6546","gretas@dx-email.com","gretas_DX_skype","1977-11-22","1700 S Grandview Dr.","Alhambra","CA",91803]
["ECAFA894-60E6-E311-A609-080027D10434",7,"IT Manager",2,"2009-03-06",6,"Brett","Wade","Brett Wade",1,"(626) 555-5985","(626) 555-0358","brettw@dx-email.com","brettw_DX_skype","1968-12-01","1120 Old Mill Rd.","San Marino","CA",91108]
["EDAFA894-60E6-E311-A609-080027D10434",5,"Controller",2,"2005-05-11",7,"Sandra","Johnson","Sandra Johnson",4,"(562) 555-8272","(562) 555-2082","sandraj@dx-email.com","sandraj_DX_skype","1974-11-15","4600 N Virginia Rd.","Long Beach","CA",90807]
["EEAFA894-60E6-E311-A609-080027D10434",1,"Sales Manager",4,"2005-06-19",8,"Edward","Holmes","Ed Holmes",0,"(310) 555-6098","(310) 555-1288","edwardh@dx-email.com","edwardh_DX_skype","1973-07-14","23200 Pacific Coast Hwy","Malibu","CA",90265]
["EFAFA894-60E6-E311-A609-080027D10434",2,"Support Manager",4,"2002-08-07",9,"Barbara","Banks","Barb Banks",4,"(310) 555-9792","(310) 555-3355","barbarab@dx-email.com","barbarab_DX_skype","1979-04-14","17985 Pacific Coast Hwy","Pacific Palisades","CA",90272]
["F0AFA894-60E6-E311-A609-080027D10434",3,"Shipping Manager",0,"2009-08-11",10,"Kevin","Carter","Kevin Carter",1,"(213) 555-8038","(213) 555-2840","kevinc@dx-email.com","kevinc_DX_skype","1978-01-09","424 N Main St.","Los Angeles","CA",90012]
["F1AFA894-60E6-E311-A609-080027D10434",5,"HR Assistant",0,"2008-03-24",11,"Cynthia","Stanwick","Cindy Stanwick",2,"(818) 555-0828","(818) 555-6655","cindys@dx-email.com","cindys_DX_skype","1985-06-05","2211 Bonita Dr.","Glendale","CA",91208]
["F2AFA894-60E6-E311-A609-080027D10434",1,"Sales Assistant",0,"2012-02-01",12,"Sam","Hill","Sammy Hill",1,"(626) 554-3168","(626) 555-7292","sammyh@dx-email.com","sammyh_DX_skype","1984-02-17","645 Prospect Crescent","Pasadena","CA",91103]
["F3AFA894-60E6-E311-A609-080027D10434",3,"Shipping Assistant",0,"2011-04-24",13,"David","Jones","Davey Jones",1,"(626) 555-4422","(626) 555-0281","davidj@dx-email.com","davidj_DX_skype","1983-03-06","391 S Orange Grove Blvd.","Pasadena","CA",91184]
["F4AFA894-60E6-E311-A609-080027D10434",3,"Shipping Assistant",0,"2012-07-23",14,"Victor","Norris","Victor Norris",1,"(213) 555-2827","(213) 555-9278","victorn@dx-email.com","victorn_DX_skype","1986-07-23","811 West 7th St.","Los Angeles","CA",90017]
["F5AFA894-60E6-E311-A609-080027D10434",3,"Shipping Assistant",0,"2012-08-12",15,"Mary","Stern","Mary Stern",2,"(818) 555-8375","(818) 555-7857","marys@dx-email.com","marys_DX_skype","1982-04-08","113 N Cedar St.","Glendale","CA",91206]
["F6AFA894-60E6-E311-A609-080027D10434",3,"Shipping Assistant",0,"2012-09-01",16,"Robin","Cosworth","Robin Cosworth",4,"(818) 555-9266","(818) 555-0942","robinc@dx-email.com","robinc_DX_skype","1981-06-12","501 N Main St.","Los Angeles","CA",90012]
["F7AFA894-60E6-E311-A609-080027D10434",2,"Support Assistant",0,"2012-10-13",17,"Kelly","Rodriguez","Kelly Rodriguez",2,"(818) 555-9792","(818) 555-9248","kellyr@dx-email.com","kellyr_DX_skype","1988-05-11","1601 W Mountain St.","Glendale","CA",91201]
["F8AFA894-60E6-E311-A609-080027D10434",2,"Support Assistant",0,"2012-10-18",18,"James","Anderson","James Anderson",1,"(323) 555-2087","(323) 555-4702","jamesa@dx-email.com","jamesa_DX_skype","1987-01-29","4800 Hollywood Blvd","Los Angeles","CA",90027]
["F9AFA894-60E6-E311-A609-080027D10434",2,"Support Assistant",0,"2013-01-19",19,"Anthony","Remmen","Antony Remmen",1,"(310) 555-0009","(310) 555-6625","anthonyr@dx-email.com","anthonyr_DX_skype","1986-02-19","1542 S Beacon St","San Pedro","CA",90731]
["FAAFA894-60E6-E311-A609-080027D10434",1,"Sales Assistant",0,"2012-05-14",20,"Olivia","Peyton","Olivia Peyton",4,"(310) 555-8247","(310) 555-2728","oliviap@dx-email.com","oliviap_DX_skype","1981-06-03","807 W Paseo Del Mar","San Pedro","CA",90731]
["FBAFA894-60E6-E311-A609-080027D10434",7,"Network Admin",0,"2012-04-14",21,"Taylor","Riley","Taylor Riley",1,"(310) 555-2134","(310) 555-7276","taylorr@dx-email.com","taylorr_DX_skype","1982-08-14","7776 Torreyson Dr","West Hollywood","CA",90046]
["FCAFA894-60E6-E311-A609-080027D10434",7,"Network Admin",0,"2011-02-10",22,"Amelia","Harper","Amelia Harper",4,"(213) 555-3792","(213) 555-4276","ameliah@dx-email.com","ameliah_DX_skype","1983-11-19","527 W 7th St","Los Angeles","CA",90014]
["FDAFA894-60E6-E311-A609-080027D10434",7,"Programmer",0,"2011-02-17",23,"Walter","Hobbs","Wally Hobbs",1,"(818) 555-2478","(818) 555-8872","wallyh@dx-email.com","wallyh_DX_skype","1984-12-24","10385 Shadow Oak Dr","Chatsworth","CA",91311]
["FEAFA894-60E6-E311-A609-080027D10434",7,"Programmer",0,"2011-03-02",24,"Bradley","Jameson","Brad Jameson",1,"(818) 555-9098","(818) 555-4646","bradleyj@dx-email.com","bradleyj_DX_skype","1988-10-12","1100 Pico St","San Fernando","CA",91340]
["FFAFA894-60E6-E311-A609-080027D10434",7,"Programmer",0,"2011-03-14",25,"Karen","Goodson","Karen Goodson",3,"(626) 555-0822","(626) 555-0908","kareng@dx-email.com","kareng_DX_skype","1987-04-26","309 Monterey Rd","South Pasadena","CA",91030]
["00B0A894-60E6-E311-A609-080027D10434",5,"Travel Coordinator",0,"2005-05-19",26,"Marcus","Orbison","Marcus Orbison",1,"(213) 555-2608","(213) 555-7098","marcuso@dx-email.com","marcuso_DX_skype","1982-03-02","501 N Main St","Los Angeles","CA",90012]
["01B0A894-60E6-E311-A609-080027D10434",5,"Benefits Coordinator",0,"2005-06-04",27,"Sandra","Bright","Sandy Bright",2,"(818) 555-5072","(818) 555-0524","sandrab@dx-email.com","sandrab_DX_skype","1983-09-11","7570 McGroarty Ter","Tujunga","CA",91042]
{"$rows_left_out":23}
{"sheet":"Products","index":3,"n_rows":20,"n_cols":10,"rows_kept":20,"hidden":true}
["Id","Name","ProductionStart","Available","CurrentInventory","Backorder","Manufacturing","Cost","SalePrice","RetailPrice"]
["2BB0A894-60E6-E311-A609-080027D10434","HD Video Player","2013-10-07",1,225,0,10,{"v":110,"d":"$110.00"},{"v":220,"d":"$220.00"},{"v":330,"d":"$330.00"}]
["2CB0A894-60E6-E311-A609-080027D10434","SuperHD Video Player","2013-12-01",1,150,0,25,{"v":175,"d":"$175.00"},{"v":275,"d":"$275.00"},{"v":400,"d":"$400.00"}]
["2DB0A894-60E6-E311-A609-080027D10434","SuperPlasma 50","2005-01-10",0,0,0,0,{"v":1100,"d":"$1,100.00"},{"v":1800,"d":"$1,800.00"},{"v":2400,"d":"$2,400.00"}]
["2EB0A894-60E6-E311-A609-080027D10434","SuperLED 50","2011-10-30",1,77,0,55,{"v":775,"d":"$775.00"},{"v":1100,"d":"$1,100.00"},{"v":1600,"d":"$1,600.00"}]
["2FB0A894-60E6-E311-A609-080027D10434","SuperLED 42","2012-09-15",1,445,0,0,{"v":675,"d":"$675.00"},{"v":1050,"d":"$1,050.00"},{"v":1450,"d":"$1,450.00"}]
["30B0A894-60E6-E311-A609-080027D10434","SuperLCD 55","2010-08-01",1,345,0,5,{"v":745,"d":"$745.00"},{"v":1045,"d":"$1,045.00"},{"v":1350,"d":"$1,350.00"}]
["31B0A894-60E6-E311-A609-080027D10434","SuperLCD 42","2010-07-01",1,210,0,20,{"v":710,"d":"$710.00"},{"v":999,"d":"$999.00"},{"v":1200,"d":"$1,200.00"}]
["32B0A894-60E6-E311-A609-080027D10434","SuperPlasma 65","2008-12-01",0,0,0,0,{"v":1800,"d":"$1,800.00"},{"v":2900,"d":"$2,900.00"},{"v":3500,"d":"$3,500.00"}]
["33B0A894-60E6-E311-A609-080027D10434","SuperLCD 70","2012-06-01",1,95,0,5,{"v":2125,"d":"$2,125.00"},{"v":3200,"d":"$3,200.00"},{"v":4000,"d":"$4,000.00"}]
["34B0A894-60E6-E311-A609-080027D10434","DesktopLED 21","2012-06-01",1,0,425,75,{"v":75,"d":"$75.00"},{"v":125,"d":"$125.00"},{"v":175,"d":"$175.00"}]
["35B0A894-60E6-E311-A609-080027D10434","DesktopLED 19","2012-05-30",1,425,0,110,{"v":70,"d":"$70.00"},{"v":115,"d":"$115.00"},{"v":165,"d":"$165.00"}]
["36B0A894-60E6-E311-A609-080027D10434","DesktopLCD 21","2010-03-31",1,210,0,60,{"v":75,"d":"$75.00"},{"v":120,"d":"$120.00"},{"v":170,"d":"$170.00"}]
["37B0A894-60E6-E311-A609-080027D10434","DesktopLCD 19","2010-03-31",1,150,0,210,{"v":68,"d":"$68.00"},{"v":110,"d":"$110.00"},{"v":160,"d":"$160.00"}]
["38B0A894-60E6-E311-A609-080027D10434","Projector Plus","2010-07-30",1,0,55,10,{"v":225,"d":"$225.00"},{"v":400,"d":"$400.00"},{"v":550,"d":"$550.00"}]
["39B0A894-60E6-E311-A609-080027D10434","Projector PlusHD","2012-12-01",1,110,0,90,{"v":425,"d":"$425.00"},{"v":600,"d":"$600.00"},{"v":750,"d":"$750.00"}]
["3AB0A894-60E6-E311-A609-080027D10434","Projector PlusHT","2013-01-15",1,0,75,57,{"v":725,"d":"$725.00"},{"v":900,"d":"$900.00"},{"v":1050,"d":"$1,050.00"}]
["3BB0A894-60E6-E311-A609-080027D10434","ExcelRemote IR","2012-08-01",1,650,0,190,{"v":55,"d":"$55.00"},{"v":105,"d":"$105.00"},{"v":150,"d":"$150.00"}]
["3CB0A894-60E6-E311-A609-080027D10434","ExcelRemote Bluetooth","2012-09-01",1,310,0,0,{"v":85,"d":"$85.00"},{"v":135,"d":"$135.00"},{"v":180,"d":"$180.00"}]
["3DB0A894-60E6-E311-A609-080027D10434","ExcelRemote IP","2012-10-01",1,0,325,225,{"v":105,"d":"$105.00"},{"v":155,"d":"$155.00"},{"v":200,"d":"$200.00"}]

{"sheet":"Stores","index":4,"n_rows":204,"n_cols":8,"rows_kept":204,"hidden":true}
[null,"CustomerId","Address_City"]
[null,{"$f":"VLOOKUP(Invoice!$B$10,CustomersTable[],2,FALSE)","v":"41B0A894-60E6-E311-A609-080027D10434"},{"$f":"Invoice!H12","v":"San Diego"}]
[]
["Id","CustomerId","Address_Line","Address_City","Address_State","Address_ZipCode","Phone","Fax"]
["52B0A894-60E6-E311-A609-080027D10434","3EB0A894-60E6-E311-A609-080027D10434","634 S Spring St","Los Angeles","CA",90014,2135553724,2135557539]
["53B0A894-60E6-E311-A609-080027D10434","3EB0A894-60E6-E311-A609-080027D10434","1120 S Anaheim Blvd","Anaheim","CA",92805,7145550927,7145554270]
["54B0A894-60E6-E311-A609-080027D10434","3EB0A894-60E6-E311-A609-080027D10434","2121 Imperial Ave","San Diego","CA",92102,6195552742,6195550909]
["55B0A894-60E6-E311-A609-080027D10434","3EB0A894-60E6-E311-A609-080027D10434","777 Story Rd","San Jose","CA",95122,4155555678,4155555202]
["56B0A894-60E6-E311-A609-080027D10434","3EB0A894-60E6-E311-A609-080027D10434","1400 S Lamb Blvd","Las Vegas","NV",89104,7025557299,7025552794]
["57B0A894-60E6-E311-A609-080027D10434","3EB0A894-60E6-E311-A609-080027D10434","2425 E 2Nd St","Reno","NV",89502,7755550729,7755550729]
["58B0A894-60E6-E311-A609-080027D10434","3EB0A894-60E6-E311-A609-080027D10434","2770 W Evans Ave","Denver","CO",80219,3035557209,3035555792]
["59B0A894-60E6-E311-A609-080027D10434","3EB0A894-60E6-E311-A609-080027D10434","4255 Cy Ave","Casper","WY",82604,3075552790,3075550009]
["5AB0A894-60E6-E311-A609-080027D10434","3EB0A894-60E6-E311-A609-080027D10434","350 Hope Ave","Salt Lake City","UT",84115,8015557297,8015555387]
["5BB0A894-60E6-E311-A609-080027D10434","3EB0A894-60E6-E311-A609-080027D10434","1607 W Bethany Home Rd","Phoenix","AZ",85015,6235550942,6235554444]
["5CB0A894-60E6-E311-A609-080027D10434","3FB0A894-60E6-E311-A609-080027D10434","2701 Utah Ave South","Seattle","WA",98134,2064679200,2064679201]
["5DB0A894-60E6-E311-A609-080027D10434","3FB0A894-60E6-E311-A609-080027D10434","9116 N Newport Hwy","Spokane","WA",99218,2535650334,2535650333]
["5EB0A894-60E6-E311-A609-080027D10434","3FB0A894-60E6-E311-A609-080027D10434","10120 SE Washington St","Portland","OR",97216,5032618543,5032618544]
["5FB0A894-60E6-E311-A609-080027D10434","3FB0A894-60E6-E311-A609-080027D10434","1045 Green Acres Rd","Eugene","OR",97408,5416721823,5416721824]
["60B0A894-60E6-E311-A609-080027D10434","3FB0A894-60E6-E311-A609-080027D10434","5859 Antelope Rd","Sacramento","CA",95842,2092636017,2092636018]
["61B0A894-60E6-E311-A609-080027D10434","3FB0A894-60E6-E311-A609-080027D10434","3555 Sports Arena Blvd","San Diego","CA",92110,7072510162,7072510163]
["62B0A894-60E6-E311-A609-080027D10434","3FB0A894-60E6-E311-A609-080027D10434","800 N Brookhurst St","Anaheim","CA",92801,2094748285,2094748286]
["63B0A894-60E6-E311-A609-080027D10434","3FB0A894-60E6-E311-A609-080027D10434","1401 S Lamb Blvd","Las Vegas","NV",89104,7758864455,7758864455]
["64B0A894-60E6-E311-A609-080027D10434","3FB0A894-60E6-E311-A609-080027D10434","1001 Steamboat Pkwy","Reno","NV",89521,7758516000,7758516001]
["65B0A894-60E6-E311-A609-080027D10434","3FB0A894-60E6-E311-A609-080027D10434","3639 E Federal Way","Boise","ID",83705,2089397648,2089397649]
["66B0A894-60E6-E311-A609-080027D10434","40B0A894-60E6-E311-A609-080027D10434","450 N Capital Ave","San Jose","CA",95133,4082548931,4082548931]
["67B0A894-60E6-E311-A609-080027D10434","40B0A894-60E6-E311-A609-080027D10434","5600 Whittier Blvd","Los Angeles","CA",90022,5594318622,5594318622]
["68B0A894-60E6-E311-A609-080027D10434","40B0A894-60E6-E311-A609-080027D10434","4734 E Ray Rd","Phoenix","AZ",85044,9287718400,9287718401]
["69B0A894-60E6-E311-A609-080027D10434","40B0A894-60E6-E311-A609-080027D10434","5255 E Broadway Blvd","Tucson","AZ",85711,5207458001,5207458002]
["6AB0A894-60E6-E311-A609-080027D10434","40B0A894-60E6-E311-A609-080027D10434","4100 Blue Diamond Rd","Las Vegas","NV",89139,7024515959,7024515958]
["6BB0A894-60E6-E311-A609-080027D10434","40B0A894-60E6-E311-A609-080027D10434","6845 Sierra Center Pkwy","Reno","NV",89511,7758538900,7758538901]
{"$rows_left_out":174}